Log for failed build of mbr_1.1.10-2 (dist=karmic-autotest)
Build Daemon user
noreply at buildd.ubuntu.com
Tue Oct 6 07:15:14 BST 2009
Automatic build of mbr_1.1.10-2 on terranova by sbuild/i386 1.170.5
Build started at 20091006-0715
******************************************************************************
Checking available source versions...
Fetching source files...
Reading package lists...
Building dependency tree...
Reading state information...
Need to get 126kB of source archives.
Get:1 http://archive.internal karmic-autotest/main mbr 1.1.10-2 (dsc) [959B]
Get:2 http://archive.internal karmic-autotest/main mbr 1.1.10-2 (tar) [119kB]
Get:3 http://archive.internal karmic-autotest/main mbr 1.1.10-2 (diff) [6016B]
Fetched 126kB in 0s (2367kB/s)
Download complete and in download only mode
** Using build dependencies supplied by package:
Build-Depends: bin86, util-linux (>= 2.13) | linux32
Checking for already installed source dependencies...
bin86: missing
util-linux: already installed (2.16-1ubuntu4 >= 2.13 is satisfied)
Checking for source dependency conflicts...
/usr/bin/sudo /usr/bin/apt-get --purge $CHROOT_OPTIONS -q -y install bin86
Reading package lists...
Building dependency tree...
Reading state information...
The following NEW packages will be installed:
bin86
0 upgraded, 1 newly installed, 0 to remove and 1 not upgraded.
Need to get 0B/97.3kB of archives.
After this operation, 250kB of additional disk space will be used.
WARNING: The following packages cannot be authenticated!
bin86
debconf: unable to initialize frontend: Dialog
debconf: (Dialog frontend will not work on a dumb terminal, an emacs shell buffer, or without a controlling terminal.)
debconf: falling back to frontend: Readline
debconf: unable to initialize frontend: Readline
debconf: (This frontend requires a controlling tty.)
debconf: falling back to frontend: Teletype
dpkg-preconfigure: unable to re-open stdin:
Authentication warning overridden.
Selecting previously deselected package bin86.
(Reading database ... 10862 files and directories currently installed.)
Unpacking bin86 (from .../bin86_0.16.17-3ubuntu2_i386.deb) ...
Setting up bin86 (0.16.17-3ubuntu2) ...
Checking correctness of source dependencies...
Toolchain package versions: libc6-dev_2.10.1-0ubuntu13 make_3.81-6 dpkg-dev_1.15.4ubuntu2 linux-libc-dev_2.6.31-11.38 g++-4.4_4.4.1-4ubuntu6 gcc-4.4_4.4.1-4ubuntu6 binutils_2.19.91.20091001-0ubuntu2 libstdc++6_4.4.1-4ubuntu6 libstdc++6-4.4-dev_4.4.1-4ubuntu6
------------------------------------------------------------------------------
sh: gcc: not found
dpkg-source: warning: Couldn't determine gcc system type, falling back to default (native compilation)
gpg: Signature made Fri Dec 26 23:58:57 2008 GMT using DSA key ID F6A32A8E
gpg: Can't check signature: public key not found
dpkg-source: extracting mbr in mbr-1.1.10
dpkg-source: unpacking mbr_1.1.10.orig.tar.gz
dpkg-source: applying /home/buildd/build-karmic-autotest/mbr_1.1.10-2.diff.gz
dpkg-buildpackage: set CFLAGS to default value: -g -O2
dpkg-buildpackage: set CPPFLAGS to default value:
dpkg-buildpackage: set LDFLAGS to default value: -Wl,-Bsymbolic-functions
dpkg-buildpackage: set FFLAGS to default value: -g -O2
dpkg-buildpackage: set CXXFLAGS to default value: -g -O2
dpkg-buildpackage: source package mbr
dpkg-buildpackage: source version 1.1.10-2
dpkg-buildpackage: host architecture i386
/usr/bin/fakeroot debian/rules clean
test -f mbr.S86 -a -f debian/rules
rm -f build
/usr/bin/make distclean
make[1]: Entering directory `/build/buildd/mbr-1.1.10'
make[1]: *** No rule to make target `distclean'. Stop.
make[1]: Leaving directory `/build/buildd/mbr-1.1.10'
make: [clean] Error 2 (ignored)
rm -f harness/Makefile
rm -f `find . -name "*~"`
rm -rf debian/tmp debian/files* core debian/substvars
debian/rules build
test -f mbr.S86 -a -f debian/rules
./configure --prefix=/
checking for a BSD-compatible install... /usr/bin/install -c
checking whether build environment is sane... yes
checking whether make sets $(MAKE)... yes
checking for working aclocal-1.4... missing
checking for working autoconf... missing
checking for working automake-1.4... missing
checking for working autoheader... missing
checking for working makeinfo... missing
checking whether to enable maintainer-specific portions of Makefiles... no
checking for gcc... gcc
checking for C compiler default output file name... a.out
checking whether the C compiler works... yes
checking whether we are cross compiling... no
checking for suffix of executables...
checking for suffix of object files... o
checking whether we are using the GNU C compiler... yes
checking whether gcc accepts -g... yes
checking for gcc option to accept ISO C89... none needed
configure: creating ./config.status
config.status: creating wraptest
config.status: creating Makefile
config.status: WARNING: Makefile.in seems to ignore the --datarootdir setting
config.status: creating harness/Makefile
config.status: WARNING: harness/Makefile.in seems to ignore the --datarootdir setting
/usr/bin/make CC="gcc -D_LARGEFILE64_SOURCE -D_FILE_OFFSET_BITS=64" LD="ld" CFLAGS="-g -Wall -W -O2"
make[1]: Entering directory `/build/buildd/mbr-1.1.10'
Making all in harness
make[2]: Entering directory `/build/buildd/mbr-1.1.10/harness'
gcc -D_LARGEFILE64_SOURCE -D_FILE_OFFSET_BITS=64 -DPACKAGE_NAME=\"\" -DPACKAGE_TARNAME=\"\" -DPACKAGE_VERSION=\"\" -DPACKAGE_STRING=\"\" -DPACKAGE_BUGREPORT=\"\" -DPACKAGE=\"mbr\" -DVERSION=\"1.1.10\" -I. -I. -Wall -Wstrict-prototypes -Wmissing-prototypes -g -m32 -g -Wall -W -O2 -c args.c
gcc -D_LARGEFILE64_SOURCE -D_FILE_OFFSET_BITS=64 -DPACKAGE_NAME=\"\" -DPACKAGE_TARNAME=\"\" -DPACKAGE_VERSION=\"\" -DPACKAGE_STRING=\"\" -DPACKAGE_BUGREPORT=\"\" -DPACKAGE=\"mbr\" -DVERSION=\"1.1.10\" -I. -I. -Wall -Wstrict-prototypes -Wmissing-prototypes -g -m32 -g -Wall -W -O2 -c bios.c
gcc -D_LARGEFILE64_SOURCE -D_FILE_OFFSET_BITS=64 -DPACKAGE_NAME=\"\" -DPACKAGE_TARNAME=\"\" -DPACKAGE_VERSION=\"\" -DPACKAGE_STRING=\"\" -DPACKAGE_BUGREPORT=\"\" -DPACKAGE=\"mbr\" -DVERSION=\"1.1.10\" -I. -I. -Wall -Wstrict-prototypes -Wmissing-prototypes -g -m32 -g -Wall -W -O2 -c event.c
event.c:25: warning: missing initializer
event.c:25: warning: (near initialization for 'event_queue.tail')
event.c:26: warning: missing initializer
event.c:26: warning: (near initialization for 'key_event_queue.tail')
gcc -D_LARGEFILE64_SOURCE -D_FILE_OFFSET_BITS=64 -DPACKAGE_NAME=\"\" -DPACKAGE_TARNAME=\"\" -DPACKAGE_VERSION=\"\" -DPACKAGE_STRING=\"\" -DPACKAGE_BUGREPORT=\"\" -DPACKAGE=\"mbr\" -DVERSION=\"1.1.10\" -I. -I. -Wall -Wstrict-prototypes -Wmissing-prototypes -g -m32 -g -Wall -W -O2 -c harness.c
gcc -D_LARGEFILE64_SOURCE -D_FILE_OFFSET_BITS=64 -DPACKAGE_NAME=\"\" -DPACKAGE_TARNAME=\"\" -DPACKAGE_VERSION=\"\" -DPACKAGE_STRING=\"\" -DPACKAGE_BUGREPORT=\"\" -DPACKAGE=\"mbr\" -DVERSION=\"1.1.10\" -I. -I. -Wall -Wstrict-prototypes -Wmissing-prototypes -g -m32 -g -Wall -W -O2 -c mbr.c
gcc -D_LARGEFILE64_SOURCE -D_FILE_OFFSET_BITS=64 -DPACKAGE_NAME=\"\" -DPACKAGE_TARNAME=\"\" -DPACKAGE_VERSION=\"\" -DPACKAGE_STRING=\"\" -DPACKAGE_BUGREPORT=\"\" -DPACKAGE=\"mbr\" -DVERSION=\"1.1.10\" -I. -I. -Wall -Wstrict-prototypes -Wmissing-prototypes -g -m32 -g -Wall -W -O2 -c output.c
gcc -D_LARGEFILE64_SOURCE -D_FILE_OFFSET_BITS=64 -DPACKAGE_NAME=\"\" -DPACKAGE_TARNAME=\"\" -DPACKAGE_VERSION=\"\" -DPACKAGE_STRING=\"\" -DPACKAGE_BUGREPORT=\"\" -DPACKAGE=\"mbr\" -DVERSION=\"1.1.10\" -I. -I. -Wall -Wstrict-prototypes -Wmissing-prototypes -g -m32 -g -Wall -W -O2 -c process.c
process.c: In function 'process_init':
process.c:13: warning: missing initializer
process.c:13: warning: (near initialization for 'limit.rlim_max')
process.c:41: warning: comparison between signed and unsigned integer expressions
process.c: In function 'set_cpu_limit':
process.c:55: warning: missing initializer
process.c:55: warning: (near initialization for 'limit.rlim_max')
gcc -D_LARGEFILE64_SOURCE -D_FILE_OFFSET_BITS=64 -DPACKAGE_NAME=\"\" -DPACKAGE_TARNAME=\"\" -DPACKAGE_VERSION=\"\" -DPACKAGE_STRING=\"\" -DPACKAGE_BUGREPORT=\"\" -DPACKAGE=\"mbr\" -DVERSION=\"1.1.10\" -I. -I. -Wall -Wstrict-prototypes -Wmissing-prototypes -g -m32 -g -Wall -W -O2 -c time.c
gcc -D_LARGEFILE64_SOURCE -D_FILE_OFFSET_BITS=64 -DPACKAGE_NAME=\"\" -DPACKAGE_TARNAME=\"\" -DPACKAGE_VERSION=\"\" -DPACKAGE_STRING=\"\" -DPACKAGE_BUGREPORT=\"\" -DPACKAGE=\"mbr\" -DVERSION=\"1.1.10\" -I. -I. -Wall -Wstrict-prototypes -Wmissing-prototypes -g -m32 -g -Wall -W -O2 -c vm86.c
vm86.c:9: warning: missing initializer
vm86.c:9: warning: (near initialization for 'v86.regs')
vm86.c: In function 'segv_handler':
vm86.c:61: warning: unused parameter 'i'
vm86.c: In function 'vm86_run':
vm86.c:81: warning: missing initializer
vm86.c:81: warning: (near initialization for 'new_segv.__sigaction_handler')
gcc -D_LARGEFILE64_SOURCE -D_FILE_OFFSET_BITS=64 -Wall -Wstrict-prototypes -Wmissing-prototypes -g -m32 -g -Wall -W -O2 -Wl,-Bsymbolic-functions -o harness args.o bios.o event.o harness.o mbr.o output.o process.o time.o vm86.o
make[2]: Leaving directory `/build/buildd/mbr-1.1.10/harness'
make[2]: Entering directory `/build/buildd/mbr-1.1.10'
gcc -D_LARGEFILE64_SOURCE -D_FILE_OFFSET_BITS=64 -DPACKAGE_NAME=\"\" -DPACKAGE_TARNAME=\"\" -DPACKAGE_VERSION=\"\" -DPACKAGE_STRING=\"\" -DPACKAGE_BUGREPORT=\"\" -DPACKAGE=\"mbr\" -DVERSION=\"1.1.10\" -I. -I. -Wall -Wstrict-prototypes -Wmissing-prototypes -g -Wall -W -O2 -c install-mbr.c
install-mbr.c: In function 'main':
install-mbr.c:1421: warning: missing initializer
install-mbr.c:1421: warning: (near initialization for 'my_data.changes.y2k_month')
gcc -D_LARGEFILE64_SOURCE -D_FILE_OFFSET_BITS=64 -E -xc mbr.S86 -o mbr.s86.tmp && mv mbr.s86.tmp mbr.s86
as86 -0 -b mbr.b.tmp -s mbr.sym -l mbr.lst mbr.s86 && mv mbr.b.tmp mbr.b
ld -r -b binary -o mbr.o mbr.b
gcc -D_LARGEFILE64_SOURCE -D_FILE_OFFSET_BITS=64 -DY2KBUG -E -xc mbr.S86 -o y2k.s86.tmp && mv y2k.s86.tmp y2k.s86
as86 -0 -b y2k.b.tmp -s y2k.sym -l y2k.lst y2k.s86 && mv y2k.b.tmp y2k.b
ld -r -b binary -o y2k.o y2k.b
gcc -D_LARGEFILE64_SOURCE -D_FILE_OFFSET_BITS=64 -Wall -Wstrict-prototypes -Wmissing-prototypes -g -Wall -W -O2 -Wl,-Bsymbolic-functions -o install-mbr install-mbr.o mbr.o y2k.o
gcc -D_LARGEFILE64_SOURCE -D_FILE_OFFSET_BITS=64 -DTESTDISK -E -xc mbr.S86 -o testdisk.s86.tmp && mv testdisk.s86.tmp testdisk.s86
as86 -0 -b testdisk.b.tmp -s testdisk.sym -l testdisk.lst testdisk.s86 && mv testdisk.b.tmp testdisk.b
rm mbr.s86
make[2]: Leaving directory `/build/buildd/mbr-1.1.10'
make[1]: Leaving directory `/build/buildd/mbr-1.1.10'
/usr/bin/make check-TESTS
make[1]: Entering directory `/build/buildd/mbr-1.1.10'
gcc -E -xc table.S86 -o table.s86.tmp && mv table.s86.tmp table.s86
as86 -0 -b table.b.tmp -s table.sym -l table.lst table.s86 && mv table.b.tmp table.b
PASS: tests/inst-1
PASS: tests/inst-3
PASS: tests/inst-4
PASS: tests/inst-6
PASS: tests/inst-7
PASS: tests/inst-8
Failed to claim V86 area: Permission denied
FAIL: tests/mbr-1
Failed to claim V86 area: Permission denied
FAIL: tests/mbr-2
Failed to claim V86 area: Permission denied
FAIL: tests/mbr-3
Failed to claim V86 area: Permission denied
FAIL: tests/mbr-4
Failed to claim V86 area: Permission denied
FAIL: tests/mbr-5
Failed to claim V86 area: Permission denied
FAIL: tests/mbr-6
Failed to claim V86 area: Permission denied
FAIL: tests/testdisk-1
Failed to claim V86 area: Permission denied
FAIL: tests/testdisk-2
Failed to claim V86 area: Permission denied
FAIL: tests/testdisk-3
Failed to claim V86 area: Permission denied
FAIL: tests/testdisk-4
Failed to claim V86 area: Permission denied
FAIL: tests/testdisk-5
Failed to claim V86 area: Permission denied
FAIL: tests/testdisk-6
=====================
12 of 18 tests failed
=====================
make[1]: *** [check-TESTS] Error 1
rm table.s86
make[1]: Leaving directory `/build/buildd/mbr-1.1.10'
make: *** [build] Error 2
dpkg-buildpackage: error: debian/rules build gave error exit status 2
******************************************************************************
Build finished at 20091006-0715
FAILED [dpkg-buildpackage died]
Purging chroot-karmic-autotest/build/buildd/mbr-1.1.10
------------------------------------------------------------------------------
/usr/bin/sudo dpkg --root=/home/buildd/build-karmic-autotest/chroot-karmic-autotest --purge bin86
(Reading database ... 10882 files and directories currently installed.)
Removing bin86 ...
******************************************************************************
Finished at 20091006-0715
Build needed 00:00:05, 1056k disk space
More information about the ubuntu-autotest
mailing list