Log for failed build of debhelper_7.3.15ubuntu2 (dist=karmic-autotest)

Build Daemon user noreply at buildd.ubuntu.com
Mon Oct 5 18:19:42 BST 2009


Automatic build of debhelper_7.3.15ubuntu2 on terranova by sbuild/i386 1.170.5
Build started at 20091005-1818
******************************************************************************
Checking available source versions...
Fetching source files...
Reading package lists...
Building dependency tree...
Reading state information...
NOTICE: 'debhelper' packaging is maintained in the 'Git' version control system at:
git://git.debian.org/git/debhelper/debhelper.git
Need to get 324kB of source archives.
Get:1 http://archive.internal karmic-autotest/main debhelper 7.3.15ubuntu2 (dsc) [1025B]
Get:2 http://archive.internal karmic-autotest/main debhelper 7.3.15ubuntu2 (tar) [323kB]
Fetched 324kB in 0s (13.2MB/s)
Download complete and in download only mode
** Using build dependencies supplied by package:
Build-Depends: po4a (>= 0.24), man-db (>= 2.5.1), file (>= 3.23)
Checking for already installed source dependencies...
po4a: missing
man-db: missing
file: missing
Checking for source dependency conflicts...
  /usr/bin/sudo /usr/bin/apt-get --purge $CHROOT_OPTIONS -q -y install po4a man-db file
Reading package lists...
Building dependency tree...
Reading state information...
The following extra packages will be installed:
  bsdmainutils gettext gettext-base groff-base libcroco3 libglib2.0-0
  libmagic1 libpcre3 libsgmls-perl libsp1c2 libxml2 sp
Suggested packages:
  wamerican wordlist whois vacation cvs gettext-doc groff sgmlspl sgmls-doc
  less www-browser doc-base sgml-data
Recommended packages:
  curl wget lynx libglib2.0-data shared-mime-info xml-core
  libterm-readkey-perl
The following NEW packages will be installed:
  bsdmainutils file gettext gettext-base groff-base libcroco3 libglib2.0-0
  libmagic1 libpcre3 libsgmls-perl libsp1c2 libxml2 man-db po4a sp
0 upgraded, 15 newly installed, 0 to remove and 1 not upgraded.
Need to get 0B/9387kB of archives.
After this operation, 30.8MB of additional disk space will be used.
WARNING: The following packages cannot be authenticated!
  libmagic1 file libpcre3 libglib2.0-0 libxml2 bsdmainutils gettext-base
  groff-base man-db libcroco3 gettext libsgmls-perl libsp1c2 sp po4a
debconf: unable to initialize frontend: Dialog
debconf: (Dialog frontend will not work on a dumb terminal, an emacs shell buffer, or without a controlling terminal.)
debconf: falling back to frontend: Readline
debconf: unable to initialize frontend: Readline
debconf: (This frontend requires a controlling tty.)
debconf: falling back to frontend: Teletype
dpkg-preconfigure: unable to re-open stdin: 
Authentication warning overridden.
Selecting previously deselected package libmagic1.
(Reading database ... 10860 files and directories currently installed.)
Unpacking libmagic1 (from .../libmagic1_5.03-1ubuntu1_i386.deb) ...
Selecting previously deselected package file.
Unpacking file (from .../file_5.03-1ubuntu1_i386.deb) ...
Selecting previously deselected package libpcre3.
Unpacking libpcre3 (from .../libpcre3_7.8-2ubuntu1_i386.deb) ...
Selecting previously deselected package libglib2.0-0.
Unpacking libglib2.0-0 (from .../libglib2.0-0_2.22.1-0ubuntu1_i386.deb) ...
Selecting previously deselected package libxml2.
Unpacking libxml2 (from .../libxml2_2.7.3.dfsg-1ubuntu2_i386.deb) ...
Selecting previously deselected package bsdmainutils.
Unpacking bsdmainutils (from .../bsdmainutils_6.1.10ubuntu4_i386.deb) ...
Selecting previously deselected package gettext-base.
Unpacking gettext-base (from .../gettext-base_0.17-6ubuntu2_i386.deb) ...
Selecting previously deselected package groff-base.
Unpacking groff-base (from .../groff-base_1.20.1-5_i386.deb) ...
Selecting previously deselected package man-db.
Unpacking man-db (from .../man-db_2.5.6-2_i386.deb) ...
Selecting previously deselected package libcroco3.
Unpacking libcroco3 (from .../libcroco3_0.6.1-2_i386.deb) ...
Selecting previously deselected package gettext.
Unpacking gettext (from .../gettext_0.17-6ubuntu2_i386.deb) ...
Selecting previously deselected package libsgmls-perl.
Unpacking libsgmls-perl (from .../libsgmls-perl_1.03ii-32_all.deb) ...
Selecting previously deselected package libsp1c2.
Unpacking libsp1c2 (from .../libsp1c2_1.3.4-1.2.1-47build2_i386.deb) ...
Selecting previously deselected package sp.
Unpacking sp (from .../sp_1.3.4-1.2.1-47build2_i386.deb) ...
Selecting previously deselected package po4a.
Unpacking po4a (from .../archives/po4a_0.36.1-1_all.deb) ...
Setting up libmagic1 (5.03-1ubuntu1) ...

Setting up file (5.03-1ubuntu1) ...
Setting up libpcre3 (7.8-2ubuntu1) ...

Setting up libglib2.0-0 (2.22.1-0ubuntu1) ...

Setting up libxml2 (2.7.3.dfsg-1ubuntu2) ...

Setting up bsdmainutils (6.1.10ubuntu4) ...
update-alternatives: using /usr/bin/bsd-write to provide /usr/bin/write (write) in auto mode.

Setting up gettext-base (0.17-6ubuntu2) ...

Setting up groff-base (1.20.1-5) ...

Setting up man-db (2.5.6-2) ...
Building database of manual pages ...
... skipping, since this is a buildd

Setting up libcroco3 (0.6.1-2) ...

Setting up gettext (0.17-6ubuntu2) ...
install-info: warning: maintainer scripts should not call install-info anymore,
install-info: warning: this is handled now by a dpkg trigger provided by the
install-info: warning: install-info package; package gettext should be updated.

Setting up libsgmls-perl (1.03ii-32) ...
Setting up libsp1c2 (1.3.4-1.2.1-47build2) ...

Setting up sp (1.3.4-1.2.1-47build2) ...
Setting up po4a (0.36.1-1) ...
Processing triggers for libc-bin ...
ldconfig deferred processing now taking place
Checking correctness of source dependencies...
Toolchain package versions: libc6-dev_2.10.1-0ubuntu13 make_3.81-6 dpkg-dev_1.15.4ubuntu2 linux-libc-dev_2.6.31-11.38 g++-4.4_4.4.1-4ubuntu6 gcc-4.4_4.4.1-4ubuntu6 binutils_2.19.91.20091001-0ubuntu2 libstdc++6_4.4.1-4ubuntu6 libstdc++6-4.4-dev_4.4.1-4ubuntu6
------------------------------------------------------------------------------
sh: gcc: not found
dpkg-source: warning: Couldn't determine gcc system type, falling back to default (native compilation)
gpg: Signature made Tue Sep 15 03:32:39 2009 BST using DSA key ID C978C8AE
gpg: Can't check signature: public key not found
dpkg-source: extracting debhelper in debhelper-7.3.15ubuntu2
dpkg-source: unpacking debhelper_7.3.15ubuntu2.tar.gz
dpkg-buildpackage: set CFLAGS to default value: -g -O2
dpkg-buildpackage: set CPPFLAGS to default value: 
dpkg-buildpackage: set LDFLAGS to default value: -Wl,-Bsymbolic-functions
dpkg-buildpackage: set FFLAGS to default value: -g -O2
dpkg-buildpackage: set CXXFLAGS to default value: -g -O2
dpkg-buildpackage: source package debhelper
dpkg-buildpackage: source version 7.3.15ubuntu2
dpkg-buildpackage: host architecture i386
 /usr/bin/fakeroot debian/rules clean
./run dh clean
   dh_testdir
   dh_auto_clean
make[1]: Entering directory `/build/buildd/debhelper-7.3.15ubuntu2'
rm -f *.1 *.7 Debian/Debhelper/Dh_Version.pm
po4a --rm-translations --rm-backups man/po4a/po4a.cfg
for lang in es fr; do \
		if [ -e man/$lang ]; then rmdir man/$lang; fi; \
	done;
make[1]: Leaving directory `/build/buildd/debhelper-7.3.15ubuntu2'
   dh_clean
 debian/rules build
./run dh build
   dh_testdir
   dh_auto_configure
   dh_auto_build
make[1]: Entering directory `/build/buildd/debhelper-7.3.15ubuntu2'
printf "package Debian::Debhelper::Dh_Version;\n\$version='7.3.15ubuntu2';\n1" > \
		Debian/Debhelper/Dh_Version.pm
find . -maxdepth 1 -type f -perm +100 -name "dh*" \
		-exec pod2man --utf8 -c Debhelper -r "7.3.15ubuntu2" {} {}.1 \;
cat debhelper.pod | \
		perl -e ' undef $/; foreach (@ARGV) { open (IN, $_) or die "$_: $!"; $file=<IN>; close IN; if ($file=~m/=head1 .*?\n\n(.*?) - (.*?)\n\n/s) { $collect.="=item $1(1)\n\n$2\n\n"; } } END { while (<STDIN>) { s/#LIST#/$collect/; print; }; }' `find . -maxdepth 1 -type f -perm +100 -name "dh_*" | sort` | \
		pod2man --utf8 -c Debhelper -r "7.3.15ubuntu2" --name="debhelper" --section=7  > debhelper.7
po4a -L UTF-8 man/po4a/po4a.cfg 
Discard man/es/debhelper.pod (131 of 173 strings; only 75.72% translated; need 80%).
Discard man/es/dh_clean.pod (18 of 23 strings; only 78.26% translated; need 80%).
Discard man/es/dh_desktop.pod (8 of 11 strings; only 72.72% translated; need 80%).
Discard man/es/dh_gconf.pod (10 of 18 strings; only 55.55% translated; need 80%).
Discard man/es/dh_installinit.pod (24 of 46 strings; only 52.17% translated; need 80%).
Discard man/es/dh_installmodules.pod (15 of 22 strings; only 68.18% translated; need 80%).
Discard man/es/dh_shlibdeps.pod (23 of 30 strings; only 76.66% translated; need 80%).
Discard man/fr/debhelper.pod (134 of 173 strings; only 77.45% translated; need 80%).
Discard man/fr/dh_clean.pod (18 of 23 strings; only 78.26% translated; need 80%).
Discard man/fr/dh_desktop.pod (8 of 11 strings; only 72.72% translated; need 80%).
Discard man/fr/dh_installinit.pod (26 of 46 strings; only 56.52% translated; need 80%).
Discard man/fr/dh_installmodules.pod (17 of 22 strings; only 77.27% translated; need 80%).
Discard man/fr/dh_shlibdeps.pod (23 of 30 strings; only 76.66% translated; need 80%).
set -e; \
	for lang in es fr; do \
		dir=man/$lang; \
		for file in $dir/dh*.pod; do \
			prog=`basename $file | sed 's/.pod//'`; \
			pod2man --utf8 -c Debhelper -r "7.3.15ubuntu2" $file $prog.$lang.1; \
		done; \
		if [ -e $dir/debhelper.pod ]; then \
			cat $dir/debhelper.pod | \
				perl -e ' undef $/; foreach (@ARGV) { open (IN, $_) or die "$_: $!"; $file=<IN>; close IN; if ($file=~m/=head1 .*?\n\n(.*?) - (.*?)\n\n/s) { $collect.="=item $1(1)\n\n$2\n\n"; } } END { while (<STDIN>) { s/#LIST#/$collect/; print; }; }' `find $dir -type f -maxdepth 1 -name "dh_*.pod" | sort` | \
				pod2man --utf8 -c Debhelper -r "7.3.15ubuntu2" --name="debhelper" --section=7 > debhelper.$lang.7; \
		fi; \
	done
make[1]: Leaving directory `/build/buildd/debhelper-7.3.15ubuntu2'
   dh_auto_test
make[1]: Entering directory `/build/buildd/debhelper-7.3.15ubuntu2'
printf "package Debian::Debhelper::Dh_Version;\n\$version='7.3.15ubuntu2';\n1" > \
		Debian/Debhelper/Dh_Version.pm
./run perl -MTest::Harness -e 'runtests grep { ! /CVS/ && ! /\.svn/ && -f && -x } @ARGV' t/* t/buildsystems/*
t/dh_install.......................ok
t/dh_link..........................ok
t/override_target..................ok
t/pod..............................skipped
        all skipped: Test::Pod required
t/size.............................ok
t/syntax...........................ok
t/buildsystems/buildsystem_tests...ok
All tests successful, 1 test skipped.
Files=7, Tests=446,  9 wallclock secs ( 6.03 cusr +  1.75 csys =  7.78 CPU)
# clean up log etc
./run dh_clean
make[1]: Leaving directory `/build/buildd/debhelper-7.3.15ubuntu2'
 /usr/bin/fakeroot debian/rules binary
./run dh binary
   dh_testroot
   dh_prep
   dh_installdirs
   dh_auto_install
make[1]: Entering directory `/build/buildd/debhelper-7.3.15ubuntu2'
install -d /build/buildd/debhelper-7.3.15ubuntu2/debian/debhelper/usr/bin \
		/build/buildd/debhelper-7.3.15ubuntu2/debian/debhelper/usr/share/debhelper/autoscripts \
		/build/buildd/debhelper-7.3.15ubuntu2/debian/debhelper/usr/share/perl5/Debian/Debhelper/Sequence \
		/build/buildd/debhelper-7.3.15ubuntu2/debian/debhelper/usr/share/perl5/Debian/Debhelper/Buildsystem
install ./dh_makeshlibs ./dh_installwm ./dh_strip ./dh_usrlocal ./dh_auto_clean ./dh_lintian ./dh_auto_build ./dh_scrollkeeper ./dh_installdirs ./dh_gencontrol ./dh_installmanpages ./dh_installemacsen ./dh_install ./dh_perl ./dh_desktop ./dh_clean ./dh_installinit ./dh_installxfonts ./dh_installchangelogs ./dh_gconf ./dh_installpam ./dh_prep ./dh_builddeb ./dh_python ./dh_installmime ./dh_installdocs ./dh_installcron ./dh_installifupdown ./dh_installppp ./dh_installdeb ./dh_installdebconf ./dh_installudev ./dh_installinfo ./dh_compress ./dh_listpackages ./dh_fixperms ./dh_auto_test ./dh_testroot ./dh_installcatalogs ./dh_installlogcheck ./dh_installmodules ./dh_installexamples ./dh_link ./dh_installman ./dh_bugfiles ./dh_suidregister ./dh_auto_install ./dh_movefiles ./dh_icons ./dh ./dh_testdir ./dh_shlibdeps ./dh_installmenu ./dh_undocumented ./dh_auto_configure ./dh_installlogrotate ./dh_md5sums ./dh_testversion /build/buildd/debhelper-7.3.15ubuntu2/debian/debhelper/usr/bin
install -m 0644 autoscripts/* /build/buildd/debhelper-7.3.15ubuntu2/debian/debhelper/usr/share/debhelper/autoscripts
install -m 0644 Debian/Debhelper/*.pm /build/buildd/debhelper-7.3.15ubuntu2/debian/debhelper/usr/share/perl5/Debian/Debhelper
install -m 0644 Debian/Debhelper/Sequence/*.pm /build/buildd/debhelper-7.3.15ubuntu2/debian/debhelper/usr/share/perl5/Debian/Debhelper/Sequence
install -m 0644 Debian/Debhelper/Buildsystem/*.pm /build/buildd/debhelper-7.3.15ubuntu2/debian/debhelper/usr/share/perl5/Debian/Debhelper/Buildsystem
make[1]: Leaving directory `/build/buildd/debhelper-7.3.15ubuntu2'
   dh_install
   dh_installdocs
   dh_installchangelogs
   dh_installexamples
   dh_installman
   dh_installcatalogs
   dh_installcron
   dh_installdebconf
   dh_installcatalogs
   dh_installemacsen
   dh_installifupdown
   dh_installinfo
   dh_installinit
   dh_installmenu
   dh_installmime
   dh_installmodules
   dh_installlogcheck
   dh_installlogrotate
   dh_installpam
   dh_installppp
   dh_installudev
   dh_installwm
   dh_installxfonts
   dh_bugfiles
   dh_lintian
   dh_gconf
   dh_icons
   dh_perl
   dh_pysupport
Traceback (most recent call last):
  File "/usr/share/python-support/private/movemodules", line 9, in <module>
    from hashlib import md5
  File "/usr/lib/python2.6/hashlib.py", line 136, in <module>
    md5 = __get_builtin_constructor('md5')
  File "/usr/lib/python2.6/hashlib.py", line 63, in __get_builtin_constructor
    import _md5
ImportError: No module named _md5
dh_pysupport: /usr/share/python-support/private/movemodules returned exit code 1
make: *** [binary] Error 1
dpkg-buildpackage: error: /usr/bin/fakeroot debian/rules binary gave error exit status 2
******************************************************************************
Build finished at 20091005-1819
FAILED [dpkg-buildpackage died]
Purging chroot-karmic-autotest/build/buildd/debhelper-7.3.15ubuntu2
------------------------------------------------------------------------------
  /usr/bin/sudo dpkg --root=/home/buildd/build-karmic-autotest/chroot-karmic-autotest --purge sp groff-base libsgmls-perl libglib2.0-0 libcroco3 po4a libmagic1 gettext file libxml2 bsdmainutils libsp1c2 libpcre3 gettext-base man-db
(Reading database ... 11865 files and directories currently installed.)
Removing po4a ...
Removing gettext ...
install-info: warning: maintainer scripts should not call install-info anymore,
install-info: warning: this is handled now by a dpkg trigger provided by the
install-info: warning: install-info package; package gettext should be updated.
Removing file ...
Purging configuration files for file ...
Removing gettext-base ...
Removing man-db ...
Purging configuration files for man-db ...
  Removing catpages as well as /var/cache/man hierarchy.
dpkg - warning: while removing man-db, directory `/usr/lib/man-db' not empty so not removed.
dpkg - warning: while removing man-db, directory `/usr/share/bug/man-db' not empty so not removed.
dpkg - warning: while removing man-db, directory `/usr/share/doc/man-db/examples' not empty so not removed.
dpkg - warning: while removing man-db, directory `/usr/share/doc/man-db' not empty so not removed.
dpkg - warning: while removing man-db, directory `/usr/share/man/id/man5' not empty so not removed.
dpkg - warning: while removing man-db, directory `/usr/share/man-db' not empty so not removed.
Removing sp ...
Removing groff-base ...
Purging configuration files for groff-base ...
Removing libsgmls-perl ...
Removing libcroco3 ...
Purging configuration files for libcroco3 ...
Removing libmagic1 ...
Purging configuration files for libmagic1 ...
Removing libxml2 ...
Purging configuration files for libxml2 ...
Removing bsdmainutils ...
Purging configuration files for bsdmainutils ...
Removing libsp1c2 ...
Purging configuration files for libsp1c2 ...
Removing libglib2.0-0 ...
Purging configuration files for libglib2.0-0 ...
Removing libpcre3 ...
Purging configuration files for libpcre3 ...
Processing triggers for libc-bin ...
ldconfig deferred processing now taking place
******************************************************************************
Finished at 20091005-1819
Build needed 00:00:38, 4640k disk space




More information about the ubuntu-autotest mailing list