Log for failed build of ilmbase_1.0.1-3 (dist=karmic-autotest)
Build Daemon user
noreply at buildd.ubuntu.com
Sun Oct 4 05:57:45 BST 2009
Automatic build of ilmbase_1.0.1-3 on vivies by sbuild/sparc 1.170.5
Build started at 20091004-0554
******************************************************************************
Checking available source versions...
Fetching source files...
Reading package lists...
Building dependency tree...
Reading state information...
NOTICE: 'ilmbase' packaging is maintained in the 'Git' version control system at:
git://git.debian.org/git/pkg-phototools/ilmbase.git
Need to get 468kB of source archives.
Get:1 http://ftpmaster.internal karmic/main ilmbase 1.0.1-3 (dsc) [1235B]
Get:2 http://ftpmaster.internal karmic/main ilmbase 1.0.1-3 (tar) [463kB]
Get:3 http://ftpmaster.internal karmic/main ilmbase 1.0.1-3 (diff) [3846B]
Fetched 468kB in 0s (6031kB/s)
Download complete and in download only mode
** Using build dependencies supplied by package:
Build-Depends: autotools-dev, debhelper (>= 7.0.50), quilt
Checking for already installed source dependencies...
autotools-dev: missing
debhelper: missing
quilt: missing
Checking for source dependency conflicts...
/usr/bin/sudo /usr/bin/apt-get --purge $CHROOT_OPTIONS -q -y install autotools-dev debhelper quilt
Reading package lists...
Building dependency tree...
Reading state information...
The following extra packages will be installed:
bsdmainutils diffstat file gettext gettext-base groff-base html2text
intltool-debian libcroco3 libglib2.0-0 libmagic1 libpcre3 libxml2 man-db
po-debconf
Suggested packages:
wamerican wordlist whois vacation dh-make cvs gettext-doc groff less
www-browser libmail-box-perl procmail graphviz
Recommended packages:
curl wget lynx libglib2.0-data shared-mime-info xml-core
libmail-sendmail-perl
The following NEW packages will be installed:
autotools-dev bsdmainutils debhelper diffstat file gettext gettext-base
groff-base html2text intltool-debian libcroco3 libglib2.0-0 libmagic1
libpcre3 libxml2 man-db po-debconf quilt
0 upgraded, 18 newly installed, 0 to remove and 0 not upgraded.
Need to get 0B/8149kB of archives.
After this operation, 27.4MB of additional disk space will be used.
WARNING: The following packages cannot be authenticated!
libmagic1 file libpcre3 libglib2.0-0 libxml2 bsdmainutils gettext-base
groff-base man-db autotools-dev html2text libcroco3 gettext intltool-debian
po-debconf debhelper diffstat quilt
debconf: unable to initialize frontend: Dialog
debconf: (Dialog frontend will not work on a dumb terminal, an emacs shell buffer, or without a controlling terminal.)
debconf: falling back to frontend: Readline
debconf: unable to initialize frontend: Readline
debconf: (This frontend requires a controlling tty.)
debconf: falling back to frontend: Teletype
dpkg-preconfigure: unable to re-open stdin:
Authentication warning overridden.
Selecting previously deselected package libmagic1.
(Reading database ... 10952 files and directories currently installed.)
Unpacking libmagic1 (from .../libmagic1_5.03-1ubuntu1_sparc.deb) ...
Selecting previously deselected package file.
Unpacking file (from .../file_5.03-1ubuntu1_sparc.deb) ...
Selecting previously deselected package libpcre3.
Unpacking libpcre3 (from .../libpcre3_7.8-2ubuntu1_sparc.deb) ...
Selecting previously deselected package libglib2.0-0.
Unpacking libglib2.0-0 (from .../libglib2.0-0_2.22.1-0ubuntu1_sparc.deb) ...
Selecting previously deselected package libxml2.
Unpacking libxml2 (from .../libxml2_2.7.3.dfsg-1ubuntu2_sparc.deb) ...
Selecting previously deselected package bsdmainutils.
Unpacking bsdmainutils (from .../bsdmainutils_6.1.10ubuntu4_sparc.deb) ...
Selecting previously deselected package gettext-base.
Unpacking gettext-base (from .../gettext-base_0.17-6ubuntu2_sparc.deb) ...
Selecting previously deselected package groff-base.
Unpacking groff-base (from .../groff-base_1.20.1-5_sparc.deb) ...
Selecting previously deselected package man-db.
Unpacking man-db (from .../man-db_2.5.6-2_sparc.deb) ...
Selecting previously deselected package autotools-dev.
Unpacking autotools-dev (from .../autotools-dev_20090427.1_all.deb) ...
Selecting previously deselected package html2text.
Unpacking html2text (from .../html2text_1.3.2a-14_sparc.deb) ...
Selecting previously deselected package libcroco3.
Unpacking libcroco3 (from .../libcroco3_0.6.1-2_sparc.deb) ...
Selecting previously deselected package gettext.
Unpacking gettext (from .../gettext_0.17-6ubuntu2_sparc.deb) ...
Selecting previously deselected package intltool-debian.
Unpacking intltool-debian (from .../intltool-debian_0.35.0+20060710.1_all.deb) ...
Selecting previously deselected package po-debconf.
Unpacking po-debconf (from .../po-debconf_1.0.16_all.deb) ...
Selecting previously deselected package debhelper.
Unpacking debhelper (from .../debhelper_7.3.15ubuntu3_all.deb) ...
Selecting previously deselected package diffstat.
Unpacking diffstat (from .../diffstat_1.47-1_sparc.deb) ...
Selecting previously deselected package quilt.
Unpacking quilt (from .../quilt_0.46-8ubuntu1_all.deb) ...
Setting up libmagic1 (5.03-1ubuntu1) ...
Setting up file (5.03-1ubuntu1) ...
Setting up libpcre3 (7.8-2ubuntu1) ...
Setting up libglib2.0-0 (2.22.1-0ubuntu1) ...
Setting up libxml2 (2.7.3.dfsg-1ubuntu2) ...
Setting up bsdmainutils (6.1.10ubuntu4) ...
update-alternatives: using /usr/bin/bsd-write to provide /usr/bin/write (write) in auto mode.
Setting up gettext-base (0.17-6ubuntu2) ...
Setting up groff-base (1.20.1-5) ...
Setting up man-db (2.5.6-2) ...
debconf: unable to initialize frontend: Dialog
debconf: (Dialog frontend will not work on a dumb terminal, an emacs shell buffer, or without a controlling terminal.)
debconf: falling back to frontend: Readline
Building database of manual pages ...
... skipping, since this is a buildd
Setting up autotools-dev (20090427.1) ...
Setting up html2text (1.3.2a-14) ...
Setting up libcroco3 (0.6.1-2) ...
Setting up gettext (0.17-6ubuntu2) ...
install-info: warning: maintainer scripts should not call install-info anymore,
install-info: warning: this is handled now by a dpkg trigger provided by the
install-info: warning: install-info package; package gettext should be updated.
Setting up intltool-debian (0.35.0+20060710.1) ...
Setting up po-debconf (1.0.16) ...
Setting up debhelper (7.3.15ubuntu3) ...
Setting up diffstat (1.47-1) ...
Setting up quilt (0.46-8ubuntu1) ...
Processing triggers for libc-bin ...
ldconfig deferred processing now taking place
Checking correctness of source dependencies...
Toolchain package versions: libc6-dev_2.10.1-0ubuntu13 make_3.81-6 dpkg-dev_1.15.4ubuntu2 linux-libc-dev_2.6.31-11.36 g++-4.4_4.4.1-4ubuntu5 gcc-4.4_4.4.1-4ubuntu5 binutils_2.19.91.20091001-0ubuntu2 libstdc++6_4.4.1-4ubuntu5 libstdc++6-4.4-dev_4.4.1-4ubuntu5
------------------------------------------------------------------------------
sh: gcc: not found
dpkg-source: warning: Couldn't determine gcc system type, falling back to default (native compilation)
gpg: Signature made Mon Apr 13 19:38:17 2009 BST using DSA key ID 747935DD
gpg: Can't check signature: public key not found
dpkg-source: extracting ilmbase in ilmbase-1.0.1
dpkg-source: unpacking ilmbase_1.0.1.orig.tar.gz
dpkg-source: applying /srv/home/buildd/build-karmic-autotest/ilmbase_1.0.1-3.diff.gz
dpkg-buildpackage: set CFLAGS to default value: -g -O2
dpkg-buildpackage: set CPPFLAGS to default value:
dpkg-buildpackage: set LDFLAGS to default value: -Wl,-Bsymbolic-functions
dpkg-buildpackage: set FFLAGS to default value: -g -O2
dpkg-buildpackage: set CXXFLAGS to default value: -g -O2
dpkg-buildpackage: source package ilmbase
dpkg-buildpackage: source version 1.0.1-3
dpkg-buildpackage: host architecture sparc
/usr/bin/fakeroot debian/rules clean
QUILT_PATCHES=debian/patches quilt --quiltrc /dev/null pop -a -R || test $? = 2
No patch removed
rm -rf .pc debian/stamp-patched
dh clean
dh_testdir
dh_auto_clean
dh_clean
rm -f config.guess config.sub
debian/rules build
QUILT_PATCHES=debian/patches quilt --quiltrc /dev/null push -a || test $? = 2
Applying patch 10_fix_testsuite_for_m68k
patching file HalfTest/testClassification.cpp
patching file HalfTest/testBitPatterns.cpp
Now at patch 10_fix_testsuite_for_m68k
touch debian/stamp-patched
cp /usr/share/misc/config.guess .
cp /usr/share/misc/config.sub .
dh build
dh_testdir
debian/rules override_dh_auto_configure
make[1]: Entering directory `/build/buildd/ilmbase-1.0.1'
PTHREAD_LIBS=-lpthread dh_auto_configure
checking build system type... sparc-unknown-linux-gnu
checking host system type... sparc-unknown-linux-gnu
checking for a BSD-compatible install... /usr/bin/install -c
checking whether build environment is sane... yes
checking for gawk... no
checking for mawk... mawk
checking whether make sets $(MAKE)... yes
checking whether to enable maintainer-specific portions of Makefiles... no
checking for g++... g++
checking for C++ compiler default output file name... a.out
checking whether the C++ compiler works... yes
checking whether we are cross compiling... no
checking for suffix of executables...
checking for suffix of object files... o
checking whether we are using the GNU C++ compiler... yes
checking whether g++ accepts -g... yes
checking for style of include used by make... GNU
checking dependency style of g++... none
checking for a BSD-compatible install... /usr/bin/install -c
checking for gcc... gcc
checking whether we are using the GNU C compiler... yes
checking whether gcc accepts -g... yes
checking for gcc option to accept ANSI C... none needed
checking dependency style of gcc... none
checking whether ln -s works... yes
checking for a sed that does not truncate output... /bin/sed
checking for egrep... grep -E
checking for ld used by gcc... /usr/bin/ld
checking if the linker (/usr/bin/ld) is GNU ld... yes
checking for /usr/bin/ld option to reload object files... -r
checking for BSD-compatible nm... /usr/bin/nm -B
checking how to recognise dependent libraries... pass_all
checking how to run the C preprocessor... gcc -E
checking for ANSI C header files... yes
checking for sys/types.h... yes
checking for sys/stat.h... yes
checking for stdlib.h... yes
checking for string.h... yes
checking for memory.h... yes
checking for strings.h... yes
checking for inttypes.h... yes
checking for stdint.h... yes
checking for unistd.h... yes
checking dlfcn.h usability... yes
checking dlfcn.h presence... yes
checking for dlfcn.h... yes
checking how to run the C++ preprocessor... g++ -E
checking for g77... no
checking for f77... no
checking for xlf... no
checking for frt... no
checking for pgf77... no
checking for fort77... no
checking for fl32... no
checking for af77... no
checking for f90... no
checking for xlf90... no
checking for pgf90... no
checking for epcf90... no
checking for f95... no
checking for fort... no
checking for xlf95... no
checking for ifc... no
checking for efc... no
checking for pgf95... no
checking for lf95... no
checking for gfortran... no
checking whether we are using the GNU Fortran 77 compiler... no
checking whether accepts -g... no
checking the maximum length of command line arguments... 65536
checking command to parse /usr/bin/nm -B output from gcc object... ok
checking for objdir... .libs
checking for ar... ar
checking for ranlib... ranlib
checking for strip... strip
checking if gcc static flag works... yes
checking if gcc supports -fno-rtti -fno-exceptions... no
checking for gcc option to produce PIC... -fPIC
checking if gcc PIC flag -fPIC works... yes
checking if gcc supports -c -o file.o... yes
checking whether the gcc linker (/usr/bin/ld) supports shared libraries... yes
checking whether -lc should be explicitly linked in... no
checking dynamic linker characteristics... GNU/Linux ld.so
checking how to hardcode library paths into programs... immediate
checking whether stripping libraries is possible... yes
checking if libtool supports shared libraries... yes
checking whether to build shared libraries... yes
checking whether to build static libraries... yes
configure: creating libtool
appending configuration tag "CXX" to libtool
checking for ld used by g++... /usr/bin/ld
checking if the linker (/usr/bin/ld) is GNU ld... yes
checking whether the g++ linker (/usr/bin/ld) supports shared libraries... yes
checking for g++ option to produce PIC... -fPIC
checking if g++ PIC flag -fPIC works... yes
checking if g++ supports -c -o file.o... yes
checking whether the g++ linker (/usr/bin/ld) supports shared libraries... yes
checking dynamic linker characteristics... GNU/Linux ld.so
checking how to hardcode library paths into programs... immediate
checking whether stripping libraries is possible... yes
appending configuration tag "F77" to libtool
checking whether make sets $(MAKE)... (cached) yes
checking for pthread_join in LIBS=-lpthread with CFLAGS=... yes
checking for joinable pthread attribute... PTHREAD_CREATE_JOINABLE
checking if more special flags are required for pthreads... no
checking for cc_r... gcc
checking semaphore.h usability... yes
checking semaphore.h presence... yes
checking for semaphore.h... yes
checking for library containing sem_init... none required
checking whether to use POSIX unnamed semaphores... yes
configure: multithread true, LIBS = -lpthread , CC = gcc, CXXFLAGS = -g -O2
checking for ANSI C header files... (cached) yes
checking limits.h usability... yes
checking limits.h presence... yes
checking for limits.h... yes
checking for unistd.h... (cached) yes
checking for an ANSI C-conforming const... yes
checking for inline... inline
checking for size_t... yes
checking for strerror... yes
checking for complete iomanip support in C++ standard library... yes
checking for gcc optimization flags... -pipe
configure: creating ./config.status
config.status: creating Makefile
config.status: creating IlmBase.pc
config.status: creating config/Makefile
config.status: creating Half/Makefile
config.status: creating HalfTest/Makefile
config.status: creating Iex/Makefile
config.status: creating IexTest/Makefile
config.status: creating IlmThread/Makefile
config.status: creating Imath/Makefile
config.status: creating ImathTest/Makefile
config.status: creating vc/Makefile
config.status: creating config/IlmBaseConfig.h
config.status: config/IlmBaseConfig.h is unchanged
config.status: executing depfiles commands
---------------------------------------------
Summary for IlmBase features:
No variable options in this package. Configure completed successfully.
---------------------------------------------
make[1]: Leaving directory `/build/buildd/ilmbase-1.0.1'
dh_auto_build
make[1]: Entering directory `/build/buildd/ilmbase-1.0.1'
Making all in Half
make[2]: Entering directory `/build/buildd/ilmbase-1.0.1/Half'
g++ -DHAVE_CONFIG_H -I. -I. -I../config -I../config -pipe -g -O2 -c -o eLut.o eLut.cpp
/bin/bash ../libtool --tag=CXX --mode=link g++ -pipe -g -O2 -Wl,-Bsymbolic-functions -o eLut eLut.o -lpthread
mkdir .libs
g++ -pipe -g -O2 -Wl,-Bsymbolic-functions -o eLut eLut.o -lpthread
./eLut > eLut.h
g++ -DHAVE_CONFIG_H -I. -I. -I../config -I../config -pipe -g -O2 -c -o toFloat.o toFloat.cpp
/bin/bash ../libtool --tag=CXX --mode=link g++ -pipe -g -O2 -Wl,-Bsymbolic-functions -o toFloat toFloat.o -lpthread
g++ -pipe -g -O2 -Wl,-Bsymbolic-functions -o toFloat toFloat.o -lpthread
./toFloat > toFloat.h
make all-am
make[3]: Entering directory `/build/buildd/ilmbase-1.0.1/Half'
/bin/bash ../libtool --tag=CXX --mode=compile g++ -DHAVE_CONFIG_H -I. -I. -I../config -I../config -pipe -g -O2 -c -o half.lo half.cpp
g++ -DHAVE_CONFIG_H -I. -I. -I../config -I../config -pipe -g -O2 -c half.cpp -fPIC -DPIC -o .libs/half.o
g++ -DHAVE_CONFIG_H -I. -I. -I../config -I../config -pipe -g -O2 -c half.cpp -o half.o >/dev/null 2>&1
/bin/bash ../libtool --tag=CXX --mode=link g++ -pipe -g -O2 -Wl,-Bsymbolic-functions -o libHalf.la -rpath /usr/lib -version-info 6:0:0 -no-undefined half.lo -lpthread
g++ -shared -nostdlib /usr/lib/gcc/sparc-linux-gnu/4.4.1/../../../../lib/crti.o /usr/lib/gcc/sparc-linux-gnu/4.4.1/crtbeginS.o .libs/half.o -lpthread -L/usr/lib/gcc/sparc-linux-gnu/4.4.1 -L/usr/lib/gcc/sparc-linux-gnu/4.4.1/../../../../lib -L/lib/../lib -L/usr/lib/../lib -L/usr/lib/gcc/sparc-linux-gnu/4.4.1/../../.. -lstdc++ -lm -lc -lgcc_s /usr/lib/gcc/sparc-linux-gnu/4.4.1/crtendS.o /usr/lib/gcc/sparc-linux-gnu/4.4.1/../../../../lib/crtn.o -Wl,-Bsymbolic-functions -Wl,-soname -Wl,libHalf.so.6 -o .libs/libHalf.so.6.0.0
(cd .libs && rm -f libHalf.so.6 && ln -s libHalf.so.6.0.0 libHalf.so.6)
(cd .libs && rm -f libHalf.so && ln -s libHalf.so.6.0.0 libHalf.so)
ar cru .libs/libHalf.a half.o
ranlib .libs/libHalf.a
creating libHalf.la
(cd .libs && rm -f libHalf.la && ln -s ../libHalf.la libHalf.la)
make[3]: Leaving directory `/build/buildd/ilmbase-1.0.1/Half'
make[2]: Leaving directory `/build/buildd/ilmbase-1.0.1/Half'
Making all in HalfTest
make[2]: Entering directory `/build/buildd/ilmbase-1.0.1/HalfTest'
make[2]: Nothing to be done for `all'.
make[2]: Leaving directory `/build/buildd/ilmbase-1.0.1/HalfTest'
Making all in Iex
make[2]: Entering directory `/build/buildd/ilmbase-1.0.1/Iex'
/bin/bash ../libtool --tag=CXX --mode=compile g++ -DHAVE_CONFIG_H -I. -I. -I../config -I../config -pipe -g -O2 -c -o IexThrowErrnoExc.lo IexThrowErrnoExc.cpp
mkdir .libs
g++ -DHAVE_CONFIG_H -I. -I. -I../config -I../config -pipe -g -O2 -c IexThrowErrnoExc.cpp -fPIC -DPIC -o .libs/IexThrowErrnoExc.o
g++ -DHAVE_CONFIG_H -I. -I. -I../config -I../config -pipe -g -O2 -c IexThrowErrnoExc.cpp -o IexThrowErrnoExc.o >/dev/null 2>&1
/bin/bash ../libtool --tag=CXX --mode=compile g++ -DHAVE_CONFIG_H -I. -I. -I../config -I../config -pipe -g -O2 -c -o IexBaseExc.lo IexBaseExc.cpp
g++ -DHAVE_CONFIG_H -I. -I. -I../config -I../config -pipe -g -O2 -c IexBaseExc.cpp -fPIC -DPIC -o .libs/IexBaseExc.o
g++ -DHAVE_CONFIG_H -I. -I. -I../config -I../config -pipe -g -O2 -c IexBaseExc.cpp -o IexBaseExc.o >/dev/null 2>&1
/bin/bash ../libtool --tag=CXX --mode=link g++ -pipe -g -O2 -Wl,-Bsymbolic-functions -o libIex.la -rpath /usr/lib -version-info 6:0:0 -no-undefined IexThrowErrnoExc.lo IexBaseExc.lo -lpthread
g++ -shared -nostdlib /usr/lib/gcc/sparc-linux-gnu/4.4.1/../../../../lib/crti.o /usr/lib/gcc/sparc-linux-gnu/4.4.1/crtbeginS.o .libs/IexThrowErrnoExc.o .libs/IexBaseExc.o -lpthread -L/usr/lib/gcc/sparc-linux-gnu/4.4.1 -L/usr/lib/gcc/sparc-linux-gnu/4.4.1/../../../../lib -L/lib/../lib -L/usr/lib/../lib -L/usr/lib/gcc/sparc-linux-gnu/4.4.1/../../.. -lstdc++ -lm -lc -lgcc_s /usr/lib/gcc/sparc-linux-gnu/4.4.1/crtendS.o /usr/lib/gcc/sparc-linux-gnu/4.4.1/../../../../lib/crtn.o -Wl,-Bsymbolic-functions -Wl,-soname -Wl,libIex.so.6 -o .libs/libIex.so.6.0.0
(cd .libs && rm -f libIex.so.6 && ln -s libIex.so.6.0.0 libIex.so.6)
(cd .libs && rm -f libIex.so && ln -s libIex.so.6.0.0 libIex.so)
ar cru .libs/libIex.a IexThrowErrnoExc.o IexBaseExc.o
ranlib .libs/libIex.a
creating libIex.la
(cd .libs && rm -f libIex.la && ln -s ../libIex.la libIex.la)
make[2]: Leaving directory `/build/buildd/ilmbase-1.0.1/Iex'
Making all in IexTest
make[2]: Entering directory `/build/buildd/ilmbase-1.0.1/IexTest'
make[2]: Nothing to be done for `all'.
make[2]: Leaving directory `/build/buildd/ilmbase-1.0.1/IexTest'
Making all in Imath
make[2]: Entering directory `/build/buildd/ilmbase-1.0.1/Imath'
/bin/bash ../libtool --tag=CXX --mode=compile g++ -DHAVE_CONFIG_H -I. -I. -I../config -I.. -I../Iex -I../Half -I../config -pipe -g -O2 -c -o ImathShear.lo ImathShear.cpp
mkdir .libs
g++ -DHAVE_CONFIG_H -I. -I. -I../config -I.. -I../Iex -I../Half -I../config -pipe -g -O2 -c ImathShear.cpp -fPIC -DPIC -o .libs/ImathShear.o
g++ -DHAVE_CONFIG_H -I. -I. -I../config -I.. -I../Iex -I../Half -I../config -pipe -g -O2 -c ImathShear.cpp -o ImathShear.o >/dev/null 2>&1
/bin/bash ../libtool --tag=CXX --mode=compile g++ -DHAVE_CONFIG_H -I. -I. -I../config -I.. -I../Iex -I../Half -I../config -pipe -g -O2 -c -o ImathMatrixAlgo.lo ImathMatrixAlgo.cpp
g++ -DHAVE_CONFIG_H -I. -I. -I../config -I.. -I../Iex -I../Half -I../config -pipe -g -O2 -c ImathMatrixAlgo.cpp -fPIC -DPIC -o .libs/ImathMatrixAlgo.o
g++ -DHAVE_CONFIG_H -I. -I. -I../config -I.. -I../Iex -I../Half -I../config -pipe -g -O2 -c ImathMatrixAlgo.cpp -o ImathMatrixAlgo.o >/dev/null 2>&1
/bin/bash ../libtool --tag=CXX --mode=compile g++ -DHAVE_CONFIG_H -I. -I. -I../config -I.. -I../Iex -I../Half -I../config -pipe -g -O2 -c -o ImathVec.lo ImathVec.cpp
g++ -DHAVE_CONFIG_H -I. -I. -I../config -I.. -I../Iex -I../Half -I../config -pipe -g -O2 -c ImathVec.cpp -fPIC -DPIC -o .libs/ImathVec.o
g++ -DHAVE_CONFIG_H -I. -I. -I../config -I.. -I../Iex -I../Half -I../config -pipe -g -O2 -c ImathVec.cpp -o ImathVec.o >/dev/null 2>&1
/bin/bash ../libtool --tag=CXX --mode=compile g++ -DHAVE_CONFIG_H -I. -I. -I../config -I.. -I../Iex -I../Half -I../config -pipe -g -O2 -c -o ImathColorAlgo.lo ImathColorAlgo.cpp
g++ -DHAVE_CONFIG_H -I. -I. -I../config -I.. -I../Iex -I../Half -I../config -pipe -g -O2 -c ImathColorAlgo.cpp -fPIC -DPIC -o .libs/ImathColorAlgo.o
g++ -DHAVE_CONFIG_H -I. -I. -I../config -I.. -I../Iex -I../Half -I../config -pipe -g -O2 -c ImathColorAlgo.cpp -o ImathColorAlgo.o >/dev/null 2>&1
/bin/bash ../libtool --tag=CXX --mode=compile g++ -DHAVE_CONFIG_H -I. -I. -I../config -I.. -I../Iex -I../Half -I../config -pipe -g -O2 -c -o ImathFun.lo ImathFun.cpp
g++ -DHAVE_CONFIG_H -I. -I. -I../config -I.. -I../Iex -I../Half -I../config -pipe -g -O2 -c ImathFun.cpp -fPIC -DPIC -o .libs/ImathFun.o
g++ -DHAVE_CONFIG_H -I. -I. -I../config -I.. -I../Iex -I../Half -I../config -pipe -g -O2 -c ImathFun.cpp -o ImathFun.o >/dev/null 2>&1
/bin/bash ../libtool --tag=CXX --mode=compile g++ -DHAVE_CONFIG_H -I. -I. -I../config -I.. -I../Iex -I../Half -I../config -pipe -g -O2 -c -o ImathBox.lo ImathBox.cpp
g++ -DHAVE_CONFIG_H -I. -I. -I../config -I.. -I../Iex -I../Half -I../config -pipe -g -O2 -c ImathBox.cpp -fPIC -DPIC -o .libs/ImathBox.o
g++ -DHAVE_CONFIG_H -I. -I. -I../config -I.. -I../Iex -I../Half -I../config -pipe -g -O2 -c ImathBox.cpp -o ImathBox.o >/dev/null 2>&1
/bin/bash ../libtool --tag=CXX --mode=compile g++ -DHAVE_CONFIG_H -I. -I. -I../config -I.. -I../Iex -I../Half -I../config -pipe -g -O2 -c -o ImathRandom.lo ImathRandom.cpp
g++ -DHAVE_CONFIG_H -I. -I. -I../config -I.. -I../Iex -I../Half -I../config -pipe -g -O2 -c ImathRandom.cpp -fPIC -DPIC -o .libs/ImathRandom.o
g++ -DHAVE_CONFIG_H -I. -I. -I../config -I.. -I../Iex -I../Half -I../config -pipe -g -O2 -c ImathRandom.cpp -o ImathRandom.o >/dev/null 2>&1
/bin/bash ../libtool --tag=CXX --mode=link g++ -pipe -g -O2 -Wl,-Bsymbolic-functions -o libImath.la -rpath /usr/lib -version-info 6:0:0 -no-undefined ImathShear.lo ImathMatrixAlgo.lo ImathVec.lo ImathColorAlgo.lo ImathFun.lo ImathBox.lo ImathRandom.lo ../Iex/libIex.la -lpthread
g++ -shared -nostdlib /usr/lib/gcc/sparc-linux-gnu/4.4.1/../../../../lib/crti.o /usr/lib/gcc/sparc-linux-gnu/4.4.1/crtbeginS.o .libs/ImathShear.o .libs/ImathMatrixAlgo.o .libs/ImathVec.o .libs/ImathColorAlgo.o .libs/ImathFun.o .libs/ImathBox.o .libs/ImathRandom.o -Wl,--rpath -Wl,/build/buildd/ilmbase-1.0.1/Iex/.libs ../Iex/.libs/libIex.so -lpthread -L/usr/lib/gcc/sparc-linux-gnu/4.4.1 -L/usr/lib/gcc/sparc-linux-gnu/4.4.1/../../../../lib -L/lib/../lib -L/usr/lib/../lib -L/usr/lib/gcc/sparc-linux-gnu/4.4.1/../../.. -lstdc++ -lm -lc -lgcc_s /usr/lib/gcc/sparc-linux-gnu/4.4.1/crtendS.o /usr/lib/gcc/sparc-linux-gnu/4.4.1/../../../../lib/crtn.o -Wl,-Bsymbolic-functions -Wl,-soname -Wl,libImath.so.6 -o .libs/libImath.so.6.0.0
(cd .libs && rm -f libImath.so.6 && ln -s libImath.so.6.0.0 libImath.so.6)
(cd .libs && rm -f libImath.so && ln -s libImath.so.6.0.0 libImath.so)
ar cru .libs/libImath.a ImathShear.o ImathMatrixAlgo.o ImathVec.o ImathColorAlgo.o ImathFun.o ImathBox.o ImathRandom.o
ranlib .libs/libImath.a
creating libImath.la
(cd .libs && rm -f libImath.la && ln -s ../libImath.la libImath.la)
make[2]: Leaving directory `/build/buildd/ilmbase-1.0.1/Imath'
Making all in ImathTest
make[2]: Entering directory `/build/buildd/ilmbase-1.0.1/ImathTest'
make[2]: Nothing to be done for `all'.
make[2]: Leaving directory `/build/buildd/ilmbase-1.0.1/ImathTest'
Making all in IlmThread
make[2]: Entering directory `/build/buildd/ilmbase-1.0.1/IlmThread'
/bin/bash ../libtool --tag=CXX --mode=compile g++ -DHAVE_CONFIG_H -I. -I. -I../config -I.. -I../Iex -I../config -pipe -g -O2 -c -o IlmThreadPool.lo IlmThreadPool.cpp
mkdir .libs
g++ -DHAVE_CONFIG_H -I. -I. -I../config -I.. -I../Iex -I../config -pipe -g -O2 -c IlmThreadPool.cpp -fPIC -DPIC -o .libs/IlmThreadPool.o
g++ -DHAVE_CONFIG_H -I. -I. -I../config -I.. -I../Iex -I../config -pipe -g -O2 -c IlmThreadPool.cpp -o IlmThreadPool.o >/dev/null 2>&1
/bin/bash ../libtool --tag=CXX --mode=compile g++ -DHAVE_CONFIG_H -I. -I. -I../config -I.. -I../Iex -I../config -pipe -g -O2 -c -o IlmThread.lo IlmThread.cpp
g++ -DHAVE_CONFIG_H -I. -I. -I../config -I.. -I../Iex -I../config -pipe -g -O2 -c IlmThread.cpp -fPIC -DPIC -o .libs/IlmThread.o
g++ -DHAVE_CONFIG_H -I. -I. -I../config -I.. -I../Iex -I../config -pipe -g -O2 -c IlmThread.cpp -o IlmThread.o >/dev/null 2>&1
/bin/bash ../libtool --tag=CXX --mode=compile g++ -DHAVE_CONFIG_H -I. -I. -I../config -I.. -I../Iex -I../config -pipe -g -O2 -c -o IlmThreadSemaphore.lo IlmThreadSemaphore.cpp
g++ -DHAVE_CONFIG_H -I. -I. -I../config -I.. -I../Iex -I../config -pipe -g -O2 -c IlmThreadSemaphore.cpp -fPIC -DPIC -o .libs/IlmThreadSemaphore.o
g++ -DHAVE_CONFIG_H -I. -I. -I../config -I.. -I../Iex -I../config -pipe -g -O2 -c IlmThreadSemaphore.cpp -o IlmThreadSemaphore.o >/dev/null 2>&1
/bin/bash ../libtool --tag=CXX --mode=compile g++ -DHAVE_CONFIG_H -I. -I. -I../config -I.. -I../Iex -I../config -pipe -g -O2 -c -o IlmThreadMutex.lo IlmThreadMutex.cpp
g++ -DHAVE_CONFIG_H -I. -I. -I../config -I.. -I../Iex -I../config -pipe -g -O2 -c IlmThreadMutex.cpp -fPIC -DPIC -o .libs/IlmThreadMutex.o
g++ -DHAVE_CONFIG_H -I. -I. -I../config -I.. -I../Iex -I../config -pipe -g -O2 -c IlmThreadMutex.cpp -o IlmThreadMutex.o >/dev/null 2>&1
/bin/bash ../libtool --tag=CXX --mode=compile g++ -DHAVE_CONFIG_H -I. -I. -I../config -I.. -I../Iex -I../config -pipe -g -O2 -c -o IlmThreadPosix.lo IlmThreadPosix.cpp
g++ -DHAVE_CONFIG_H -I. -I. -I../config -I.. -I../Iex -I../config -pipe -g -O2 -c IlmThreadPosix.cpp -fPIC -DPIC -o .libs/IlmThreadPosix.o
g++ -DHAVE_CONFIG_H -I. -I. -I../config -I.. -I../Iex -I../config -pipe -g -O2 -c IlmThreadPosix.cpp -o IlmThreadPosix.o >/dev/null 2>&1
/bin/bash ../libtool --tag=CXX --mode=compile g++ -DHAVE_CONFIG_H -I. -I. -I../config -I.. -I../Iex -I../config -pipe -g -O2 -c -o IlmThreadSemaphorePosix.lo IlmThreadSemaphorePosix.cpp
g++ -DHAVE_CONFIG_H -I. -I. -I../config -I.. -I../Iex -I../config -pipe -g -O2 -c IlmThreadSemaphorePosix.cpp -fPIC -DPIC -o .libs/IlmThreadSemaphorePosix.o
g++ -DHAVE_CONFIG_H -I. -I. -I../config -I.. -I../Iex -I../config -pipe -g -O2 -c IlmThreadSemaphorePosix.cpp -o IlmThreadSemaphorePosix.o >/dev/null 2>&1
/bin/bash ../libtool --tag=CXX --mode=compile g++ -DHAVE_CONFIG_H -I. -I. -I../config -I.. -I../Iex -I../config -pipe -g -O2 -c -o IlmThreadSemaphorePosixCompat.lo IlmThreadSemaphorePosixCompat.cpp
g++ -DHAVE_CONFIG_H -I. -I. -I../config -I.. -I../Iex -I../config -pipe -g -O2 -c IlmThreadSemaphorePosixCompat.cpp -fPIC -DPIC -o .libs/IlmThreadSemaphorePosixCompat.o
g++ -DHAVE_CONFIG_H -I. -I. -I../config -I.. -I../Iex -I../config -pipe -g -O2 -c IlmThreadSemaphorePosixCompat.cpp -o IlmThreadSemaphorePosixCompat.o >/dev/null 2>&1
/bin/bash ../libtool --tag=CXX --mode=compile g++ -DHAVE_CONFIG_H -I. -I. -I../config -I.. -I../Iex -I../config -pipe -g -O2 -c -o IlmThreadMutexPosix.lo IlmThreadMutexPosix.cpp
g++ -DHAVE_CONFIG_H -I. -I. -I../config -I.. -I../Iex -I../config -pipe -g -O2 -c IlmThreadMutexPosix.cpp -fPIC -DPIC -o .libs/IlmThreadMutexPosix.o
g++ -DHAVE_CONFIG_H -I. -I. -I../config -I.. -I../Iex -I../config -pipe -g -O2 -c IlmThreadMutexPosix.cpp -o IlmThreadMutexPosix.o >/dev/null 2>&1
/bin/bash ../libtool --tag=CXX --mode=link g++ -pipe -g -O2 -Wl,-Bsymbolic-functions -o libIlmThread.la -rpath /usr/lib -version-info 6:0:0 -no-undefined IlmThreadPool.lo IlmThread.lo IlmThreadSemaphore.lo IlmThreadMutex.lo IlmThreadPosix.lo IlmThreadSemaphorePosix.lo IlmThreadSemaphorePosixCompat.lo IlmThreadMutexPosix.lo ../Iex/libIex.la -lpthread
g++ -shared -nostdlib /usr/lib/gcc/sparc-linux-gnu/4.4.1/../../../../lib/crti.o /usr/lib/gcc/sparc-linux-gnu/4.4.1/crtbeginS.o .libs/IlmThreadPool.o .libs/IlmThread.o .libs/IlmThreadSemaphore.o .libs/IlmThreadMutex.o .libs/IlmThreadPosix.o .libs/IlmThreadSemaphorePosix.o .libs/IlmThreadSemaphorePosixCompat.o .libs/IlmThreadMutexPosix.o -Wl,--rpath -Wl,/build/buildd/ilmbase-1.0.1/Iex/.libs ../Iex/.libs/libIex.so -lpthread -L/usr/lib/gcc/sparc-linux-gnu/4.4.1 -L/usr/lib/gcc/sparc-linux-gnu/4.4.1/../../../../lib -L/lib/../lib -L/usr/lib/../lib -L/usr/lib/gcc/sparc-linux-gnu/4.4.1/../../.. -lstdc++ -lm -lc -lgcc_s /usr/lib/gcc/sparc-linux-gnu/4.4.1/crtendS.o /usr/lib/gcc/sparc-linux-gnu/4.4.1/../../../../lib/crtn.o -Wl,-Bsymbolic-functions -Wl,-soname -Wl,libIlmThread.so.6 -o .libs/libIlmThread.so.6.0.0
(cd .libs && rm -f libIlmThread.so.6 && ln -s libIlmThread.so.6.0.0 libIlmThread.so.6)
(cd .libs && rm -f libIlmThread.so && ln -s libIlmThread.so.6.0.0 libIlmThread.so)
ar cru .libs/libIlmThread.a IlmThreadPool.o IlmThread.o IlmThreadSemaphore.o IlmThreadMutex.o IlmThreadPosix.o IlmThreadSemaphorePosix.o IlmThreadSemaphorePosixCompat.o IlmThreadMutexPosix.o
ranlib .libs/libIlmThread.a
creating libIlmThread.la
(cd .libs && rm -f libIlmThread.la && ln -s ../libIlmThread.la libIlmThread.la)
make[2]: Leaving directory `/build/buildd/ilmbase-1.0.1/IlmThread'
Making all in config
make[2]: Entering directory `/build/buildd/ilmbase-1.0.1/config'
make all-am
make[3]: Entering directory `/build/buildd/ilmbase-1.0.1/config'
make[3]: Leaving directory `/build/buildd/ilmbase-1.0.1/config'
make[2]: Leaving directory `/build/buildd/ilmbase-1.0.1/config'
make[2]: Entering directory `/build/buildd/ilmbase-1.0.1'
make[2]: Nothing to be done for `all-am'.
make[2]: Leaving directory `/build/buildd/ilmbase-1.0.1'
make[1]: Leaving directory `/build/buildd/ilmbase-1.0.1'
debian/rules override_dh_auto_test
make[1]: Entering directory `/build/buildd/ilmbase-1.0.1'
/usr/bin/make check
make[2]: Entering directory `/build/buildd/ilmbase-1.0.1'
Making check in Half
make[3]: Entering directory `/build/buildd/ilmbase-1.0.1/Half'
/usr/bin/make check-am
make[4]: Entering directory `/build/buildd/ilmbase-1.0.1/Half'
make[4]: Nothing to be done for `check-am'.
make[4]: Leaving directory `/build/buildd/ilmbase-1.0.1/Half'
make[3]: Leaving directory `/build/buildd/ilmbase-1.0.1/Half'
Making check in HalfTest
make[3]: Entering directory `/build/buildd/ilmbase-1.0.1/HalfTest'
/usr/bin/make HalfTest
make[4]: Entering directory `/build/buildd/ilmbase-1.0.1/HalfTest'
g++ -DHAVE_CONFIG_H -I. -I. -I../config -I.. -I../Half -I../config -pipe -g -O2 -c -o main.o main.cpp
g++ -DHAVE_CONFIG_H -I. -I. -I../config -I.. -I../Half -I../config -pipe -g -O2 -c -o testArithmetic.o testArithmetic.cpp
g++ -DHAVE_CONFIG_H -I. -I. -I../config -I.. -I../Half -I../config -pipe -g -O2 -c -o testBitPatterns.o testBitPatterns.cpp
g++ -DHAVE_CONFIG_H -I. -I. -I../config -I.. -I../Half -I../config -pipe -g -O2 -c -o testClassification.o testClassification.cpp
g++ -DHAVE_CONFIG_H -I. -I. -I../config -I.. -I../Half -I../config -pipe -g -O2 -c -o testError.o testError.cpp
g++ -DHAVE_CONFIG_H -I. -I. -I../config -I.. -I../Half -I../config -pipe -g -O2 -c -o testFunction.o testFunction.cpp
g++ -DHAVE_CONFIG_H -I. -I. -I../config -I.. -I../Half -I../config -pipe -g -O2 -c -o testLimits.o testLimits.cpp
g++ -DHAVE_CONFIG_H -I. -I. -I../config -I.. -I../Half -I../config -pipe -g -O2 -c -o testSize.o testSize.cpp
/bin/bash ../libtool --tag=CXX --mode=link g++ -pipe -g -O2 -Wl,-Bsymbolic-functions -o HalfTest main.o testArithmetic.o testBitPatterns.o testClassification.o testError.o testFunction.o testLimits.o testSize.o -L../Half -lHalf -lpthread
mkdir .libs
g++ -pipe -g -O2 -Wl,-Bsymbolic-functions -o .libs/HalfTest main.o testArithmetic.o testBitPatterns.o testClassification.o testError.o testFunction.o testLimits.o testSize.o -L/build/buildd/ilmbase-1.0.1/Half /build/buildd/ilmbase-1.0.1/Half/.libs/libHalf.so -lpthread
creating HalfTest
make[4]: Leaving directory `/build/buildd/ilmbase-1.0.1/HalfTest'
/usr/bin/make check-TESTS
make[4]: Entering directory `/build/buildd/ilmbase-1.0.1/HalfTest'
testing type half:
size and alignment
sizeof (half) = 2
alignof (half) = 2
ok
basic arithmetic operations:
f1 = 1, f2 = 2, h1 = 3, h2 = 4
h1 = f1 + f2: 3
h2 += f1: 5
h2 = h1 + h2: 8
h2 += h1: 11
h1 = h2: 11
h2 = -h1: -11
ok
float-to-half conversion error for normalized half numbers
max error = 0.000488043
max expected error = 0.00048828
ok
float-to-half conversion error for denormalized half numbers
max error = 2.98023e-08
max expected error = 2.98023e-08
ok
rounding normalized numbers to 10-bit precision
max error = 0
max expected error = 0
ok
rounding denormalized numbers to 10-bit precision
max error = 0
max expected error = 0
ok
rounding normalized numbers to 9-bit precision
max error = 0.000975609
max expected error = 0.00097656
ok
rounding denormalized numbers to 9-bit precision
max error = 5.96046e-08
max expected error = 5.96046e-08
ok
rounding normalized numbers to 1-bit precision
max error = 0.249634
max expected error = 0.249999
ok
rounding denormalized numbers to 1-bit precision
max error = 1.52588e-05
max expected error = 1.52588e-05
ok
rounding normalized numbers to 0-bit precision
max error = 0.499756
max expected error = 0.499999
ok
rounding denormalized numbers to 0-bit precision
max error = 3.05176e-05
max expected error = 3.05176e-05
ok
specific bit patterns
1 0 01111111 00000000000000000000000 0 01111 0000000000
1 0 01111111 00000000000000000000000
1.0009766 0 01111111 00000000010000000000000 0 01111 0000000001
1.0009766 0 01111111 00000000010000000000000
1.0004883 0 01111111 00000000001000000000000 0 01111 0000000000
1 0 01111111 00000000000000000000000
1.0004882 0 01111111 00000000000111111111111 0 01111 0000000000
1 0 01111111 00000000000000000000000
1.0004884 0 01111111 00000000001000000000001 0 01111 0000000001
1.0009766 0 01111111 00000000010000000000000
1.0019531 0 01111111 00000000100000000000000 0 01111 0000000010
1.0019531 0 01111111 00000000100000000000000
1.0014648 0 01111111 00000000011000000000000 0 01111 0000000010
1.0019531 0 01111111 00000000100000000000000
1.0014647 0 01111111 00000000010111111111111 0 01111 0000000001
1.0009766 0 01111111 00000000010000000000000
1.001465 0 01111111 00000000011000000000001 0 01111 0000000010
1.0019531 0 01111111 00000000100000000000000
0.99951172 0 01111110 11111111110000000000000 0 01110 1111111111
0.99951172 0 01111110 11111111110000000000000
0.99975586 0 01111110 11111111111000000000000 0 01111 0000000000
1 0 01111111 00000000000000000000000
0.99975592 0 01111110 11111111111000000000001 0 01111 0000000000
1 0 01111111 00000000000000000000000
0.9997558 0 01111110 11111111110111111111111 0 01110 1111111111
0.99951172 0 01111110 11111111110000000000000
5.9604645e-08 0 01100111 00000000000000000000000 0 00000 0000000001
5.9604645e-08 0 01100111 00000000000000000000000
1.1920929e-07 0 01101000 00000000000000000000000 0 00000 0000000010
1.1920929e-07 0 01101000 00000000000000000000000
8.9406967e-08 0 01100111 10000000000000000000000 0 00000 0000000010
1.1920929e-07 0 01101000 00000000000000000000000
8.9401006e-08 0 01100111 01111111111110010111001 0 00000 0000000001
5.9604645e-08 0 01100111 00000000000000000000000
8.9412929e-08 0 01100111 10000000000001101000111 0 00000 0000000010
1.1920929e-07 0 01101000 00000000000000000000000
0 0 00000000 00000000000000000000000 0 00000 0000000000
0 0 00000000 00000000000000000000000
2.9802322e-08 0 01100110 00000000000000000000000 0 00000 0000000000
0 0 00000000 00000000000000000000000
2.9808284e-08 0 01100110 00000000000011010001110 0 00000 0000000001
5.9604645e-08 0 01100111 00000000000000000000000
2.9796363e-08 0 01100101 11111111111001011100101 0 00000 0000000000
0 0 00000000 00000000000000000000000
6.1035156e-05 0 01110001 00000000000000000000000 0 00001 0000000000
6.1035156e-05 0 01110001 00000000000000000000000
6.1094761e-05 0 01110001 00000000010000000000000 0 00001 0000000001
6.1094761e-05 0 01110001 00000000010000000000000
6.1064959e-05 0 01110001 00000000001000000000000 0 00001 0000000000
6.1035156e-05 0 01110001 00000000000000000000000
6.1064951e-05 0 01110001 00000000000111111111111 0 00001 0000000000
6.1035156e-05 0 01110001 00000000000000000000000
6.1064966e-05 0 01110001 00000000001000000000001 0 00001 0000000001
6.1094761e-05 0 01110001 00000000010000000000000
6.0975552e-05 0 01110000 11111111100000000000000 0 00000 1111111111
6.0975552e-05 0 01110000 11111111100000000000000
6.1005354e-05 0 01110000 11111111110000000000000 0 00001 0000000000
6.1035156e-05 0 01110001 00000000000000000000000
6.1005358e-05 0 01110000 11111111110000000000001 0 00001 0000000000
6.1035156e-05 0 01110001 00000000000000000000000
6.100535e-05 0 01110000 11111111101111111111111 0 00000 1111111111
6.0975552e-05 0 01110000 11111111100000000000000
2 0 10000000 00000000000000000000000 0 10000 0000000000
2 0 10000000 00000000000000000000000
3 0 10000000 10000000000000000000000 0 10000 1000000000
3 0 10000000 10000000000000000000000
10 0 10000010 01000000000000000000000 0 10010 0100000000
10 0 10000010 01000000000000000000000
0.1 0 01111011 10011001100110011001101 0 01011 1001100110
0.099975586 0 01111011 10011001100000000000000
0.2 0 01111100 10011001100110011001101 0 01100 1001100110
0.19995117 0 01111100 10011001100000000000000
0.30000001 0 01111101 00110011001100110011010 0 01101 0011001101
0.30004883 0 01111101 00110011010000000000000
65504 0 10001110 11111111110000000000000 0 11110 1111111111
65504 0 10001110 11111111110000000000000
65536 0 10001111 00000000000000000000000 0 11111 0000000000
inf 0 11111111 00000000000000000000000
65520 0 10001110 11111111111000000000000 0 11111 0000000000
inf 0 11111111 00000000000000000000000
65519.996 0 10001110 11111111110111111111111 0 11110 1111111111
65504 0 10001110 11111111110000000000000
65520.004 0 10001110 11111111111000000000001 0 11111 0000000000
inf 0 11111111 00000000000000000000000
4.290774e+09 0 10011110 11111111100000000000100 0 11111 0000000000
inf 0 11111111 00000000000000000000000
3.4028235e+38 0 11111110 11111111111111111111111 0 11111 0000000000
inf 0 11111111 00000000000000000000000
inf 0 11111111 00000000000000000000000 0 11111 0000000000
inf 0 11111111 00000000000000000000000
nan 0 11111111 11111111111111111111111 0 11111 1111111111
nan 0 11111111 11111111110000000000000
nan 0 11111111 10101010101010101010101 0 11111 1010101010
nan 0 11111111 10101010100000000000000
-1 1 01111111 00000000000000000000000 1 01111 0000000000
-1 1 01111111 00000000000000000000000
-1.0009766 1 01111111 00000000010000000000000 1 01111 0000000001
-1.0009766 1 01111111 00000000010000000000000
-1.0004883 1 01111111 00000000001000000000000 1 01111 0000000000
-1 1 01111111 00000000000000000000000
-1.0004882 1 01111111 00000000000111111111111 1 01111 0000000000
-1 1 01111111 00000000000000000000000
-1.0004884 1 01111111 00000000001000000000001 1 01111 0000000001
-1.0009766 1 01111111 00000000010000000000000
-1.0019531 1 01111111 00000000100000000000000 1 01111 0000000010
-1.0019531 1 01111111 00000000100000000000000
-1.0014648 1 01111111 00000000011000000000000 1 01111 0000000010
-1.0019531 1 01111111 00000000100000000000000
-1.0014647 1 01111111 00000000010111111111111 1 01111 0000000001
-1.0009766 1 01111111 00000000010000000000000
-1.001465 1 01111111 00000000011000000000001 1 01111 0000000010
-1.0019531 1 01111111 00000000100000000000000
-0.99951172 1 01111110 11111111110000000000000 1 01110 1111111111
-0.99951172 1 01111110 11111111110000000000000
-0.99975586 1 01111110 11111111111000000000000 1 01111 0000000000
-1 1 01111111 00000000000000000000000
-0.99975592 1 01111110 11111111111000000000001 1 01111 0000000000
-1 1 01111111 00000000000000000000000
-0.9997558 1 01111110 11111111110111111111111 1 01110 1111111111
-0.99951172 1 01111110 11111111110000000000000
-5.9604645e-08 1 01100111 00000000000000000000000 1 00000 0000000001
-5.9604645e-08 1 01100111 00000000000000000000000
-1.1920929e-07 1 01101000 00000000000000000000000 1 00000 0000000010
-1.1920929e-07 1 01101000 00000000000000000000000
-8.9406967e-08 1 01100111 10000000000000000000000 1 00000 0000000010
-1.1920929e-07 1 01101000 00000000000000000000000
-8.9401006e-08 1 01100111 01111111111110010111001 1 00000 0000000001
-5.9604645e-08 1 01100111 00000000000000000000000
-8.9412929e-08 1 01100111 10000000000001101000111 1 00000 0000000010
-1.1920929e-07 1 01101000 00000000000000000000000
-0 1 00000000 00000000000000000000000 1 00000 0000000000
-0 1 00000000 00000000000000000000000
-2.9802322e-08 1 01100110 00000000000000000000000 1 00000 0000000000
-0 1 00000000 00000000000000000000000
-2.9808284e-08 1 01100110 00000000000011010001110 1 00000 0000000001
-5.9604645e-08 1 01100111 00000000000000000000000
-2.9796363e-08 1 01100101 11111111111001011100101 1 00000 0000000000
-0 1 00000000 00000000000000000000000
-6.1035156e-05 1 01110001 00000000000000000000000 1 00001 0000000000
-6.1035156e-05 1 01110001 00000000000000000000000
-6.1094761e-05 1 01110001 00000000010000000000000 1 00001 0000000001
-6.1094761e-05 1 01110001 00000000010000000000000
-6.1064959e-05 1 01110001 00000000001000000000000 1 00001 0000000000
-6.1035156e-05 1 01110001 00000000000000000000000
-6.1064951e-05 1 01110001 00000000000111111111111 1 00001 0000000000
-6.1035156e-05 1 01110001 00000000000000000000000
-6.1064966e-05 1 01110001 00000000001000000000001 1 00001 0000000001
-6.1094761e-05 1 01110001 00000000010000000000000
-6.0975552e-05 1 01110000 11111111100000000000000 1 00000 1111111111
-6.0975552e-05 1 01110000 11111111100000000000000
-6.1005354e-05 1 01110000 11111111110000000000000 1 00001 0000000000
-6.1035156e-05 1 01110001 00000000000000000000000
-6.1005358e-05 1 01110000 11111111110000000000001 1 00001 0000000000
-6.1035156e-05 1 01110001 00000000000000000000000
-6.100535e-05 1 01110000 11111111101111111111111 1 00000 1111111111
-6.0975552e-05 1 01110000 11111111100000000000000
-2 1 10000000 00000000000000000000000 1 10000 0000000000
-2 1 10000000 00000000000000000000000
-3 1 10000000 10000000000000000000000 1 10000 1000000000
-3 1 10000000 10000000000000000000000
-10 1 10000010 01000000000000000000000 1 10010 0100000000
-10 1 10000010 01000000000000000000000
-0.1 1 01111011 10011001100110011001101 1 01011 1001100110
-0.099975586 1 01111011 10011001100000000000000
-0.2 1 01111100 10011001100110011001101 1 01100 1001100110
-0.19995117 1 01111100 10011001100000000000000
-0.30000001 1 01111101 00110011001100110011010 1 01101 0011001101
-0.30004883 1 01111101 00110011010000000000000
-65504 1 10001110 11111111110000000000000 1 11110 1111111111
-65504 1 10001110 11111111110000000000000
-65536 1 10001111 00000000000000000000000 1 11111 0000000000
-inf 1 11111111 00000000000000000000000
-65520 1 10001110 11111111111000000000000 1 11111 0000000000
-inf 1 11111111 00000000000000000000000
-65519.996 1 10001110 11111111110111111111111 1 11110 1111111111
-65504 1 10001110 11111111110000000000000
-65520.004 1 10001110 11111111111000000000001 1 11111 0000000000
-inf 1 11111111 00000000000000000000000
-4.290774e+09 1 10011110 11111111100000000000100 1 11111 0000000000
-inf 1 11111111 00000000000000000000000
-3.4028235e+38 1 11111110 11111111111111111111111 1 11111 0000000000
-inf 1 11111111 00000000000000000000000
-inf 1 11111111 00000000000000000000000 1 11111 0000000000
-inf 1 11111111 00000000000000000000000
nan 1 11111111 11111111111111111111111 1 11111 1111111111
nan 1 11111111 11111111110000000000000
nan 1 11111111 10101010101010101010101 1 11111 1010101010
nan 1 11111111 10101010100000000000000
ok
classification of bit patterns
0 0 00000 0000000000 finite zero
1 0 01111 0000000000 finite normalized
1.0009766 0 01111 0000000001 finite normalized
5.9604645e-08 0 00000 0000000001 finite denormalized
1.1920929e-07 0 00000 0000000010 finite denormalized
6.1035156e-05 0 00001 0000000000 finite normalized
6.1094761e-05 0 00001 0000000001 finite normalized
6.0975552e-05 0 00000 1111111111 finite denormalized
2 0 10000 0000000000 finite normalized
3 0 10000 1000000000 finite normalized
0.099975586 0 01011 1001100110 finite normalized
0.19995117 0 01100 1001100110 finite normalized
0.30004883 0 01101 0011001101 finite normalized
65504 0 11110 1111111111 finite normalized
inf 0 11111 0000000000 infinity
nan 0 11111 1111111111 nan
nan 0 11111 1010101010 nan
-1 1 01111 0000000000 finite normalized negative
-1.0009766 1 01111 0000000001 finite normalized negative
-5.9604645e-08 1 00000 0000000001 finite denormalized negative
-1.1920929e-07 1 00000 0000000010 finite denormalized negative
-6.1035156e-05 1 00001 0000000000 finite normalized negative
-6.1094761e-05 1 00001 0000000001 finite normalized negative
-6.0975552e-05 1 00000 1111111111 finite denormalized negative
-2 1 10000 0000000000 finite normalized negative
-3 1 10000 1000000000 finite normalized negative
-0.099975586 1 01011 1001100110 finite normalized negative
-0.19995117 1 01100 1001100110 finite normalized negative
-0.30004883 1 01101 0011001101 finite normalized negative
-65504 1 11110 1111111111 finite normalized negative
-inf 1 11111 0000000000 infinity negative
nan 1 11111 1111111111 nan negative
nan 1 11111 1010101010 nan negative
inf 0 11111 0000000000 infinity
-inf 1 11111 0000000000 infinity negative
nan 0 11111 1111111111 nan
nan 0 11111 0111111111 nan
ok
values in std::numeric_limits<half>
min_exponent
max_exponent
min_exponent10
max_exponent10
ok
halfFunction<T>
ok
PASS: HalfTest
==================
All 1 tests passed
==================
make[4]: Leaving directory `/build/buildd/ilmbase-1.0.1/HalfTest'
make[3]: Leaving directory `/build/buildd/ilmbase-1.0.1/HalfTest'
Making check in Iex
make[3]: Entering directory `/build/buildd/ilmbase-1.0.1/Iex'
make[3]: Nothing to be done for `check'.
make[3]: Leaving directory `/build/buildd/ilmbase-1.0.1/Iex'
Making check in IexTest
make[3]: Entering directory `/build/buildd/ilmbase-1.0.1/IexTest'
/usr/bin/make IexTest
make[4]: Entering directory `/build/buildd/ilmbase-1.0.1/IexTest'
g++ -DHAVE_CONFIG_H -I. -I. -I../config -I.. -I../Iex -I../config -pipe -g -O2 -c -o main.o main.cpp
g++ -DHAVE_CONFIG_H -I. -I. -I../config -I.. -I../Iex -I../config -pipe -g -O2 -c -o testBaseExc.o testBaseExc.cpp
/bin/bash ../libtool --tag=CXX --mode=link g++ -pipe -g -O2 -Wl,-Bsymbolic-functions -o IexTest main.o testBaseExc.o -L../Iex -lIex -lpthread
mkdir .libs
g++ -pipe -g -O2 -Wl,-Bsymbolic-functions -o .libs/IexTest main.o testBaseExc.o -L/build/buildd/ilmbase-1.0.1/Iex /build/buildd/ilmbase-1.0.1/Iex/.libs/libIex.so -lpthread
creating IexTest
make[4]: Leaving directory `/build/buildd/ilmbase-1.0.1/IexTest'
/usr/bin/make check-TESTS
make[4]: Entering directory `/build/buildd/ilmbase-1.0.1/IexTest'
See if throw and catch work:
1
2
3
4
5
ok
PASS: IexTest
==================
All 1 tests passed
==================
make[4]: Leaving directory `/build/buildd/ilmbase-1.0.1/IexTest'
make[3]: Leaving directory `/build/buildd/ilmbase-1.0.1/IexTest'
Making check in Imath
make[3]: Entering directory `/build/buildd/ilmbase-1.0.1/Imath'
make[3]: Nothing to be done for `check'.
make[3]: Leaving directory `/build/buildd/ilmbase-1.0.1/Imath'
Making check in ImathTest
make[3]: Entering directory `/build/buildd/ilmbase-1.0.1/ImathTest'
/usr/bin/make ImathTest
make[4]: Entering directory `/build/buildd/ilmbase-1.0.1/ImathTest'
g++ -DHAVE_CONFIG_H -I. -I. -I../config -I.. -I../Imath -I../Iex -I../Half -I../config -pipe -g -O2 -c -o main.o main.cpp
g++ -DHAVE_CONFIG_H -I. -I. -I../config -I.. -I../Imath -I../Iex -I../Half -I../config -pipe -g -O2 -c -o testExtractEuler.o testExtractEuler.cpp
g++ -DHAVE_CONFIG_H -I. -I. -I../config -I.. -I../Imath -I../Iex -I../Half -I../config -pipe -g -O2 -c -o testExtractSHRT.o testExtractSHRT.cpp
g++ -DHAVE_CONFIG_H -I. -I. -I../config -I.. -I../Imath -I../Iex -I../Half -I../config -pipe -g -O2 -c -o testFrustum.o testFrustum.cpp
g++ -DHAVE_CONFIG_H -I. -I. -I../config -I.. -I../Imath -I../Iex -I../Half -I../config -pipe -g -O2 -c -o testFun.o testFun.cpp
g++ -DHAVE_CONFIG_H -I. -I. -I../config -I.. -I../Imath -I../Iex -I../Half -I../config -pipe -g -O2 -c -o testInvert.o testInvert.cpp
g++ -DHAVE_CONFIG_H -I. -I. -I../config -I.. -I../Imath -I../Iex -I../Half -I../config -pipe -g -O2 -c -o testMatrix.o testMatrix.cpp
g++ -DHAVE_CONFIG_H -I. -I. -I../config -I.. -I../Imath -I../Iex -I../Half -I../config -pipe -g -O2 -c -o testRandom.o testRandom.cpp
g++ -DHAVE_CONFIG_H -I. -I. -I../config -I.. -I../Imath -I../Iex -I../Half -I../config -pipe -g -O2 -c -o testRoots.o testRoots.cpp
g++ -DHAVE_CONFIG_H -I. -I. -I../config -I.. -I../Imath -I../Iex -I../Half -I../config -pipe -g -O2 -c -o testShear.o testShear.cpp
g++ -DHAVE_CONFIG_H -I. -I. -I../config -I.. -I../Imath -I../Iex -I../Half -I../config -pipe -g -O2 -c -o testColor.o testColor.cpp
g++ -DHAVE_CONFIG_H -I. -I. -I../config -I.. -I../Imath -I../Iex -I../Half -I../config -pipe -g -O2 -c -o testQuatSetRotation.o testQuatSetRotation.cpp
g++ -DHAVE_CONFIG_H -I. -I. -I../config -I.. -I../Imath -I../Iex -I../Half -I../config -pipe -g -O2 -c -o testLineAlgo.o testLineAlgo.cpp
g++ -DHAVE_CONFIG_H -I. -I. -I../config -I.. -I../Imath -I../Iex -I../Half -I../config -pipe -g -O2 -c -o testQuatSlerp.o testQuatSlerp.cpp
g++ -DHAVE_CONFIG_H -I. -I. -I../config -I.. -I../Imath -I../Iex -I../Half -I../config -pipe -g -O2 -c -o testBoxAlgo.o testBoxAlgo.cpp
/bin/bash ../libtool --tag=CXX --mode=link g++ -pipe -g -O2 -Wl,-Bsymbolic-functions -o ImathTest main.o testExtractEuler.o testExtractSHRT.o testFrustum.o testFun.o testInvert.o testMatrix.o testRandom.o testRoots.o testShear.o testColor.o testQuatSetRotation.o testLineAlgo.o testQuatSlerp.o testBoxAlgo.o -L../Imath -L../Iex -L../Half -lImath -lIex -lHalf -lpthread
mkdir .libs
g++ -pipe -g -O2 -Wl,-Bsymbolic-functions -o .libs/ImathTest main.o testExtractEuler.o testExtractSHRT.o testFrustum.o testFun.o testInvert.o testMatrix.o testRandom.o testRoots.o testShear.o testColor.o testQuatSetRotation.o testLineAlgo.o testQuatSlerp.o testBoxAlgo.o -L/build/buildd/ilmbase-1.0.1/Imath -L/build/buildd/ilmbase-1.0.1/Iex -L/build/buildd/ilmbase-1.0.1/Half /build/buildd/ilmbase-1.0.1/Imath/.libs/libImath.so /build/buildd/ilmbase-1.0.1/Iex/.libs/libIex.so /build/buildd/ilmbase-1.0.1/Half/.libs/libHalf.so -lpthread
creating ImathTest
make[4]: Leaving directory `/build/buildd/ilmbase-1.0.1/ImathTest'
/usr/bin/make check-TESTS
make[4]: Entering directory `/build/buildd/ilmbase-1.0.1/ImathTest'
Testing functions in ImathColor.h & ImathColorAlgo.h
rgb2packed -> packed2rgb
Imath::Color4 * f
Imath::Color4 / f
Assignment and comparison
ok
Testing functions in ImathShear.h
Imath::Shear6 constructors
Imath::Shear6 * f
Imath::Shear6 / f
Assignment and comparison
ok
Testing functions in ImathMatrix.h
Imath::Matrix33 shear functions
ok
Testing functions in ImathRoots.h
coefficients: 1 6 11 6 solutions: -3 -2 -1
coefficients: 2 2 -20 16 solutions: -4 1 2
coefficients: 3 -3 1 -1 solutions: 1
coefficients: 2 0 -24 -32 solutions: -2 4
coefficients: 1 0 0 0 solutions: -0
coefficients: 8 -24 24 -8 solutions: 1
coefficients: 0 2 -10 12 solutions: 2 3
coefficients: 0 1 -1 -20 solutions: -4 5
coefficients: 0 3 -12 12 solutions: 2
coefficients: 0 1 0 0 solutions: -0
coefficients: 0 1 0 1 solutions: none
coefficients: 0 0 3 -6 solutions: 2
coefficients: 0 0 5 15 solutions: -3
coefficients: 0 0 1 0 solutions: -0
coefficients: 0 0 0 1 solutions: none
coefficients: 0 0 0 0 solutions: [-inf, inf]
ok
Testing functions in ImathFun.h
floor
ceil
trunc
divs / mods
divp / modp
successor, predecessor
f 0
sf 1.40129846e-45
pf -1.40129846e-45
spf -0
psf 0
f -0
sf 1.40129846e-45
pf -1.40129846e-45
spf -0
psf 0
f 1
sf 1.00000012
pf 0.99999994
spf 1
psf 1
f -1
sf -0.99999994
pf -1.00000012
spf -1
psf -1
f 16
sf 16.0000019
pf 15.999999
spf 16
psf 16
f 7
sf 7.00000048
pf 6.99999952
spf 7
psf 7
f 0.699999988
sf 0.700000048
pf 0.699999928
spf 0.699999988
psf 0.699999988
f inf
sf inf
pf inf
spf inf
psf inf
f nan
sf nan
pf nan
spf nan
psf nan
f 3.40282347e+38
sf inf
pf 3.40282326e+38
spf 3.40282347e+38
psf inf
f -3.40282347e+38
sf -3.40282326e+38
pf -inf
spf -inf
psf -3.40282347e+38
d 0
sd 4.94065645841246544e-324
pd -4.94065645841246544e-324
spd -9.88131291682493088e-324
psd 0
d -0
sd 4.94065645841246544e-324
pd -4.94065645841246544e-324
spd -9.88131291682493088e-324
psd 0
d 1
sd 1.00000000000000022
pd 0.999999999999999889
spd 1
psd 1
d -1
sd -1.00000000000000022
pd -0.999999999999999889
spd -1
psd -1
d 16
sd 16.0000000000000036
pd 15.9999999999999982
spd 16
psd 16
d 7
sd 7.00000000000000089
pd 6.99999999999999911
spd 7
psd 7
d 0.699999999999999956
sd 0.700000000000000067
pd 0.699999999999999845
spd 0.699999999999999956
psd 0.699999999999999956
d inf
sd inf
pd inf
spd inf
psd inf
d nan
sd nan
pd nan
spd nan
psd nan
d 1.79769313486231571e+308
sd inf
pd 1.79769313486231551e+308
spd 1.79769313486231571e+308
psd inf
d -1.79769313486231571e+308
sd -inf
pd -1.79769313486231551e+308
spd -1.79769313486231571e+308
psd -inf
ok
Testing 4x4 and 3x3 matrix inversion:
M44f
M33f
ok
Testing functions in ImathFrustum.h
perspective 123
planes
exceptions 123
orthographic 1
planes
passed inequality test
passed equality test
ok
Testing random number generators
erand48(), nrand48()
Rand32
values
differences between successive values
range
Rand48
values
differences between successive values
range
solidSphereRand()
hollowSphereRand()
ok
Testing extraction of rotation angle from 3x3 matrices
Testing extraction of Euler angles from matrices
extractEulerXYZ()
order = 101
extractEulerZYX()
order = 2001
Eulerf::extract()
order = 101
order = 1
order = 1101
order = 1001
order = 2101
order = 2001
order = 11
order = 111
order = 1011
order = 1111
order = 2011
order = 2111
order = 2000
order = 2100
order = 1000
order = 1100
order = 0
order = 100
order = 2110
order = 2010
order = 1110
order = 1010
order = 110
order = 10
ok
Testing extraction of scale, shear, rotation, translation from matrices
Imath::extractSHRT()
random angles
3x3
4x4
special angles
3x3
4x4
ok
Testing quaternion rotations
exact 90-degree rotations
exact zero-degree rotations
exact 180-degree rotations
other angles
random from and to vectors
nearly equal from and to vectors
nearly opposite from and to vectors
ok
Testing quaternion spherical linear interpolation
combinations of 90-degree rotations around x, y and z
random rotations
ok
Testing line algorithms
closest points on two lines
non-intersecting, non-parallel lines
intersecting, non-parallel lines
parallel lines
coincident lines
random lines
line-triangle intersection
line-plane intersection inside triangle
line-plane intersection outside triangle
line parallel to triangle
zero-area triangle
random lines and triangles
ok
Testing box algorithms
ray-box intersection, random rays
box = ((-1 -1 -1) (1 1 1))
ray starts inside box
ray starts outside box, intersects
ray starts outside box, does not intersect
box = ((10 20 30) (1010 21 31))
ray starts inside box
ray starts outside box, intersects
ray starts outside box, does not intersect
box = ((10 20 30) (11 1020 31))
ray starts inside box
ray starts outside box, intersects
ray starts outside box, does not intersect
box = ((10 20 30) (11 21 1030))
ray starts inside box
ray starts outside box, intersects
ray starts outside box, does not intersect
box = ((-1e+10 -2e+10 -3e+10) (5e+15 6e+15 7e+15))
ray starts inside box
ray starts outside box, intersects
ray starts outside box, does not intersect
box = ((1 1 1) (2 1 1))
ray starts inside box
ray starts outside box, intersects
ray starts outside box, does not intersect
box = ((1 1 1) (1 2 1))
ray starts inside box
ray starts outside box, intersects
ray starts outside box, does not intersect
box = ((1 1 1) (1 1 2))
ray starts inside box
ray starts outside box, intersects
ray starts outside box, does not intersect
box = ((1 1 1) (1 2 3))
ray starts inside box
ray starts outside box, intersects
ray starts outside box, does not intersect
box = ((1 1 1) (2 3 1))
ray starts inside box
ray starts outside box, intersects
ray starts outside box, does not intersect
box = ((1 1 1) (2 1 3))
ray starts inside box
ray starts outside box, intersects
ray starts outside box, does not intersect
box = ((-1 -2 1) (-1 -2 1))
single-point box, ray intersects
single-point box, ray does not intersect
box = ((1 1 1) (1 1 1))
single-point box, ray intersects
single-point box, ray does not intersect
box = ((0 0 0) (0 0 0))
single-point box, ray intersects
single-point box, ray does not intersect
empty box, no rays intersect
ray-box intersection, nearly axis-parallel rays
dir ~ (1 0 0), result = 1
dir ~ (-1 0 0), result = 1
dir ~ (1 0 0), result = 0
dir ~ (-1 0 0), result = 0
dir ~ (0 1 0), result = 1
dir ~ (0 -1 0), result = 1
dir ~ (0 1 0), result = 0
dir ~ (0 -1 0), result = 0
dir ~ (0 0 1), result = 1
dir ~ (0 0 -1), result = 1
dir ~ (0 0 1), result = 0
dir ~ (0 0 -1), result = 0
transform box by matrix
ok
PASS: ImathTest
==================
All 1 tests passed
==================
make[4]: Leaving directory `/build/buildd/ilmbase-1.0.1/ImathTest'
make[3]: Leaving directory `/build/buildd/ilmbase-1.0.1/ImathTest'
Making check in IlmThread
make[3]: Entering directory `/build/buildd/ilmbase-1.0.1/IlmThread'
make[3]: Nothing to be done for `check'.
make[3]: Leaving directory `/build/buildd/ilmbase-1.0.1/IlmThread'
Making check in config
make[3]: Entering directory `/build/buildd/ilmbase-1.0.1/config'
make[3]: Leaving directory `/build/buildd/ilmbase-1.0.1/config'
make[3]: Entering directory `/build/buildd/ilmbase-1.0.1'
make[3]: Nothing to be done for `check-am'.
make[3]: Leaving directory `/build/buildd/ilmbase-1.0.1'
make[2]: Leaving directory `/build/buildd/ilmbase-1.0.1'
make[1]: Leaving directory `/build/buildd/ilmbase-1.0.1'
touch build-stamp
dh build
/usr/bin/fakeroot debian/rules binary-arch
dh binary-arch
dh_testroot -a
dh_prep -a
dh_installdirs -a
dh_auto_install -a
make[1]: Entering directory `/build/buildd/ilmbase-1.0.1'
Making install in Half
make[2]: Entering directory `/build/buildd/ilmbase-1.0.1/Half'
make install-am
make[3]: Entering directory `/build/buildd/ilmbase-1.0.1/Half'
make[4]: Entering directory `/build/buildd/ilmbase-1.0.1/Half'
test -z "/usr/lib" || mkdir -p -- "/build/buildd/ilmbase-1.0.1/debian/tmp/usr/lib"
/bin/bash ../libtool --mode=install /usr/bin/install -c 'libHalf.la' '/build/buildd/ilmbase-1.0.1/debian/tmp/usr/lib/libHalf.la'
/usr/bin/install -c .libs/libHalf.so.6.0.0 /build/buildd/ilmbase-1.0.1/debian/tmp/usr/lib/libHalf.so.6.0.0
(cd /build/buildd/ilmbase-1.0.1/debian/tmp/usr/lib && rm -f libHalf.so.6 && ln -s libHalf.so.6.0.0 libHalf.so.6)
(cd /build/buildd/ilmbase-1.0.1/debian/tmp/usr/lib && rm -f libHalf.so && ln -s libHalf.so.6.0.0 libHalf.so)
/usr/bin/install -c .libs/libHalf.lai /build/buildd/ilmbase-1.0.1/debian/tmp/usr/lib/libHalf.la
/usr/bin/install -c .libs/libHalf.a /build/buildd/ilmbase-1.0.1/debian/tmp/usr/lib/libHalf.a
ranlib /build/buildd/ilmbase-1.0.1/debian/tmp/usr/lib/libHalf.a
chmod 644 /build/buildd/ilmbase-1.0.1/debian/tmp/usr/lib/libHalf.a
libtool: install: warning: remember to run `libtool --finish /usr/lib'
test -z "/usr/include/OpenEXR" || mkdir -p -- "/build/buildd/ilmbase-1.0.1/debian/tmp/usr/include/OpenEXR"
/usr/bin/install -c -m 644 'half.h' '/build/buildd/ilmbase-1.0.1/debian/tmp/usr/include/OpenEXR/half.h'
/usr/bin/install -c -m 644 'halfFunction.h' '/build/buildd/ilmbase-1.0.1/debian/tmp/usr/include/OpenEXR/halfFunction.h'
/usr/bin/install -c -m 644 'halfLimits.h' '/build/buildd/ilmbase-1.0.1/debian/tmp/usr/include/OpenEXR/halfLimits.h'
make[4]: Leaving directory `/build/buildd/ilmbase-1.0.1/Half'
make[3]: Leaving directory `/build/buildd/ilmbase-1.0.1/Half'
make[2]: Leaving directory `/build/buildd/ilmbase-1.0.1/Half'
Making install in HalfTest
make[2]: Entering directory `/build/buildd/ilmbase-1.0.1/HalfTest'
make[3]: Entering directory `/build/buildd/ilmbase-1.0.1/HalfTest'
make[3]: Nothing to be done for `install-exec-am'.
make[3]: Nothing to be done for `install-data-am'.
make[3]: Leaving directory `/build/buildd/ilmbase-1.0.1/HalfTest'
make[2]: Leaving directory `/build/buildd/ilmbase-1.0.1/HalfTest'
Making install in Iex
make[2]: Entering directory `/build/buildd/ilmbase-1.0.1/Iex'
make[3]: Entering directory `/build/buildd/ilmbase-1.0.1/Iex'
test -z "/usr/lib" || mkdir -p -- "/build/buildd/ilmbase-1.0.1/debian/tmp/usr/lib"
/bin/bash ../libtool --mode=install /usr/bin/install -c 'libIex.la' '/build/buildd/ilmbase-1.0.1/debian/tmp/usr/lib/libIex.la'
/usr/bin/install -c .libs/libIex.so.6.0.0 /build/buildd/ilmbase-1.0.1/debian/tmp/usr/lib/libIex.so.6.0.0
(cd /build/buildd/ilmbase-1.0.1/debian/tmp/usr/lib && rm -f libIex.so.6 && ln -s libIex.so.6.0.0 libIex.so.6)
(cd /build/buildd/ilmbase-1.0.1/debian/tmp/usr/lib && rm -f libIex.so && ln -s libIex.so.6.0.0 libIex.so)
/usr/bin/install -c .libs/libIex.lai /build/buildd/ilmbase-1.0.1/debian/tmp/usr/lib/libIex.la
/usr/bin/install -c .libs/libIex.a /build/buildd/ilmbase-1.0.1/debian/tmp/usr/lib/libIex.a
ranlib /build/buildd/ilmbase-1.0.1/debian/tmp/usr/lib/libIex.a
chmod 644 /build/buildd/ilmbase-1.0.1/debian/tmp/usr/lib/libIex.a
libtool: install: warning: remember to run `libtool --finish /usr/lib'
test -z "/usr/include/OpenEXR" || mkdir -p -- "/build/buildd/ilmbase-1.0.1/debian/tmp/usr/include/OpenEXR"
/usr/bin/install -c -m 644 'IexBaseExc.h' '/build/buildd/ilmbase-1.0.1/debian/tmp/usr/include/OpenEXR/IexBaseExc.h'
/usr/bin/install -c -m 644 'IexMathExc.h' '/build/buildd/ilmbase-1.0.1/debian/tmp/usr/include/OpenEXR/IexMathExc.h'
/usr/bin/install -c -m 644 'IexThrowErrnoExc.h' '/build/buildd/ilmbase-1.0.1/debian/tmp/usr/include/OpenEXR/IexThrowErrnoExc.h'
/usr/bin/install -c -m 644 'IexErrnoExc.h' '/build/buildd/ilmbase-1.0.1/debian/tmp/usr/include/OpenEXR/IexErrnoExc.h'
/usr/bin/install -c -m 644 'IexMacros.h' '/build/buildd/ilmbase-1.0.1/debian/tmp/usr/include/OpenEXR/IexMacros.h'
/usr/bin/install -c -m 644 'Iex.h' '/build/buildd/ilmbase-1.0.1/debian/tmp/usr/include/OpenEXR/Iex.h'
make[3]: Leaving directory `/build/buildd/ilmbase-1.0.1/Iex'
make[2]: Leaving directory `/build/buildd/ilmbase-1.0.1/Iex'
Making install in IexTest
make[2]: Entering directory `/build/buildd/ilmbase-1.0.1/IexTest'
make[3]: Entering directory `/build/buildd/ilmbase-1.0.1/IexTest'
make[3]: Nothing to be done for `install-exec-am'.
make[3]: Nothing to be done for `install-data-am'.
make[3]: Leaving directory `/build/buildd/ilmbase-1.0.1/IexTest'
make[2]: Leaving directory `/build/buildd/ilmbase-1.0.1/IexTest'
Making install in Imath
make[2]: Entering directory `/build/buildd/ilmbase-1.0.1/Imath'
make[3]: Entering directory `/build/buildd/ilmbase-1.0.1/Imath'
test -z "/usr/lib" || mkdir -p -- "/build/buildd/ilmbase-1.0.1/debian/tmp/usr/lib"
/bin/bash ../libtool --mode=install /usr/bin/install -c 'libImath.la' '/build/buildd/ilmbase-1.0.1/debian/tmp/usr/lib/libImath.la'
libtool: install: warning: relinking `libImath.la'
(cd /build/buildd/ilmbase-1.0.1/Imath; /bin/bash ../libtool --tag=CXX --mode=relink g++ -pipe -g -O2 -Wl,-Bsymbolic-functions -o libImath.la -rpath /usr/lib -version-info 6:0:0 -no-undefined ImathShear.lo ImathMatrixAlgo.lo ImathVec.lo ImathColorAlgo.lo ImathFun.lo ImathBox.lo ImathRandom.lo ../Iex/libIex.la -lpthread -inst-prefix-dir /build/buildd/ilmbase-1.0.1/debian/tmp)
g++ -shared -nostdlib /usr/lib/gcc/sparc-linux-gnu/4.4.1/../../../../lib/crti.o /usr/lib/gcc/sparc-linux-gnu/4.4.1/crtbeginS.o .libs/ImathShear.o .libs/ImathMatrixAlgo.o .libs/ImathVec.o .libs/ImathColorAlgo.o .libs/ImathFun.o .libs/ImathBox.o .libs/ImathRandom.o -L/build/buildd/ilmbase-1.0.1/debian/tmp/usr/lib -L/usr/lib -lIex -lpthread -L/usr/lib/gcc/sparc-linux-gnu/4.4.1 -L/usr/lib/gcc/sparc-linux-gnu/4.4.1/../../../../lib -L/lib/../lib -L/usr/lib/../lib -L/usr/lib/gcc/sparc-linux-gnu/4.4.1/../../.. -lstdc++ -lm -lc -lgcc_s /usr/lib/gcc/sparc-linux-gnu/4.4.1/crtendS.o /usr/lib/gcc/sparc-linux-gnu/4.4.1/../../../../lib/crtn.o -Wl,-Bsymbolic-functions -Wl,-soname -Wl,libImath.so.6 -o .libs/libImath.so.6.0.0
/usr/bin/install -c .libs/libImath.so.6.0.0T /build/buildd/ilmbase-1.0.1/debian/tmp/usr/lib/libImath.so.6.0.0
(cd /build/buildd/ilmbase-1.0.1/debian/tmp/usr/lib && rm -f libImath.so.6 && ln -s libImath.so.6.0.0 libImath.so.6)
(cd /build/buildd/ilmbase-1.0.1/debian/tmp/usr/lib && rm -f libImath.so && ln -s libImath.so.6.0.0 libImath.so)
/usr/bin/install -c .libs/libImath.lai /build/buildd/ilmbase-1.0.1/debian/tmp/usr/lib/libImath.la
/usr/bin/install -c .libs/libImath.a /build/buildd/ilmbase-1.0.1/debian/tmp/usr/lib/libImath.a
ranlib /build/buildd/ilmbase-1.0.1/debian/tmp/usr/lib/libImath.a
chmod 644 /build/buildd/ilmbase-1.0.1/debian/tmp/usr/lib/libImath.a
libtool: install: warning: remember to run `libtool --finish /usr/lib'
test -z "/usr/include/OpenEXR" || mkdir -p -- "/build/buildd/ilmbase-1.0.1/debian/tmp/usr/include/OpenEXR"
/usr/bin/install -c -m 644 'ImathColorAlgo.h' '/build/buildd/ilmbase-1.0.1/debian/tmp/usr/include/OpenEXR/ImathColorAlgo.h'
/usr/bin/install -c -m 644 'ImathMatrixAlgo.h' '/build/buildd/ilmbase-1.0.1/debian/tmp/usr/include/OpenEXR/ImathMatrixAlgo.h'
/usr/bin/install -c -m 644 'ImathVec.h' '/build/buildd/ilmbase-1.0.1/debian/tmp/usr/include/OpenEXR/ImathVec.h'
/usr/bin/install -c -m 644 'ImathShear.h' '/build/buildd/ilmbase-1.0.1/debian/tmp/usr/include/OpenEXR/ImathShear.h'
/usr/bin/install -c -m 644 'ImathFun.h' '/build/buildd/ilmbase-1.0.1/debian/tmp/usr/include/OpenEXR/ImathFun.h'
/usr/bin/install -c -m 644 'ImathBox.h' '/build/buildd/ilmbase-1.0.1/debian/tmp/usr/include/OpenEXR/ImathBox.h'
/usr/bin/install -c -m 644 'ImathBoxAlgo.h' '/build/buildd/ilmbase-1.0.1/debian/tmp/usr/include/OpenEXR/ImathBoxAlgo.h'
/usr/bin/install -c -m 644 'ImathEuler.h' '/build/buildd/ilmbase-1.0.1/debian/tmp/usr/include/OpenEXR/ImathEuler.h'
/usr/bin/install -c -m 644 'ImathExc.h' '/build/buildd/ilmbase-1.0.1/debian/tmp/usr/include/OpenEXR/ImathExc.h'
/usr/bin/install -c -m 644 'ImathLimits.h' '/build/buildd/ilmbase-1.0.1/debian/tmp/usr/include/OpenEXR/ImathLimits.h'
/usr/bin/install -c -m 644 'ImathLine.h' '/build/buildd/ilmbase-1.0.1/debian/tmp/usr/include/OpenEXR/ImathLine.h'
/usr/bin/install -c -m 644 'ImathLineAlgo.h' '/build/buildd/ilmbase-1.0.1/debian/tmp/usr/include/OpenEXR/ImathLineAlgo.h'
/usr/bin/install -c -m 644 'ImathMatrix.h' '/build/buildd/ilmbase-1.0.1/debian/tmp/usr/include/OpenEXR/ImathMatrix.h'
/usr/bin/install -c -m 644 'ImathPlane.h' '/build/buildd/ilmbase-1.0.1/debian/tmp/usr/include/OpenEXR/ImathPlane.h'
/usr/bin/install -c -m 644 'ImathSphere.h' '/build/buildd/ilmbase-1.0.1/debian/tmp/usr/include/OpenEXR/ImathSphere.h'
/usr/bin/install -c -m 644 'ImathVecAlgo.h' '/build/buildd/ilmbase-1.0.1/debian/tmp/usr/include/OpenEXR/ImathVecAlgo.h'
/usr/bin/install -c -m 644 'ImathQuat.h' '/build/buildd/ilmbase-1.0.1/debian/tmp/usr/include/OpenEXR/ImathQuat.h'
/usr/bin/install -c -m 644 'ImathFrustum.h' '/build/buildd/ilmbase-1.0.1/debian/tmp/usr/include/OpenEXR/ImathFrustum.h'
/usr/bin/install -c -m 644 'ImathMath.h' '/build/buildd/ilmbase-1.0.1/debian/tmp/usr/include/OpenEXR/ImathMath.h'
/usr/bin/install -c -m 644 'ImathGL.h' '/build/buildd/ilmbase-1.0.1/debian/tmp/usr/include/OpenEXR/ImathGL.h'
/usr/bin/install -c -m 644 'ImathColor.h' '/build/buildd/ilmbase-1.0.1/debian/tmp/usr/include/OpenEXR/ImathColor.h'
/usr/bin/install -c -m 644 'ImathRandom.h' '/build/buildd/ilmbase-1.0.1/debian/tmp/usr/include/OpenEXR/ImathRandom.h'
/usr/bin/install -c -m 644 'ImathRoots.h' '/build/buildd/ilmbase-1.0.1/debian/tmp/usr/include/OpenEXR/ImathRoots.h'
/usr/bin/install -c -m 644 'ImathHalfLimits.h' '/build/buildd/ilmbase-1.0.1/debian/tmp/usr/include/OpenEXR/ImathHalfLimits.h'
/usr/bin/install -c -m 644 'ImathInterval.h' '/build/buildd/ilmbase-1.0.1/debian/tmp/usr/include/OpenEXR/ImathInterval.h'
/usr/bin/install -c -m 644 'ImathGLU.h' '/build/buildd/ilmbase-1.0.1/debian/tmp/usr/include/OpenEXR/ImathGLU.h'
/usr/bin/install -c -m 644 'ImathFrame.h' '/build/buildd/ilmbase-1.0.1/debian/tmp/usr/include/OpenEXR/ImathFrame.h'
/usr/bin/install -c -m 644 'ImathPlatform.h' '/build/buildd/ilmbase-1.0.1/debian/tmp/usr/include/OpenEXR/ImathPlatform.h'
/usr/bin/install -c -m 644 'ImathInt64.h' '/build/buildd/ilmbase-1.0.1/debian/tmp/usr/include/OpenEXR/ImathInt64.h'
make[3]: Leaving directory `/build/buildd/ilmbase-1.0.1/Imath'
make[2]: Leaving directory `/build/buildd/ilmbase-1.0.1/Imath'
Making install in ImathTest
make[2]: Entering directory `/build/buildd/ilmbase-1.0.1/ImathTest'
make[3]: Entering directory `/build/buildd/ilmbase-1.0.1/ImathTest'
make[3]: Nothing to be done for `install-exec-am'.
make[3]: Nothing to be done for `install-data-am'.
make[3]: Leaving directory `/build/buildd/ilmbase-1.0.1/ImathTest'
make[2]: Leaving directory `/build/buildd/ilmbase-1.0.1/ImathTest'
Making install in IlmThread
make[2]: Entering directory `/build/buildd/ilmbase-1.0.1/IlmThread'
make[3]: Entering directory `/build/buildd/ilmbase-1.0.1/IlmThread'
test -z "/usr/lib" || mkdir -p -- "/build/buildd/ilmbase-1.0.1/debian/tmp/usr/lib"
/bin/bash ../libtool --mode=install /usr/bin/install -c 'libIlmThread.la' '/build/buildd/ilmbase-1.0.1/debian/tmp/usr/lib/libIlmThread.la'
libtool: install: warning: relinking `libIlmThread.la'
(cd /build/buildd/ilmbase-1.0.1/IlmThread; /bin/bash ../libtool --tag=CXX --mode=relink g++ -pipe -g -O2 -Wl,-Bsymbolic-functions -o libIlmThread.la -rpath /usr/lib -version-info 6:0:0 -no-undefined IlmThreadPool.lo IlmThread.lo IlmThreadSemaphore.lo IlmThreadMutex.lo IlmThreadPosix.lo IlmThreadSemaphorePosix.lo IlmThreadSemaphorePosixCompat.lo IlmThreadMutexPosix.lo ../Iex/libIex.la -lpthread -inst-prefix-dir /build/buildd/ilmbase-1.0.1/debian/tmp)
g++ -shared -nostdlib /usr/lib/gcc/sparc-linux-gnu/4.4.1/../../../../lib/crti.o /usr/lib/gcc/sparc-linux-gnu/4.4.1/crtbeginS.o .libs/IlmThreadPool.o .libs/IlmThread.o .libs/IlmThreadSemaphore.o .libs/IlmThreadMutex.o .libs/IlmThreadPosix.o .libs/IlmThreadSemaphorePosix.o .libs/IlmThreadSemaphorePosixCompat.o .libs/IlmThreadMutexPosix.o -L/build/buildd/ilmbase-1.0.1/debian/tmp/usr/lib -L/usr/lib -lIex -lpthread -L/usr/lib/gcc/sparc-linux-gnu/4.4.1 -L/usr/lib/gcc/sparc-linux-gnu/4.4.1/../../../../lib -L/lib/../lib -L/usr/lib/../lib -L/usr/lib/gcc/sparc-linux-gnu/4.4.1/../../.. -lstdc++ -lm -lc -lgcc_s /usr/lib/gcc/sparc-linux-gnu/4.4.1/crtendS.o /usr/lib/gcc/sparc-linux-gnu/4.4.1/../../../../lib/crtn.o -Wl,-Bsymbolic-functions -Wl,-soname -Wl,libIlmThread.so.6 -o .libs/libIlmThread.so.6.0.0
/usr/bin/install -c .libs/libIlmThread.so.6.0.0T /build/buildd/ilmbase-1.0.1/debian/tmp/usr/lib/libIlmThread.so.6.0.0
(cd /build/buildd/ilmbase-1.0.1/debian/tmp/usr/lib && rm -f libIlmThread.so.6 && ln -s libIlmThread.so.6.0.0 libIlmThread.so.6)
(cd /build/buildd/ilmbase-1.0.1/debian/tmp/usr/lib && rm -f libIlmThread.so && ln -s libIlmThread.so.6.0.0 libIlmThread.so)
/usr/bin/install -c .libs/libIlmThread.lai /build/buildd/ilmbase-1.0.1/debian/tmp/usr/lib/libIlmThread.la
/usr/bin/install -c .libs/libIlmThread.a /build/buildd/ilmbase-1.0.1/debian/tmp/usr/lib/libIlmThread.a
ranlib /build/buildd/ilmbase-1.0.1/debian/tmp/usr/lib/libIlmThread.a
chmod 644 /build/buildd/ilmbase-1.0.1/debian/tmp/usr/lib/libIlmThread.a
libtool: install: warning: remember to run `libtool --finish /usr/lib'
test -z "/usr/include/OpenEXR" || mkdir -p -- "/build/buildd/ilmbase-1.0.1/debian/tmp/usr/include/OpenEXR"
/usr/bin/install -c -m 644 'IlmThreadPool.h' '/build/buildd/ilmbase-1.0.1/debian/tmp/usr/include/OpenEXR/IlmThreadPool.h'
/usr/bin/install -c -m 644 'IlmThread.h' '/build/buildd/ilmbase-1.0.1/debian/tmp/usr/include/OpenEXR/IlmThread.h'
/usr/bin/install -c -m 644 'IlmThreadSemaphore.h' '/build/buildd/ilmbase-1.0.1/debian/tmp/usr/include/OpenEXR/IlmThreadSemaphore.h'
/usr/bin/install -c -m 644 'IlmThreadMutex.h' '/build/buildd/ilmbase-1.0.1/debian/tmp/usr/include/OpenEXR/IlmThreadMutex.h'
make[3]: Leaving directory `/build/buildd/ilmbase-1.0.1/IlmThread'
make[2]: Leaving directory `/build/buildd/ilmbase-1.0.1/IlmThread'
Making install in config
make[2]: Entering directory `/build/buildd/ilmbase-1.0.1/config'
make[3]: Entering directory `/build/buildd/ilmbase-1.0.1/config'
make[3]: Nothing to be done for `install-exec-am'.
test -z "/usr/include/OpenEXR" || mkdir -p -- "/build/buildd/ilmbase-1.0.1/debian/tmp/usr/include/OpenEXR"
/usr/bin/install -c -m 644 'IlmBaseConfig.h' '/build/buildd/ilmbase-1.0.1/debian/tmp/usr/include/OpenEXR/IlmBaseConfig.h'
make[3]: Leaving directory `/build/buildd/ilmbase-1.0.1/config'
make[2]: Leaving directory `/build/buildd/ilmbase-1.0.1/config'
make[2]: Entering directory `/build/buildd/ilmbase-1.0.1'
make[3]: Entering directory `/build/buildd/ilmbase-1.0.1'
make[3]: Nothing to be done for `install-exec-am'.
test -z "/usr/lib/pkgconfig" || mkdir -p -- "/build/buildd/ilmbase-1.0.1/debian/tmp/usr/lib/pkgconfig"
/usr/bin/install -c -m 644 'IlmBase.pc' '/build/buildd/ilmbase-1.0.1/debian/tmp/usr/lib/pkgconfig/IlmBase.pc'
make[3]: Leaving directory `/build/buildd/ilmbase-1.0.1'
make[2]: Leaving directory `/build/buildd/ilmbase-1.0.1'
make[1]: Leaving directory `/build/buildd/ilmbase-1.0.1'
dh_install -a
debian/rules override_dh_installdocs
make[1]: Entering directory `/build/buildd/ilmbase-1.0.1'
dh_installdocs AUTHORS NEWS README
make[1]: Leaving directory `/build/buildd/ilmbase-1.0.1'
dh_installchangelogs -a
dh_installexamples -a
dh_installman -a
dh_installcatalogs -a
dh_installcron -a
dh_installdebconf -a
dh_installcatalogs -a
dh_installemacsen -a
dh_installifupdown -a
dh_installinfo -a
dh_installinit -a
dh_installmenu -a
dh_installmime -a
dh_installmodules -a
dh_installlogcheck -a
dh_installlogrotate -a
dh_installpam -a
dh_installppp -a
dh_installudev -a
dh_installwm -a
dh_installxfonts -a
dh_bugfiles -a
dh_lintian -a
dh_gconf -a
dh_icons -a
dh_perl -a
dh_pysupport -a
Traceback (most recent call last):
File "/usr/share/python-support/private/movemodules", line 9, in <module>
from hashlib import md5
File "/usr/lib/python2.6/hashlib.py", line 136, in <module>
md5 = __get_builtin_constructor('md5')
File "/usr/lib/python2.6/hashlib.py", line 63, in __get_builtin_constructor
import _md5
ImportError: No module named _md5
dh_pysupport: /usr/share/python-support/private/movemodules returned exit code 1
make: *** [binary-arch] Error 1
dpkg-buildpackage: error: /usr/bin/fakeroot debian/rules binary-arch gave error exit status 2
******************************************************************************
Build finished at 20091004-0557
FAILED [dpkg-buildpackage died]
Purging chroot-karmic-autotest/build/buildd/ilmbase-1.0.1
------------------------------------------------------------------------------
/usr/bin/sudo dpkg --root=/srv/home/buildd/build-karmic-autotest/chroot-karmic-autotest --purge intltool-debian groff-base libglib2.0-0 gettext file diffstat html2text gettext-base debhelper autotools-dev po-debconf quilt libcroco3 libmagic1 libxml2 bsdmainutils libpcre3 man-db
(Reading database ... 12140 files and directories currently installed.)
Removing debhelper ...
dpkg - warning: while removing debhelper, directory `/usr/share/debhelper/autoscripts' not empty so not removed.
dpkg - warning: while removing debhelper, directory `/usr/share/debhelper' not empty so not removed.
Removing autotools-dev ...
Removing po-debconf ...
Removing quilt ...
Purging configuration files for quilt ...
dpkg - warning: while removing quilt, directory `/usr/share/perl5/Debian/Debhelper/Sequence' not empty so not removed.
dpkg - warning: while removing quilt, directory `/usr/share/perl5/Debian/Debhelper' not empty so not removed.
Removing man-db ...
Purging configuration files for man-db ...
Removing catpages as well as /var/cache/man hierarchy.
debconf: unable to initialize frontend: Dialog
debconf: (Dialog frontend will not work on a dumb terminal, an emacs shell buffer, or without a controlling terminal.)
debconf: falling back to frontend: Readline
debconf: unable to initialize frontend: Readline
debconf: (This frontend requires a controlling tty.)
debconf: falling back to frontend: Teletype
dpkg - warning: while removing man-db, directory `/usr/lib/man-db' not empty so not removed.
dpkg - warning: while removing man-db, directory `/usr/share/bug/man-db' not empty so not removed.
dpkg - warning: while removing man-db, directory `/usr/share/doc/man-db/examples' not empty so not removed.
dpkg - warning: while removing man-db, directory `/usr/share/doc/man-db' not empty so not removed.
dpkg - warning: while removing man-db, directory `/usr/share/man/id/man5' not empty so not removed.
dpkg - warning: while removing man-db, directory `/usr/share/man-db' not empty so not removed.
Removing intltool-debian ...
Removing groff-base ...
Purging configuration files for groff-base ...
Removing gettext ...
install-info: warning: maintainer scripts should not call install-info anymore,
install-info: warning: this is handled now by a dpkg trigger provided by the
install-info: warning: install-info package; package gettext should be updated.
Removing file ...
Purging configuration files for file ...
Removing diffstat ...
Removing html2text ...
Purging configuration files for html2text ...
Removing gettext-base ...
Removing libcroco3 ...
Purging configuration files for libcroco3 ...
Removing libmagic1 ...
Purging configuration files for libmagic1 ...
Removing libxml2 ...
Purging configuration files for libxml2 ...
Removing bsdmainutils ...
Purging configuration files for bsdmainutils ...
Removing libglib2.0-0 ...
Purging configuration files for libglib2.0-0 ...
Removing libpcre3 ...
Purging configuration files for libpcre3 ...
Processing triggers for libc-bin ...
ldconfig deferred processing now taking place
******************************************************************************
Finished at 20091004-0557
Build needed 00:02:45, 20184k disk space
More information about the ubuntu-autotest
mailing list