Log for failed build of taglib-extras_1.0.1-0ubuntu1 (dist=karmic-autotest)

Build Daemon user noreply at buildd.ubuntu.com
Sat Oct 3 22:21:50 BST 2009


Automatic build of taglib-extras_1.0.1-0ubuntu1 on terranova by sbuild/i386 1.170.5
Build started at 20091003-2221
******************************************************************************
Checking available source versions...
Fetching source files...
Reading package lists...
Building dependency tree...
Reading state information...
NOTICE: 'taglib-extras' packaging is maintained in the 'Git' version control system at:
git://git.debian.org/git/users/modax-guest/taglib-extras.git
Need to get 37.0kB of source archives.
Get:1 http://ftpmaster.internal karmic/main taglib-extras 1.0.1-0ubuntu1 (dsc) [1378B]
Get:2 http://ftpmaster.internal karmic/main taglib-extras 1.0.1-0ubuntu1 (tar) [31.4kB]
Get:3 http://ftpmaster.internal karmic/main taglib-extras 1.0.1-0ubuntu1 (diff) [4230B]
Fetched 37.0kB in 0s (1932kB/s)
Download complete and in download only mode
** Using build dependencies supplied by package:
Build-Depends: debhelper (>= 7.3), cmake (>= 2.6.2), dpkg-dev (>= 1.15.3), pkg-kde-tools (>= 0.4), libtag1-dev (>= 1.6)
Checking for already installed source dependencies...
debhelper: missing
cmake: missing
dpkg-dev: already installed (1.15.4ubuntu2 >= 1.15.3 is satisfied)
pkg-kde-tools: missing
libtag1-dev: missing
Checking for source dependency conflicts...
  /usr/bin/sudo /usr/bin/apt-get --purge $CHROOT_OPTIONS -q -y install debhelper cmake pkg-kde-tools libtag1-dev
Reading package lists...
Building dependency tree...
Reading state information...
The following extra packages will be installed:
  bsdmainutils cmake-data emacsen-common file gettext gettext-base groff-base
  html2text intltool-debian libcroco3 libcurl3 libexpat1 libglib2.0-0
  libmagic1 libpcre3 libtag1-vanilla libtag1c2a libxml2 libxmlrpc-core-c3
  man-db po-debconf
Suggested packages:
  wamerican wordlist whois vacation dh-make cvs gettext-doc groff less
  www-browser cdbs libmail-box-perl
Recommended packages:
  curl wget lynx libglib2.0-data shared-mime-info xml-core
  libmail-sendmail-perl
The following NEW packages will be installed:
  bsdmainutils cmake cmake-data debhelper emacsen-common file gettext
  gettext-base groff-base html2text intltool-debian libcroco3 libcurl3
  libexpat1 libglib2.0-0 libmagic1 libpcre3 libtag1-dev libtag1-vanilla
  libtag1c2a libxml2 libxmlrpc-core-c3 man-db pkg-kde-tools po-debconf
0 upgraded, 25 newly installed, 0 to remove and 0 not upgraded.
Need to get 0B/13.5MB of archives.
After this operation, 42.4MB of additional disk space will be used.
WARNING: The following packages cannot be authenticated!
  libmagic1 file libpcre3 libglib2.0-0 libxml2 bsdmainutils gettext-base
  groff-base libexpat1 man-db libcurl3 libxmlrpc-core-c3 emacsen-common
  cmake-data cmake html2text libcroco3 gettext intltool-debian po-debconf
  debhelper libtag1-vanilla libtag1c2a libtag1-dev pkg-kde-tools
debconf: unable to initialize frontend: Dialog
debconf: (Dialog frontend will not work on a dumb terminal, an emacs shell buffer, or without a controlling terminal.)
debconf: falling back to frontend: Readline
debconf: unable to initialize frontend: Readline
debconf: (This frontend requires a controlling tty.)
debconf: falling back to frontend: Teletype
dpkg-preconfigure: unable to re-open stdin: 
Authentication warning overridden.
Selecting previously deselected package libmagic1.
(Reading database ... 10669 files and directories currently installed.)
Unpacking libmagic1 (from .../libmagic1_5.03-1ubuntu1_i386.deb) ...
Selecting previously deselected package file.
Unpacking file (from .../file_5.03-1ubuntu1_i386.deb) ...
Selecting previously deselected package libpcre3.
Unpacking libpcre3 (from .../libpcre3_7.8-2ubuntu1_i386.deb) ...
Selecting previously deselected package libglib2.0-0.
Unpacking libglib2.0-0 (from .../libglib2.0-0_2.22.1-0ubuntu1_i386.deb) ...
Selecting previously deselected package libxml2.
Unpacking libxml2 (from .../libxml2_2.7.3.dfsg-1ubuntu2_i386.deb) ...
Selecting previously deselected package bsdmainutils.
Unpacking bsdmainutils (from .../bsdmainutils_6.1.10ubuntu4_i386.deb) ...
Selecting previously deselected package gettext-base.
Unpacking gettext-base (from .../gettext-base_0.17-6ubuntu2_i386.deb) ...
Selecting previously deselected package groff-base.
Unpacking groff-base (from .../groff-base_1.20.1-5_i386.deb) ...
Selecting previously deselected package libexpat1.
Unpacking libexpat1 (from .../libexpat1_2.0.1-4ubuntu1_i386.deb) ...
Selecting previously deselected package man-db.
Unpacking man-db (from .../man-db_2.5.6-2_i386.deb) ...
Selecting previously deselected package libcurl3.
Unpacking libcurl3 (from .../libcurl3_7.19.5-1ubuntu2_i386.deb) ...
Selecting previously deselected package libxmlrpc-core-c3.
Unpacking libxmlrpc-core-c3 (from .../libxmlrpc-core-c3_1.06.27-1ubuntu6_i386.deb) ...
Selecting previously deselected package emacsen-common.
Unpacking emacsen-common (from .../emacsen-common_1.4.19_all.deb) ...
Selecting previously deselected package cmake-data.
Unpacking cmake-data (from .../cmake-data_2.6.4-1ubuntu2_all.deb) ...
Selecting previously deselected package cmake.
Unpacking cmake (from .../cmake_2.6.4-1ubuntu2_i386.deb) ...
Selecting previously deselected package html2text.
Unpacking html2text (from .../html2text_1.3.2a-14_i386.deb) ...
Selecting previously deselected package libcroco3.
Unpacking libcroco3 (from .../libcroco3_0.6.1-2_i386.deb) ...
Selecting previously deselected package gettext.
Unpacking gettext (from .../gettext_0.17-6ubuntu2_i386.deb) ...
Selecting previously deselected package intltool-debian.
Unpacking intltool-debian (from .../intltool-debian_0.35.0+20060710.1_all.deb) ...
Selecting previously deselected package po-debconf.
Unpacking po-debconf (from .../po-debconf_1.0.16_all.deb) ...
Selecting previously deselected package debhelper.
Unpacking debhelper (from .../debhelper_7.3.15ubuntu3_all.deb) ...
Selecting previously deselected package libtag1-vanilla.
Unpacking libtag1-vanilla (from .../libtag1-vanilla_1.6-2ubuntu1_i386.deb) ...
Selecting previously deselected package libtag1c2a.
Unpacking libtag1c2a (from .../libtag1c2a_1.6-2ubuntu1_i386.deb) ...
Selecting previously deselected package libtag1-dev.
Unpacking libtag1-dev (from .../libtag1-dev_1.6-2ubuntu1_i386.deb) ...
Selecting previously deselected package pkg-kde-tools.
Unpacking pkg-kde-tools (from .../pkg-kde-tools_0.4.11ubuntu7_all.deb) ...
Setting up libmagic1 (5.03-1ubuntu1) ...

Setting up file (5.03-1ubuntu1) ...
Setting up libpcre3 (7.8-2ubuntu1) ...

Setting up libglib2.0-0 (2.22.1-0ubuntu1) ...

Setting up libxml2 (2.7.3.dfsg-1ubuntu2) ...

Setting up bsdmainutils (6.1.10ubuntu4) ...
update-alternatives: using /usr/bin/bsd-write to provide /usr/bin/write (write) in auto mode.

Setting up gettext-base (0.17-6ubuntu2) ...

Setting up groff-base (1.20.1-5) ...

Setting up libexpat1 (2.0.1-4ubuntu1) ...

Setting up man-db (2.5.6-2) ...
debconf: unable to initialize frontend: Dialog
debconf: (Dialog frontend will not work on a dumb terminal, an emacs shell buffer, or without a controlling terminal.)
debconf: falling back to frontend: Readline
Building database of manual pages ...
... skipping, since this is a buildd

Setting up libcurl3 (7.19.5-1ubuntu2) ...

Setting up libxmlrpc-core-c3 (1.06.27-1ubuntu6) ...

Setting up emacsen-common (1.4.19) ...
emacsen-common: Handling install of emacsen flavor emacs
install-info: warning: maintainer scripts should not call install-info anymore,
install-info: warning: this is handled now by a dpkg trigger provided by the
install-info: warning: install-info package; package emacsen-common should be updated.

Setting up cmake-data (2.6.4-1ubuntu2) ...
emacsen-common: Handling install of emacsen flavor emacs

Setting up cmake (2.6.4-1ubuntu2) ...
Setting up html2text (1.3.2a-14) ...

Setting up libcroco3 (0.6.1-2) ...

Setting up gettext (0.17-6ubuntu2) ...
install-info: warning: maintainer scripts should not call install-info anymore,
install-info: warning: this is handled now by a dpkg trigger provided by the
install-info: warning: install-info package; package gettext should be updated.

Setting up intltool-debian (0.35.0+20060710.1) ...
Setting up po-debconf (1.0.16) ...
Setting up debhelper (7.3.15ubuntu3) ...
Setting up libtag1-vanilla (1.6-2ubuntu1) ...

Setting up libtag1c2a (1.6-2ubuntu1) ...
Setting up libtag1-dev (1.6-2ubuntu1) ...
Setting up pkg-kde-tools (0.4.11ubuntu7) ...
Processing triggers for libc-bin ...
ldconfig deferred processing now taking place
Checking correctness of source dependencies...
Toolchain package versions: libc6-dev_2.10.1-0ubuntu13 make_3.81-6 dpkg-dev_1.15.4ubuntu2 linux-libc-dev_2.6.31-11.38 g++-4.4_4.4.1-4ubuntu5 gcc-4.4_4.4.1-4ubuntu5 binutils_2.19.91.20091001-0ubuntu2 libstdc++6_4.4.1-4ubuntu5 libstdc++6-4.4-dev_4.4.1-4ubuntu5
------------------------------------------------------------------------------
sh: gcc: not found
dpkg-source: warning: Couldn't determine gcc system type, falling back to default (native compilation)
gpg: Signature made Tue Sep 22 15:03:58 2009 BST using DSA key ID DD4D5088
gpg: Can't check signature: public key not found
dpkg-source: extracting taglib-extras in taglib-extras-1.0.1
dpkg-source: unpacking taglib-extras_1.0.1.orig.tar.gz
dpkg-source: applying /home/buildd/build-karmic-autotest/taglib-extras_1.0.1-0ubuntu1.diff.gz
dpkg-buildpackage: set CFLAGS to default value: -g -O2
dpkg-buildpackage: set CPPFLAGS to default value: 
dpkg-buildpackage: set LDFLAGS to default value: -Wl,-Bsymbolic-functions
dpkg-buildpackage: set FFLAGS to default value: -g -O2
dpkg-buildpackage: set CXXFLAGS to default value: -g -O2
dpkg-buildpackage: source package taglib-extras
dpkg-buildpackage: source version 1.0.1-0ubuntu1
dpkg-buildpackage: host architecture i386
 /usr/bin/fakeroot debian/rules clean
dh clean
   dh_testdir
   dh_auto_clean
   dh_clean
 debian/rules build
dh build
   dh_testdir
   dh_auto_configure
-- The C compiler identification is GNU
-- The CXX compiler identification is GNU
-- Check for working C compiler: /usr/bin/gcc
-- Check for working C compiler: /usr/bin/gcc -- works
-- Detecting C compiler ABI info
-- Detecting C compiler ABI info - done
-- Check for working CXX compiler: /usr/bin/c++
-- Check for working CXX compiler: /usr/bin/c++ -- works
-- Detecting CXX compiler ABI info
-- Detecting CXX compiler ABI info - done
-- Taglib found: -L/usr/lib -ltag
-- Looking for sys/types.h
-- Looking for sys/types.h - found
-- Looking for stdint.h
-- Looking for stdint.h - found
-- Looking for stddef.h
-- Looking for stddef.h - found
-- Check size of int
-- Check size of int - done
-- Check size of long
-- Check size of long - done
-- Looking for strings.h
-- Looking for strings.h - found
-- Looking for unistd.h
-- Looking for unistd.h - found
-- Configuring done
-- Generating done
-- Build files have been written to: /build/buildd/taglib-extras-1.0.1/obj-i486-linux-gnu
   dh_auto_build
make[1]: Entering directory `/build/buildd/taglib-extras-1.0.1/obj-i486-linux-gnu'
/usr/bin/cmake -H/build/buildd/taglib-extras-1.0.1 -B/build/buildd/taglib-extras-1.0.1/obj-i486-linux-gnu --check-build-system CMakeFiles/Makefile.cmake 0
/usr/bin/cmake -E cmake_progress_start /build/buildd/taglib-extras-1.0.1/obj-i486-linux-gnu/CMakeFiles /build/buildd/taglib-extras-1.0.1/obj-i486-linux-gnu/CMakeFiles/progress.make
make -f CMakeFiles/Makefile2 all
make[2]: Entering directory `/build/buildd/taglib-extras-1.0.1/obj-i486-linux-gnu'
make -f taglib-extras/CMakeFiles/tag-extras.dir/build.make taglib-extras/CMakeFiles/tag-extras.dir/depend
make[3]: Entering directory `/build/buildd/taglib-extras-1.0.1/obj-i486-linux-gnu'
cd /build/buildd/taglib-extras-1.0.1/obj-i486-linux-gnu && /usr/bin/cmake -E cmake_depends "Unix Makefiles" /build/buildd/taglib-extras-1.0.1 /build/buildd/taglib-extras-1.0.1/taglib-extras /build/buildd/taglib-extras-1.0.1/obj-i486-linux-gnu /build/buildd/taglib-extras-1.0.1/obj-i486-linux-gnu/taglib-extras /build/buildd/taglib-extras-1.0.1/obj-i486-linux-gnu/taglib-extras/CMakeFiles/tag-extras.dir/DependInfo.cmake --color=
Scanning dependencies of target tag-extras
make[3]: Leaving directory `/build/buildd/taglib-extras-1.0.1/obj-i486-linux-gnu'
make -f taglib-extras/CMakeFiles/tag-extras.dir/build.make taglib-extras/CMakeFiles/tag-extras.dir/build
make[3]: Entering directory `/build/buildd/taglib-extras-1.0.1/obj-i486-linux-gnu'
/usr/bin/cmake -E cmake_progress_report /build/buildd/taglib-extras-1.0.1/obj-i486-linux-gnu/CMakeFiles 1
[ 12%] Building CXX object taglib-extras/CMakeFiles/tag-extras.dir/tfile_helper.cpp.o
cd /build/buildd/taglib-extras-1.0.1/obj-i486-linux-gnu/taglib-extras && /usr/bin/c++   -DMAKE_TAGLIB_EXTRAS_LIB -g -O2 -fvisibility=hidden -fvisibility-inlines-hidden  -Wnon-virtual-dtor -Wno-long-long -ansi -Wundef -Wcast-align -Wchar-subscripts -Wall -W -Wpointer-arith -Wwrite-strings -Wformat-security -fno-check-new -fno-common -fPIC -I/build/buildd/taglib-extras-1.0.1/obj-i486-linux-gnu/taglib-extras -I/build/buildd/taglib-extras-1.0.1/taglib-extras -I/usr/include/taglib -I/build/buildd/taglib-extras-1.0.1/taglib-extras/audible -I/build/buildd/taglib-extras-1.0.1/taglib-extras/rmff   -I/usr/include/taglib -o CMakeFiles/tag-extras.dir/tfile_helper.cpp.o -c /build/buildd/taglib-extras-1.0.1/taglib-extras/tfile_helper.cpp
/usr/bin/cmake -E cmake_progress_report /build/buildd/taglib-extras-1.0.1/obj-i486-linux-gnu/CMakeFiles 2
[ 25%] Building CXX object taglib-extras/CMakeFiles/tag-extras.dir/audible/audibleproperties.cpp.o
cd /build/buildd/taglib-extras-1.0.1/obj-i486-linux-gnu/taglib-extras && /usr/bin/c++   -DMAKE_TAGLIB_EXTRAS_LIB -g -O2 -fvisibility=hidden -fvisibility-inlines-hidden  -Wnon-virtual-dtor -Wno-long-long -ansi -Wundef -Wcast-align -Wchar-subscripts -Wall -W -Wpointer-arith -Wwrite-strings -Wformat-security -fno-check-new -fno-common -fPIC -I/build/buildd/taglib-extras-1.0.1/obj-i486-linux-gnu/taglib-extras -I/build/buildd/taglib-extras-1.0.1/taglib-extras -I/usr/include/taglib -I/build/buildd/taglib-extras-1.0.1/taglib-extras/audible -I/build/buildd/taglib-extras-1.0.1/taglib-extras/rmff   -I/usr/include/taglib -o CMakeFiles/tag-extras.dir/audible/audibleproperties.cpp.o -c /build/buildd/taglib-extras-1.0.1/taglib-extras/audible/audibleproperties.cpp
/usr/bin/cmake -E cmake_progress_report /build/buildd/taglib-extras-1.0.1/obj-i486-linux-gnu/CMakeFiles 3
[ 37%] Building CXX object taglib-extras/CMakeFiles/tag-extras.dir/audible/audibletag.cpp.o
cd /build/buildd/taglib-extras-1.0.1/obj-i486-linux-gnu/taglib-extras && /usr/bin/c++   -DMAKE_TAGLIB_EXTRAS_LIB -g -O2 -fvisibility=hidden -fvisibility-inlines-hidden  -Wnon-virtual-dtor -Wno-long-long -ansi -Wundef -Wcast-align -Wchar-subscripts -Wall -W -Wpointer-arith -Wwrite-strings -Wformat-security -fno-check-new -fno-common -fPIC -I/build/buildd/taglib-extras-1.0.1/obj-i486-linux-gnu/taglib-extras -I/build/buildd/taglib-extras-1.0.1/taglib-extras -I/usr/include/taglib -I/build/buildd/taglib-extras-1.0.1/taglib-extras/audible -I/build/buildd/taglib-extras-1.0.1/taglib-extras/rmff   -I/usr/include/taglib -o CMakeFiles/tag-extras.dir/audible/audibletag.cpp.o -c /build/buildd/taglib-extras-1.0.1/taglib-extras/audible/audibletag.cpp
/usr/bin/cmake -E cmake_progress_report /build/buildd/taglib-extras-1.0.1/obj-i486-linux-gnu/CMakeFiles 4
[ 50%] Building CXX object taglib-extras/CMakeFiles/tag-extras.dir/audible/audiblefile.cpp.o
cd /build/buildd/taglib-extras-1.0.1/obj-i486-linux-gnu/taglib-extras && /usr/bin/c++   -DMAKE_TAGLIB_EXTRAS_LIB -g -O2 -fvisibility=hidden -fvisibility-inlines-hidden  -Wnon-virtual-dtor -Wno-long-long -ansi -Wundef -Wcast-align -Wchar-subscripts -Wall -W -Wpointer-arith -Wwrite-strings -Wformat-security -fno-check-new -fno-common -fPIC -I/build/buildd/taglib-extras-1.0.1/obj-i486-linux-gnu/taglib-extras -I/build/buildd/taglib-extras-1.0.1/taglib-extras -I/usr/include/taglib -I/build/buildd/taglib-extras-1.0.1/taglib-extras/audible -I/build/buildd/taglib-extras-1.0.1/taglib-extras/rmff   -I/usr/include/taglib -o CMakeFiles/tag-extras.dir/audible/audiblefile.cpp.o -c /build/buildd/taglib-extras-1.0.1/taglib-extras/audible/audiblefile.cpp
/usr/bin/cmake -E cmake_progress_report /build/buildd/taglib-extras-1.0.1/obj-i486-linux-gnu/CMakeFiles 5
[ 62%] Building CXX object taglib-extras/CMakeFiles/tag-extras.dir/audible/audiblefiletyperesolver.cpp.o
cd /build/buildd/taglib-extras-1.0.1/obj-i486-linux-gnu/taglib-extras && /usr/bin/c++   -DMAKE_TAGLIB_EXTRAS_LIB -g -O2 -fvisibility=hidden -fvisibility-inlines-hidden  -Wnon-virtual-dtor -Wno-long-long -ansi -Wundef -Wcast-align -Wchar-subscripts -Wall -W -Wpointer-arith -Wwrite-strings -Wformat-security -fno-check-new -fno-common -fPIC -I/build/buildd/taglib-extras-1.0.1/obj-i486-linux-gnu/taglib-extras -I/build/buildd/taglib-extras-1.0.1/taglib-extras -I/usr/include/taglib -I/build/buildd/taglib-extras-1.0.1/taglib-extras/audible -I/build/buildd/taglib-extras-1.0.1/taglib-extras/rmff   -I/usr/include/taglib -o CMakeFiles/tag-extras.dir/audible/audiblefiletyperesolver.cpp.o -c /build/buildd/taglib-extras-1.0.1/taglib-extras/audible/audiblefiletyperesolver.cpp
/usr/bin/cmake -E cmake_progress_report /build/buildd/taglib-extras-1.0.1/obj-i486-linux-gnu/CMakeFiles 6
[ 75%] Building CXX object taglib-extras/CMakeFiles/tag-extras.dir/rmff/rmff.cpp.o
cd /build/buildd/taglib-extras-1.0.1/obj-i486-linux-gnu/taglib-extras && /usr/bin/c++   -DMAKE_TAGLIB_EXTRAS_LIB -g -O2 -fvisibility=hidden -fvisibility-inlines-hidden  -Wnon-virtual-dtor -Wno-long-long -ansi -Wundef -Wcast-align -Wchar-subscripts -Wall -W -Wpointer-arith -Wwrite-strings -Wformat-security -fno-check-new -fno-common -fPIC -I/build/buildd/taglib-extras-1.0.1/obj-i486-linux-gnu/taglib-extras -I/build/buildd/taglib-extras-1.0.1/taglib-extras -I/usr/include/taglib -I/build/buildd/taglib-extras-1.0.1/taglib-extras/audible -I/build/buildd/taglib-extras-1.0.1/taglib-extras/rmff   -I/usr/include/taglib -o CMakeFiles/tag-extras.dir/rmff/rmff.cpp.o -c /build/buildd/taglib-extras-1.0.1/taglib-extras/rmff/rmff.cpp
/usr/bin/cmake -E cmake_progress_report /build/buildd/taglib-extras-1.0.1/obj-i486-linux-gnu/CMakeFiles 7
[ 87%] Building CXX object taglib-extras/CMakeFiles/tag-extras.dir/rmff/realmediafile.cpp.o
cd /build/buildd/taglib-extras-1.0.1/obj-i486-linux-gnu/taglib-extras && /usr/bin/c++   -DMAKE_TAGLIB_EXTRAS_LIB -g -O2 -fvisibility=hidden -fvisibility-inlines-hidden  -Wnon-virtual-dtor -Wno-long-long -ansi -Wundef -Wcast-align -Wchar-subscripts -Wall -W -Wpointer-arith -Wwrite-strings -Wformat-security -fno-check-new -fno-common -fPIC -I/build/buildd/taglib-extras-1.0.1/obj-i486-linux-gnu/taglib-extras -I/build/buildd/taglib-extras-1.0.1/taglib-extras -I/usr/include/taglib -I/build/buildd/taglib-extras-1.0.1/taglib-extras/audible -I/build/buildd/taglib-extras-1.0.1/taglib-extras/rmff   -I/usr/include/taglib -o CMakeFiles/tag-extras.dir/rmff/realmediafile.cpp.o -c /build/buildd/taglib-extras-1.0.1/taglib-extras/rmff/realmediafile.cpp
/usr/bin/cmake -E cmake_progress_report /build/buildd/taglib-extras-1.0.1/obj-i486-linux-gnu/CMakeFiles 8
[100%] Building CXX object taglib-extras/CMakeFiles/tag-extras.dir/rmff/realmediafiletyperesolver.cpp.o
cd /build/buildd/taglib-extras-1.0.1/obj-i486-linux-gnu/taglib-extras && /usr/bin/c++   -DMAKE_TAGLIB_EXTRAS_LIB -g -O2 -fvisibility=hidden -fvisibility-inlines-hidden  -Wnon-virtual-dtor -Wno-long-long -ansi -Wundef -Wcast-align -Wchar-subscripts -Wall -W -Wpointer-arith -Wwrite-strings -Wformat-security -fno-check-new -fno-common -fPIC -I/build/buildd/taglib-extras-1.0.1/obj-i486-linux-gnu/taglib-extras -I/build/buildd/taglib-extras-1.0.1/taglib-extras -I/usr/include/taglib -I/build/buildd/taglib-extras-1.0.1/taglib-extras/audible -I/build/buildd/taglib-extras-1.0.1/taglib-extras/rmff   -I/usr/include/taglib -o CMakeFiles/tag-extras.dir/rmff/realmediafiletyperesolver.cpp.o -c /build/buildd/taglib-extras-1.0.1/taglib-extras/rmff/realmediafiletyperesolver.cpp
Linking CXX shared library libtag-extras.so
cd /build/buildd/taglib-extras-1.0.1/obj-i486-linux-gnu/taglib-extras && /usr/bin/cmake -E cmake_link_script CMakeFiles/tag-extras.dir/link.txt --verbose=1
/usr/bin/c++  -fPIC -g -O2 -fvisibility=hidden -fvisibility-inlines-hidden  -Wnon-virtual-dtor -Wno-long-long -ansi -Wundef -Wcast-align -Wchar-subscripts -Wall -W -Wpointer-arith -Wwrite-strings -Wformat-security -fno-check-new -fno-common -Wl,-Bsymbolic-functions -shared -Wl,-soname,libtag-extras.so.1 -o libtag-extras.so.1.0.0 CMakeFiles/tag-extras.dir/tfile_helper.cpp.o CMakeFiles/tag-extras.dir/audible/audibleproperties.cpp.o CMakeFiles/tag-extras.dir/audible/audibletag.cpp.o CMakeFiles/tag-extras.dir/audible/audiblefile.cpp.o CMakeFiles/tag-extras.dir/audible/audiblefiletyperesolver.cpp.o CMakeFiles/tag-extras.dir/rmff/rmff.cpp.o CMakeFiles/tag-extras.dir/rmff/realmediafile.cpp.o CMakeFiles/tag-extras.dir/rmff/realmediafiletyperesolver.cpp.o -L/usr/lib -ltag 
cd /build/buildd/taglib-extras-1.0.1/obj-i486-linux-gnu/taglib-extras && /usr/bin/cmake -E cmake_symlink_library libtag-extras.so.1.0.0 libtag-extras.so.1 libtag-extras.so
make[3]: Leaving directory `/build/buildd/taglib-extras-1.0.1/obj-i486-linux-gnu'
/usr/bin/cmake -E cmake_progress_report /build/buildd/taglib-extras-1.0.1/obj-i486-linux-gnu/CMakeFiles  1 2 3 4 5 6 7 8
[100%] Built target tag-extras
make[2]: Leaving directory `/build/buildd/taglib-extras-1.0.1/obj-i486-linux-gnu'
/usr/bin/cmake -E cmake_progress_start /build/buildd/taglib-extras-1.0.1/obj-i486-linux-gnu/CMakeFiles 0
make[1]: Leaving directory `/build/buildd/taglib-extras-1.0.1/obj-i486-linux-gnu'
   dh_auto_test
 /usr/bin/fakeroot debian/rules binary
dh binary
   dh_testroot
   dh_prep
   dh_installdirs
   dh_auto_install
make[1]: Entering directory `/build/buildd/taglib-extras-1.0.1/obj-i486-linux-gnu'
/usr/bin/cmake -H/build/buildd/taglib-extras-1.0.1 -B/build/buildd/taglib-extras-1.0.1/obj-i486-linux-gnu --check-build-system CMakeFiles/Makefile.cmake 0
/usr/bin/cmake -E cmake_progress_start /build/buildd/taglib-extras-1.0.1/obj-i486-linux-gnu/CMakeFiles /build/buildd/taglib-extras-1.0.1/obj-i486-linux-gnu/CMakeFiles/progress.make
make -f CMakeFiles/Makefile2 all
make[2]: Entering directory `/build/buildd/taglib-extras-1.0.1/obj-i486-linux-gnu'
make -f taglib-extras/CMakeFiles/tag-extras.dir/build.make taglib-extras/CMakeFiles/tag-extras.dir/depend
make[3]: Entering directory `/build/buildd/taglib-extras-1.0.1/obj-i486-linux-gnu'
cd /build/buildd/taglib-extras-1.0.1/obj-i486-linux-gnu && /usr/bin/cmake -E cmake_depends "Unix Makefiles" /build/buildd/taglib-extras-1.0.1 /build/buildd/taglib-extras-1.0.1/taglib-extras /build/buildd/taglib-extras-1.0.1/obj-i486-linux-gnu /build/buildd/taglib-extras-1.0.1/obj-i486-linux-gnu/taglib-extras /build/buildd/taglib-extras-1.0.1/obj-i486-linux-gnu/taglib-extras/CMakeFiles/tag-extras.dir/DependInfo.cmake --color=
make[3]: Leaving directory `/build/buildd/taglib-extras-1.0.1/obj-i486-linux-gnu'
make -f taglib-extras/CMakeFiles/tag-extras.dir/build.make taglib-extras/CMakeFiles/tag-extras.dir/build
make[3]: Entering directory `/build/buildd/taglib-extras-1.0.1/obj-i486-linux-gnu'
make[3]: Nothing to be done for `taglib-extras/CMakeFiles/tag-extras.dir/build'.
make[3]: Leaving directory `/build/buildd/taglib-extras-1.0.1/obj-i486-linux-gnu'
/usr/bin/cmake -E cmake_progress_report /build/buildd/taglib-extras-1.0.1/obj-i486-linux-gnu/CMakeFiles  1 2 3 4 5 6 7 8
[100%] Built target tag-extras
make[2]: Leaving directory `/build/buildd/taglib-extras-1.0.1/obj-i486-linux-gnu'
/usr/bin/cmake -E cmake_progress_start /build/buildd/taglib-extras-1.0.1/obj-i486-linux-gnu/CMakeFiles 0
make -f CMakeFiles/Makefile2 preinstall
make[2]: Entering directory `/build/buildd/taglib-extras-1.0.1/obj-i486-linux-gnu'
make[2]: Nothing to be done for `preinstall'.
make[2]: Leaving directory `/build/buildd/taglib-extras-1.0.1/obj-i486-linux-gnu'
Install the project...
/usr/bin/cmake -P cmake_install.cmake
-- Install configuration: ""
-- Installing: /build/buildd/taglib-extras-1.0.1/debian/tmp/usr/lib/pkgconfig/taglib-extras.pc
-- Installing: /build/buildd/taglib-extras-1.0.1/debian/tmp/usr/bin/taglib-extras-config
-- Installing: /build/buildd/taglib-extras-1.0.1/debian/tmp/usr/lib/libtag-extras.so.1.0.0
-- Installing: /build/buildd/taglib-extras-1.0.1/debian/tmp/usr/lib/libtag-extras.so.1
-- Installing: /build/buildd/taglib-extras-1.0.1/debian/tmp/usr/lib/libtag-extras.so
-- Installing: /build/buildd/taglib-extras-1.0.1/debian/tmp/usr/include/taglib-extras/taglib-extras_export.h
-- Installing: /build/buildd/taglib-extras-1.0.1/debian/tmp/usr/include/taglib-extras/tfile_helper.h
-- Installing: /build/buildd/taglib-extras-1.0.1/debian/tmp/usr/include/taglib-extras/audiblefiletyperesolver.h
-- Installing: /build/buildd/taglib-extras-1.0.1/debian/tmp/usr/include/taglib-extras/audiblefile.h
-- Installing: /build/buildd/taglib-extras-1.0.1/debian/tmp/usr/include/taglib-extras/audibleproperties.h
-- Installing: /build/buildd/taglib-extras-1.0.1/debian/tmp/usr/include/taglib-extras/audibletag.h
-- Installing: /build/buildd/taglib-extras-1.0.1/debian/tmp/usr/include/taglib-extras/realmediafiletyperesolver.h
-- Installing: /build/buildd/taglib-extras-1.0.1/debian/tmp/usr/include/taglib-extras/realmediafile.h
make[1]: Leaving directory `/build/buildd/taglib-extras-1.0.1/obj-i486-linux-gnu'
   dh_install
   dh_installdocs
   dh_installchangelogs
   dh_installexamples
   dh_installman
   dh_installcatalogs
   dh_installcron
   dh_installdebconf
   dh_installcatalogs
   dh_installemacsen
   dh_installifupdown
   dh_installinfo
   dh_installinit
   dh_installmenu
   dh_installmime
   dh_installmodules
   dh_installlogcheck
   dh_installlogrotate
   dh_installpam
   dh_installppp
   dh_installudev
   dh_installwm
   dh_installxfonts
   dh_bugfiles
   dh_lintian
   dh_gconf
   dh_icons
   dh_perl
   dh_pysupport
Traceback (most recent call last):
  File "/usr/share/python-support/private/movemodules", line 9, in <module>
    from hashlib import md5
  File "/usr/lib/python2.6/hashlib.py", line 136, in <module>
    md5 = __get_builtin_constructor('md5')
  File "/usr/lib/python2.6/hashlib.py", line 63, in __get_builtin_constructor
    import _md5
ImportError: No module named _md5
dh_pysupport: /usr/share/python-support/private/movemodules returned exit code 1
make: *** [binary] Error 1
dpkg-buildpackage: error: /usr/bin/fakeroot debian/rules binary gave error exit status 2
******************************************************************************
Build finished at 20091003-2221
FAILED [dpkg-buildpackage died]
Purging chroot-karmic-autotest/build/buildd/taglib-extras-1.0.1
------------------------------------------------------------------------------
  /usr/bin/sudo dpkg --root=/home/buildd/build-karmic-autotest/chroot-karmic-autotest --purge intltool-debian groff-base libglib2.0-0 libcurl3 gettext file libxmlrpc-core-c3 libtag1-vanilla html2text gettext-base debhelper po-debconf libtag1c2a emacsen-common libcroco3 libmagic1 libtag1-dev libxml2 cmake-data libexpat1 pkg-kde-tools bsdmainutils libpcre3 man-db cmake
(Reading database ... 12401 files and directories currently installed.)
Removing debhelper ...
dpkg - warning: while removing debhelper, directory `/usr/share/perl5/Debian/Debhelper/Sequence' not empty so not removed.
dpkg - warning: while removing debhelper, directory `/usr/share/perl5/Debian/Debhelper' not empty so not removed.
dpkg - warning: while removing debhelper, directory `/usr/share/debhelper/autoscripts' not empty so not removed.
dpkg - warning: while removing debhelper, directory `/usr/share/debhelper' not empty so not removed.
Removing po-debconf ...
Removing libtag1-dev ...
Removing pkg-kde-tools ...
Removing man-db ...
Purging configuration files for man-db ...
  Removing catpages as well as /var/cache/man hierarchy.
debconf: unable to initialize frontend: Dialog
debconf: (Dialog frontend will not work on a dumb terminal, an emacs shell buffer, or without a controlling terminal.)
debconf: falling back to frontend: Readline
debconf: unable to initialize frontend: Readline
debconf: (This frontend requires a controlling tty.)
debconf: falling back to frontend: Teletype
dpkg - warning: while removing man-db, directory `/usr/lib/man-db' not empty so not removed.
dpkg - warning: while removing man-db, directory `/usr/share/bug/man-db' not empty so not removed.
dpkg - warning: while removing man-db, directory `/usr/share/doc/man-db/examples' not empty so not removed.
dpkg - warning: while removing man-db, directory `/usr/share/doc/man-db' not empty so not removed.
dpkg - warning: while removing man-db, directory `/usr/share/man/id/man5' not empty so not removed.
dpkg - warning: while removing man-db, directory `/usr/share/man-db' not empty so not removed.
Removing cmake ...
Removing intltool-debian ...
Removing groff-base ...
Purging configuration files for groff-base ...
Removing gettext ...
install-info: warning: maintainer scripts should not call install-info anymore,
install-info: warning: this is handled now by a dpkg trigger provided by the
install-info: warning: install-info package; package gettext should be updated.
Removing file ...
Purging configuration files for file ...
Removing libxmlrpc-core-c3 ...
Purging configuration files for libxmlrpc-core-c3 ...
Removing html2text ...
Purging configuration files for html2text ...
Removing gettext-base ...
Removing libtag1c2a ...
Removing libcroco3 ...
Purging configuration files for libcroco3 ...
Removing libmagic1 ...
Purging configuration files for libmagic1 ...
Removing libxml2 ...
Purging configuration files for libxml2 ...
Removing cmake-data ...
Purging configuration files for cmake-data ...
Removing libexpat1 ...
Purging configuration files for libexpat1 ...
Removing libglib2.0-0 ...
Purging configuration files for libglib2.0-0 ...
Removing libcurl3 ...
Purging configuration files for libcurl3 ...
Removing libtag1-vanilla ...
Purging configuration files for libtag1-vanilla ...
Removing emacsen-common ...
emacsen-common: Handling removal of emacsen flavor emacs
Purging configuration files for emacsen-common ...
Removing bsdmainutils ...
Purging configuration files for bsdmainutils ...
Removing libpcre3 ...
Purging configuration files for libpcre3 ...
Processing triggers for libc-bin ...
ldconfig deferred processing now taking place
******************************************************************************
Finished at 20091003-2221
Build needed 00:00:13, 2280k disk space




More information about the ubuntu-autotest mailing list