Log for failed build of qzion_0.4.0-0ubuntu3 (dist=karmic-autotest)
Build Daemon user
noreply at buildd.ubuntu.com
Sat Oct 3 21:43:59 BST 2009
Automatic build of qzion_0.4.0-0ubuntu3 on terranova by sbuild/i386 1.170.5
Build started at 20091003-2141
******************************************************************************
Checking available source versions...
Fetching source files...
Reading package lists...
Building dependency tree...
Reading state information...
Need to get 285kB of source archives.
Get:1 http://ftpmaster.internal karmic/main qzion 0.4.0-0ubuntu3 (dsc) [1335B]
Get:2 http://ftpmaster.internal karmic/main qzion 0.4.0-0ubuntu3 (tar) [280kB]
Get:3 http://ftpmaster.internal karmic/main qzion 0.4.0-0ubuntu3 (diff) [3830B]
Fetched 285kB in 0s (5915kB/s)
Download complete and in download only mode
** Using build dependencies supplied by package:
Build-Depends: debhelper (>= 5), cmake, cdbs, qt4-qmake, libqt4-dev, sip4, python-qt4-dev, python-qt4
Checking for already installed source dependencies...
debhelper: missing
cmake: missing
cdbs: missing
qt4-qmake: missing
libqt4-dev: missing
sip4: missing
python-qt4-dev: missing
python-qt4: missing
Checking for source dependency conflicts...
/usr/bin/sudo /usr/bin/apt-get --purge $CHROOT_OPTIONS -q -y install debhelper cmake cdbs qt4-qmake libqt4-dev sip4 python-qt4-dev python-qt4
Reading package lists...
Building dependency tree...
Reading state information...
The following extra packages will be installed:
autoconf automake autotools-dev bsdmainutils cmake-data comerr-dev defoma
emacsen-common fdupes file fontconfig fontconfig-config gettext gettext-base
groff-base html2text intltool intltool-debian libaudio-dev libaudio2
libcroco3 libcurl3 libdrm2 libexpat1 libexpat1-dev libfontconfig1
libfontconfig1-dev libfreetype6 libfreetype6-dev libgl1-mesa-dev
libgl1-mesa-glx libglib2.0-0 libglib2.0-dev libglu1-mesa libglu1-mesa-dev
libglu1-xorg-dev libgssrpc4 libhtml-parser-perl libhtml-tagset-perl
libhtml-tree-perl libice-dev libice6 libjpeg62 libjpeg62-dev libjs-jquery
libkadm5srv6 libkdb5-4 libkrb5-dev liblcms1 liblcms1-dev libmagic1
libmng-dev libmng1 libncursesw5 libnewt0.52 libpcre3 libpng12-0 libpng12-dev
libpopt0 libpq-dev libpq5 libpthread-stubs0 libpthread-stubs0-dev
libpython2.6 libqt4-assistant libqt4-dbus libqt4-designer libqt4-help
libqt4-network libqt4-phonon libqt4-qt3support libqt4-script
libqt4-scripttools libqt4-sql libqt4-svg libqt4-test libqt4-webkit
libqt4-xml libqt4-xmlpatterns libqtcore4 libqtgui4 libsm-dev libsm6
libsqlite0 libsqlite0-dev libsqlite3-0 libssl-dev libtiff4 liburi-perl
libwww-perl libx11-6 libx11-data libx11-dev libxau-dev libxau6 libxcb1
libxcb1-dev libxcursor-dev libxcursor1 libxdamage1 libxdmcp-dev libxdmcp6
libxext-dev libxext6 libxfixes-dev libxfixes3 libxft-dev libxft2 libxi-dev
libxi6 libxinerama-dev libxinerama1 libxml-parser-perl libxml2
libxmlrpc-core-c3 libxmu-dev libxmu-headers libxmu6 libxrandr-dev libxrandr2
libxrender-dev libxrender1 libxt-dev libxt6 libxxf86vm1 m4 man-db
mesa-common-dev mime-support pkg-config po-debconf python python-dev
python-sip4 python-sip4-dev python-support python2.6 python2.6-dev
ttf-dejavu ttf-dejavu-core ttf-dejavu-extra ucf whiptail x11-common
x11proto-core-dev x11proto-fixes-dev x11proto-input-dev x11proto-kb-dev
x11proto-randr-dev x11proto-render-dev x11proto-xext-dev
x11proto-xinerama-dev xlibmesa-gl-dev xtrans-dev zlib1g-dev
Suggested packages:
autoconf2.13 autobook autoconf-archive gnu-standards autoconf-doc libtool
wamerican wordlist whois vacation devscripts doc-base dh-make defoma-doc
psfontmgr x-ttcidfont-conf dfontmgr libft-perl cvs gettext-doc groff nas
libglib2.0-doc krb5-doc krb5-user libdata-dump-perl javascript-common
liblcms-utils postgresql-doc-8.4 qt4-dev-tools qt4-doc libmysqlclient15-dev
libsqlite3-dev libiodbc2-dev qt4-qtconfig sqlite-doc libcrypt-ssleay-perl
libio-socket-ssl-perl less www-browser libmail-box-perl python-doc python-tk
python-profiler python-qt4-dbg python2.6-doc python2.6-profiler
Recommended packages:
curl wget lynx libgl1-mesa-dri libglib2.0-data shared-mime-info libgpm2
libfribidi0 libqt4-opengl-dev libqt4-sql-mysql libqt4-sql-odbc
libqt4-sql-psql libqt4-sql-sqlite libqt4-sql-sqlite2 libmailtools-perl
libhtml-format-perl libcompress-bzip2-perl xml-core libmail-sendmail-perl
The following NEW packages will be installed:
autoconf automake autotools-dev bsdmainutils cdbs cmake cmake-data
comerr-dev debhelper defoma emacsen-common fdupes file fontconfig
fontconfig-config gettext gettext-base groff-base html2text intltool
intltool-debian libaudio-dev libaudio2 libcroco3 libcurl3 libdrm2 libexpat1
libexpat1-dev libfontconfig1 libfontconfig1-dev libfreetype6
libfreetype6-dev libgl1-mesa-dev libgl1-mesa-glx libglib2.0-0 libglib2.0-dev
libglu1-mesa libglu1-mesa-dev libglu1-xorg-dev libgssrpc4
libhtml-parser-perl libhtml-tagset-perl libhtml-tree-perl libice-dev libice6
libjpeg62 libjpeg62-dev libjs-jquery libkadm5srv6 libkdb5-4 libkrb5-dev
liblcms1 liblcms1-dev libmagic1 libmng-dev libmng1 libncursesw5 libnewt0.52
libpcre3 libpng12-0 libpng12-dev libpopt0 libpq-dev libpq5 libpthread-stubs0
libpthread-stubs0-dev libpython2.6 libqt4-assistant libqt4-dbus
libqt4-designer libqt4-dev libqt4-help libqt4-network libqt4-phonon
libqt4-qt3support libqt4-script libqt4-scripttools libqt4-sql libqt4-svg
libqt4-test libqt4-webkit libqt4-xml libqt4-xmlpatterns libqtcore4 libqtgui4
libsm-dev libsm6 libsqlite0 libsqlite0-dev libsqlite3-0 libssl-dev libtiff4
liburi-perl libwww-perl libx11-6 libx11-data libx11-dev libxau-dev libxau6
libxcb1 libxcb1-dev libxcursor-dev libxcursor1 libxdamage1 libxdmcp-dev
libxdmcp6 libxext-dev libxext6 libxfixes-dev libxfixes3 libxft-dev libxft2
libxi-dev libxi6 libxinerama-dev libxinerama1 libxml-parser-perl libxml2
libxmlrpc-core-c3 libxmu-dev libxmu-headers libxmu6 libxrandr-dev libxrandr2
libxrender-dev libxrender1 libxt-dev libxt6 libxxf86vm1 m4 man-db
mesa-common-dev mime-support pkg-config po-debconf python python-dev
python-qt4 python-qt4-dev python-sip4 python-sip4-dev python-support
python2.6 python2.6-dev qt4-qmake sip4 ttf-dejavu ttf-dejavu-core
ttf-dejavu-extra ucf whiptail x11-common x11proto-core-dev
x11proto-fixes-dev x11proto-input-dev x11proto-kb-dev x11proto-randr-dev
x11proto-render-dev x11proto-xext-dev x11proto-xinerama-dev xlibmesa-gl-dev
xtrans-dev zlib1g-dev
0 upgraded, 163 newly installed, 0 to remove and 0 not upgraded.
Need to get 0B/69.5MB of archives.
After this operation, 244MB of additional disk space will be used.
WARNING: The following packages cannot be authenticated!
x11-common libice6 x11proto-core-dev libice-dev libsm6 libsm-dev libxau6
libxdmcp6 libxcb1 libx11-data libx11-6 libxau-dev libxdmcp-dev
x11proto-input-dev x11proto-kb-dev xtrans-dev libpthread-stubs0
libpthread-stubs0-dev libxcb1-dev libx11-dev libxfixes3 libxrender1
libxcursor1 x11proto-render-dev libxrender-dev x11proto-xext-dev
x11proto-fixes-dev libxfixes-dev libxcursor-dev libxext6 libxext-dev
libexpat1 libfreetype6 ucf libnewt0.52 libpopt0 whiptail libmagic1 file
defoma ttf-dejavu-core ttf-dejavu-extra ttf-dejavu fontconfig-config
libfontconfig1 libxft2 libexpat1-dev zlib1g-dev libfreetype6-dev libpcre3
libglib2.0-0 pkg-config libfontconfig1-dev libxft-dev libxi6 libxi-dev
libxinerama1 x11proto-xinerama-dev libxinerama-dev libxmu-headers libxrandr2
x11proto-randr-dev libxrandr-dev libxt6 libxt-dev libncursesw5 libsqlite3-0
libxml2 mime-support python2.6 python bsdmainutils gettext-base groff-base
libhtml-tagset-perl liburi-perl libhtml-parser-perl libhtml-tree-perl
libjs-jquery libwww-perl libxml-parser-perl man-db python-support m4
autoconf autotools-dev automake html2text libcroco3 gettext intltool-debian
po-debconf debhelper fdupes intltool cdbs libcurl3 libxmlrpc-core-c3
emacsen-common cmake-data cmake fontconfig libaudio2 libdrm2 libxdamage1
libxxf86vm1 libgl1-mesa-glx libglib2.0-dev libglu1-mesa mesa-common-dev
libgl1-mesa-dev libglu1-mesa-dev libglu1-xorg-dev libgssrpc4 libjpeg62
libjpeg62-dev libkdb5-4 libkadm5srv6 liblcms1 liblcms1-dev libmng1
libmng-dev libpng12-0 libpng12-dev libpq5 libssl-dev comerr-dev libkrb5-dev
libpq-dev libpython2.6 libqtcore4 libqt4-network libqt4-assistant libqt4-xml
libqt4-dbus libqt4-script libtiff4 libqtgui4 libqt4-designer libqt4-sql
libqt4-qt3support libqt4-svg libqt4-phonon libqt4-webkit libqt4-scripttools
libqt4-xmlpatterns libqt4-help libqt4-test qt4-qmake libxmu6 libxmu-dev
xlibmesa-gl-dev libaudio-dev libsqlite0 libsqlite0-dev libqt4-dev
python2.6-dev python-dev python-sip4 python-qt4 python-sip4-dev
python-qt4-dev sip4
debconf: unable to initialize frontend: Dialog
debconf: (Dialog frontend will not work on a dumb terminal, an emacs shell buffer, or without a controlling terminal.)
debconf: falling back to frontend: Readline
debconf: unable to initialize frontend: Readline
debconf: (This frontend requires a controlling tty.)
debconf: falling back to frontend: Teletype
dpkg-preconfigure: unable to re-open stdin:
Authentication warning overridden.
Selecting previously deselected package x11-common.
(Reading database ... 10669 files and directories currently installed.)
Unpacking x11-common (from .../x11-common_1%3a7.4+3ubuntu5_all.deb) ...
debconf: unable to initialize frontend: Dialog
debconf: (Dialog frontend will not work on a dumb terminal, an emacs shell buffer, or without a controlling terminal.)
debconf: falling back to frontend: Readline
Selecting previously deselected package libice6.
Unpacking libice6 (from .../libice6_2%3a1.0.5-1_i386.deb) ...
Setting up x11-common (1:7.4+3ubuntu5) ...
debconf: unable to initialize frontend: Dialog
debconf: (Dialog frontend will not work on a dumb terminal, an emacs shell buffer, or without a controlling terminal.)
debconf: falling back to frontend: Readline
Selecting previously deselected package x11proto-core-dev.
(Reading database ... 10751 files and directories currently installed.)
Unpacking x11proto-core-dev (from .../x11proto-core-dev_7.0.15-1_all.deb) ...
Selecting previously deselected package libice-dev.
Unpacking libice-dev (from .../libice-dev_2%3a1.0.5-1_i386.deb) ...
Selecting previously deselected package libsm6.
Unpacking libsm6 (from .../libsm6_2%3a1.1.0-2_i386.deb) ...
Selecting previously deselected package libsm-dev.
Unpacking libsm-dev (from .../libsm-dev_2%3a1.1.0-2_i386.deb) ...
Selecting previously deselected package libxau6.
Unpacking libxau6 (from .../libxau6_1%3a1.0.4-2_i386.deb) ...
Selecting previously deselected package libxdmcp6.
Unpacking libxdmcp6 (from .../libxdmcp6_1%3a1.0.2-3_i386.deb) ...
Selecting previously deselected package libxcb1.
Unpacking libxcb1 (from .../libxcb1_1.4-1_i386.deb) ...
Selecting previously deselected package libx11-data.
Unpacking libx11-data (from .../libx11-data_2%3a1.2.2-1ubuntu1_all.deb) ...
Selecting previously deselected package libx11-6.
Unpacking libx11-6 (from .../libx11-6_2%3a1.2.2-1ubuntu1_i386.deb) ...
Selecting previously deselected package libxau-dev.
Unpacking libxau-dev (from .../libxau-dev_1%3a1.0.4-2_i386.deb) ...
Selecting previously deselected package libxdmcp-dev.
Unpacking libxdmcp-dev (from .../libxdmcp-dev_1%3a1.0.2-3_i386.deb) ...
Selecting previously deselected package x11proto-input-dev.
Unpacking x11proto-input-dev (from .../x11proto-input-dev_1.5.0-2ubuntu1_all.deb) ...
Selecting previously deselected package x11proto-kb-dev.
Unpacking x11proto-kb-dev (from .../x11proto-kb-dev_1.0.3-3ubuntu1_all.deb) ...
Selecting previously deselected package xtrans-dev.
Unpacking xtrans-dev (from .../xtrans-dev_1.2.4-1_all.deb) ...
Selecting previously deselected package libpthread-stubs0.
Unpacking libpthread-stubs0 (from .../libpthread-stubs0_0.1-2_i386.deb) ...
Selecting previously deselected package libpthread-stubs0-dev.
Unpacking libpthread-stubs0-dev (from .../libpthread-stubs0-dev_0.1-2_i386.deb) ...
Selecting previously deselected package libxcb1-dev.
Unpacking libxcb1-dev (from .../libxcb1-dev_1.4-1_i386.deb) ...
Selecting previously deselected package libx11-dev.
Unpacking libx11-dev (from .../libx11-dev_2%3a1.2.2-1ubuntu1_i386.deb) ...
Selecting previously deselected package libxfixes3.
Unpacking libxfixes3 (from .../libxfixes3_1%3a4.0.3-2build1_i386.deb) ...
Selecting previously deselected package libxrender1.
Unpacking libxrender1 (from .../libxrender1_1%3a0.9.4-2_i386.deb) ...
Selecting previously deselected package libxcursor1.
Unpacking libxcursor1 (from .../libxcursor1_1%3a1.1.9-1build1_i386.deb) ...
Selecting previously deselected package x11proto-render-dev.
Unpacking x11proto-render-dev (from .../x11proto-render-dev_2%3a0.9.3-2_all.deb) ...
Selecting previously deselected package libxrender-dev.
Unpacking libxrender-dev (from .../libxrender-dev_1%3a0.9.4-2_i386.deb) ...
Selecting previously deselected package x11proto-xext-dev.
Unpacking x11proto-xext-dev (from .../x11proto-xext-dev_7.0.4-2_all.deb) ...
Selecting previously deselected package x11proto-fixes-dev.
Unpacking x11proto-fixes-dev (from .../x11proto-fixes-dev_1%3a4.0-3_all.deb) ...
Selecting previously deselected package libxfixes-dev.
Unpacking libxfixes-dev (from .../libxfixes-dev_1%3a4.0.3-2build1_i386.deb) ...
Selecting previously deselected package libxcursor-dev.
Unpacking libxcursor-dev (from .../libxcursor-dev_1%3a1.1.9-1build1_i386.deb) ...
Selecting previously deselected package libxext6.
Unpacking libxext6 (from .../libxext6_2%3a1.0.99.1-0ubuntu3_i386.deb) ...
Selecting previously deselected package libxext-dev.
Unpacking libxext-dev (from .../libxext-dev_2%3a1.0.99.1-0ubuntu3_i386.deb) ...
Selecting previously deselected package libexpat1.
Unpacking libexpat1 (from .../libexpat1_2.0.1-4ubuntu1_i386.deb) ...
Selecting previously deselected package libfreetype6.
Unpacking libfreetype6 (from .../libfreetype6_2.3.9-5_i386.deb) ...
Selecting previously deselected package ucf.
Unpacking ucf (from .../ucf_3.0018ubuntu1_all.deb) ...
Moving old data out of the way
Selecting previously deselected package libnewt0.52.
Unpacking libnewt0.52 (from .../libnewt0.52_0.52.10-4ubuntu1_i386.deb) ...
Selecting previously deselected package libpopt0.
Unpacking libpopt0 (from .../libpopt0_1.14-4_i386.deb) ...
Selecting previously deselected package whiptail.
Unpacking whiptail (from .../whiptail_0.52.10-4ubuntu1_i386.deb) ...
Selecting previously deselected package libmagic1.
Unpacking libmagic1 (from .../libmagic1_5.03-1ubuntu1_i386.deb) ...
Selecting previously deselected package file.
Unpacking file (from .../file_5.03-1ubuntu1_i386.deb) ...
Selecting previously deselected package defoma.
Unpacking defoma (from .../defoma_0.11.10-0.2ubuntu1_all.deb) ...
Selecting previously deselected package ttf-dejavu-core.
Unpacking ttf-dejavu-core (from .../ttf-dejavu-core_2.29-2_all.deb) ...
Selecting previously deselected package ttf-dejavu-extra.
Unpacking ttf-dejavu-extra (from .../ttf-dejavu-extra_2.29-2_all.deb) ...
Selecting previously deselected package ttf-dejavu.
Unpacking ttf-dejavu (from .../ttf-dejavu_2.29-2_all.deb) ...
Selecting previously deselected package fontconfig-config.
Unpacking fontconfig-config (from .../fontconfig-config_2.6.0-1ubuntu12_all.deb) ...
Selecting previously deselected package libfontconfig1.
Unpacking libfontconfig1 (from .../libfontconfig1_2.6.0-1ubuntu12_i386.deb) ...
Selecting previously deselected package libxft2.
Unpacking libxft2 (from .../libxft2_2.1.13-3ubuntu1_i386.deb) ...
Selecting previously deselected package libexpat1-dev.
Unpacking libexpat1-dev (from .../libexpat1-dev_2.0.1-4ubuntu1_i386.deb) ...
Selecting previously deselected package zlib1g-dev.
Unpacking zlib1g-dev (from .../zlib1g-dev_1%3a1.2.3.3.dfsg-13ubuntu3_i386.deb) ...
Selecting previously deselected package libfreetype6-dev.
Unpacking libfreetype6-dev (from .../libfreetype6-dev_2.3.9-5_i386.deb) ...
Selecting previously deselected package libpcre3.
Unpacking libpcre3 (from .../libpcre3_7.8-2ubuntu1_i386.deb) ...
Selecting previously deselected package libglib2.0-0.
Unpacking libglib2.0-0 (from .../libglib2.0-0_2.22.1-0ubuntu1_i386.deb) ...
Selecting previously deselected package pkg-config.
Unpacking pkg-config (from .../pkg-config_0.22-1build1_i386.deb) ...
Selecting previously deselected package libfontconfig1-dev.
Unpacking libfontconfig1-dev (from .../libfontconfig1-dev_2.6.0-1ubuntu12_i386.deb) ...
Selecting previously deselected package libxft-dev.
Unpacking libxft-dev (from .../libxft-dev_2.1.13-3ubuntu1_i386.deb) ...
Selecting previously deselected package libxi6.
Unpacking libxi6 (from .../libxi6_2%3a1.2.1-2ubuntu1_i386.deb) ...
Selecting previously deselected package libxi-dev.
Unpacking libxi-dev (from .../libxi-dev_2%3a1.2.1-2ubuntu1_i386.deb) ...
Selecting previously deselected package libxinerama1.
Unpacking libxinerama1 (from .../libxinerama1_2%3a1.0.3-2_i386.deb) ...
Selecting previously deselected package x11proto-xinerama-dev.
Unpacking x11proto-xinerama-dev (from .../x11proto-xinerama-dev_1.1.2-5ubuntu1_all.deb) ...
Selecting previously deselected package libxinerama-dev.
Unpacking libxinerama-dev (from .../libxinerama-dev_2%3a1.0.3-2_i386.deb) ...
Selecting previously deselected package libxmu-headers.
Unpacking libxmu-headers (from .../libxmu-headers_2%3a1.0.4-2_all.deb) ...
Selecting previously deselected package libxrandr2.
Unpacking libxrandr2 (from .../libxrandr2_2%3a1.3.0-2_i386.deb) ...
Selecting previously deselected package x11proto-randr-dev.
Unpacking x11proto-randr-dev (from .../x11proto-randr-dev_1.3.0-1_all.deb) ...
Selecting previously deselected package libxrandr-dev.
Unpacking libxrandr-dev (from .../libxrandr-dev_2%3a1.3.0-2_i386.deb) ...
Selecting previously deselected package libxt6.
Unpacking libxt6 (from .../libxt6_1%3a1.0.5-3ubuntu1_i386.deb) ...
Selecting previously deselected package libxt-dev.
Unpacking libxt-dev (from .../libxt-dev_1%3a1.0.5-3ubuntu1_i386.deb) ...
Selecting previously deselected package libncursesw5.
Unpacking libncursesw5 (from .../libncursesw5_5.7+20090803-2ubuntu1_i386.deb) ...
Selecting previously deselected package libsqlite3-0.
Unpacking libsqlite3-0 (from .../libsqlite3-0_3.6.16-1ubuntu1_i386.deb) ...
Selecting previously deselected package libxml2.
Unpacking libxml2 (from .../libxml2_2.7.3.dfsg-1ubuntu2_i386.deb) ...
Selecting previously deselected package mime-support.
Unpacking mime-support (from .../mime-support_3.46-1ubuntu1_all.deb) ...
Selecting previously deselected package python2.6.
Unpacking python2.6 (from .../python2.6_2.6.3-0ubuntu1_i386.deb) ...
Selecting previously deselected package python.
Unpacking python (from .../python_2.6.2-0ubuntu1_all.deb) ...
Selecting previously deselected package bsdmainutils.
Unpacking bsdmainutils (from .../bsdmainutils_6.1.10ubuntu4_i386.deb) ...
Selecting previously deselected package gettext-base.
Unpacking gettext-base (from .../gettext-base_0.17-6ubuntu2_i386.deb) ...
Selecting previously deselected package groff-base.
Unpacking groff-base (from .../groff-base_1.20.1-5_i386.deb) ...
Selecting previously deselected package libhtml-tagset-perl.
Unpacking libhtml-tagset-perl (from .../libhtml-tagset-perl_3.20-2_all.deb) ...
Selecting previously deselected package liburi-perl.
Unpacking liburi-perl (from .../liburi-perl_1.37+dfsg-1ubuntu1_all.deb) ...
Selecting previously deselected package libhtml-parser-perl.
Unpacking libhtml-parser-perl (from .../libhtml-parser-perl_3.61-1_i386.deb) ...
Selecting previously deselected package libhtml-tree-perl.
Unpacking libhtml-tree-perl (from .../libhtml-tree-perl_3.23-1_all.deb) ...
Selecting previously deselected package libjs-jquery.
Unpacking libjs-jquery (from .../libjs-jquery_1.3.3-1ubuntu1_all.deb) ...
Selecting previously deselected package libwww-perl.
Unpacking libwww-perl (from .../libwww-perl_5.831-1_all.deb) ...
Selecting previously deselected package libxml-parser-perl.
Unpacking libxml-parser-perl (from .../libxml-parser-perl_2.36-1.1build2_i386.deb) ...
Selecting previously deselected package man-db.
Unpacking man-db (from .../man-db_2.5.6-2_i386.deb) ...
Selecting previously deselected package python-support.
Unpacking python-support (from .../python-support_1.0.3ubuntu1_all.deb) ...
Selecting previously deselected package m4.
Unpacking m4 (from .../archives/m4_1.4.13-1_i386.deb) ...
Selecting previously deselected package autoconf.
Unpacking autoconf (from .../autoconf_2.64-1ubuntu1_all.deb) ...
Selecting previously deselected package autotools-dev.
Unpacking autotools-dev (from .../autotools-dev_20090427.1_all.deb) ...
Selecting previously deselected package automake.
Unpacking automake (from .../automake_1%3a1.11-1_all.deb) ...
Selecting previously deselected package html2text.
Unpacking html2text (from .../html2text_1.3.2a-14_i386.deb) ...
Selecting previously deselected package libcroco3.
Unpacking libcroco3 (from .../libcroco3_0.6.1-2_i386.deb) ...
Selecting previously deselected package gettext.
Unpacking gettext (from .../gettext_0.17-6ubuntu2_i386.deb) ...
Selecting previously deselected package intltool-debian.
Unpacking intltool-debian (from .../intltool-debian_0.35.0+20060710.1_all.deb) ...
Selecting previously deselected package po-debconf.
Unpacking po-debconf (from .../po-debconf_1.0.16_all.deb) ...
Selecting previously deselected package debhelper.
Unpacking debhelper (from .../debhelper_7.3.15ubuntu3_all.deb) ...
Selecting previously deselected package fdupes.
Unpacking fdupes (from .../fdupes_1.50-PR2-2_i386.deb) ...
Selecting previously deselected package intltool.
Unpacking intltool (from .../intltool_0.41.0-0ubuntu1_all.deb) ...
Selecting previously deselected package cdbs.
Unpacking cdbs (from .../cdbs_0.4.59ubuntu2_all.deb) ...
Selecting previously deselected package libcurl3.
Unpacking libcurl3 (from .../libcurl3_7.19.5-1ubuntu2_i386.deb) ...
Selecting previously deselected package libxmlrpc-core-c3.
Unpacking libxmlrpc-core-c3 (from .../libxmlrpc-core-c3_1.06.27-1ubuntu6_i386.deb) ...
Selecting previously deselected package emacsen-common.
Unpacking emacsen-common (from .../emacsen-common_1.4.19_all.deb) ...
Selecting previously deselected package cmake-data.
Unpacking cmake-data (from .../cmake-data_2.6.4-1ubuntu2_all.deb) ...
Selecting previously deselected package cmake.
Unpacking cmake (from .../cmake_2.6.4-1ubuntu2_i386.deb) ...
Selecting previously deselected package fontconfig.
Unpacking fontconfig (from .../fontconfig_2.6.0-1ubuntu12_i386.deb) ...
Selecting previously deselected package libaudio2.
Unpacking libaudio2 (from .../libaudio2_1.9.2-1_i386.deb) ...
Selecting previously deselected package libdrm2.
Unpacking libdrm2 (from .../libdrm2_2.4.13-1ubuntu1_i386.deb) ...
Selecting previously deselected package libxdamage1.
Unpacking libxdamage1 (from .../libxdamage1_1%3a1.1.1-4_i386.deb) ...
Selecting previously deselected package libxxf86vm1.
Unpacking libxxf86vm1 (from .../libxxf86vm1_1%3a1.0.2-1_i386.deb) ...
Selecting previously deselected package libgl1-mesa-glx.
Unpacking libgl1-mesa-glx (from .../libgl1-mesa-glx_7.6.0~git20090817.7c422387-0ubuntu7_i386.deb) ...
Selecting previously deselected package libglib2.0-dev.
Unpacking libglib2.0-dev (from .../libglib2.0-dev_2.22.1-0ubuntu1_i386.deb) ...
Selecting previously deselected package libglu1-mesa.
Unpacking libglu1-mesa (from .../libglu1-mesa_7.6.0~git20090817.7c422387-0ubuntu7_i386.deb) ...
Selecting previously deselected package mesa-common-dev.
Unpacking mesa-common-dev (from .../mesa-common-dev_7.6.0~git20090817.7c422387-0ubuntu7_i386.deb) ...
Selecting previously deselected package libgl1-mesa-dev.
Unpacking libgl1-mesa-dev (from .../libgl1-mesa-dev_7.6.0~git20090817.7c422387-0ubuntu7_i386.deb) ...
Selecting previously deselected package libglu1-mesa-dev.
Unpacking libglu1-mesa-dev (from .../libglu1-mesa-dev_7.6.0~git20090817.7c422387-0ubuntu7_i386.deb) ...
Selecting previously deselected package libglu1-xorg-dev.
Unpacking libglu1-xorg-dev (from .../libglu1-xorg-dev_1%3a7.4+3ubuntu5_all.deb) ...
Selecting previously deselected package libgssrpc4.
Unpacking libgssrpc4 (from .../libgssrpc4_1.7dfsg~beta3-1_i386.deb) ...
Selecting previously deselected package libjpeg62.
Unpacking libjpeg62 (from .../libjpeg62_6b-14build1_i386.deb) ...
Selecting previously deselected package libjpeg62-dev.
Unpacking libjpeg62-dev (from .../libjpeg62-dev_6b-14build1_i386.deb) ...
Selecting previously deselected package libkdb5-4.
Unpacking libkdb5-4 (from .../libkdb5-4_1.7dfsg~beta3-1_i386.deb) ...
Selecting previously deselected package libkadm5srv6.
Unpacking libkadm5srv6 (from .../libkadm5srv6_1.7dfsg~beta3-1_i386.deb) ...
Selecting previously deselected package liblcms1.
Unpacking liblcms1 (from .../liblcms1_1.18.dfsg-1ubuntu1_i386.deb) ...
Selecting previously deselected package liblcms1-dev.
Unpacking liblcms1-dev (from .../liblcms1-dev_1.18.dfsg-1ubuntu1_i386.deb) ...
Selecting previously deselected package libmng1.
Unpacking libmng1 (from .../libmng1_1.0.9-1build1_i386.deb) ...
Selecting previously deselected package libmng-dev.
Unpacking libmng-dev (from .../libmng-dev_1.0.9-1build1_i386.deb) ...
Selecting previously deselected package libpng12-0.
Unpacking libpng12-0 (from .../libpng12-0_1.2.37-1_i386.deb) ...
Selecting previously deselected package libpng12-dev.
Unpacking libpng12-dev (from .../libpng12-dev_1.2.37-1_i386.deb) ...
Selecting previously deselected package libpq5.
Unpacking libpq5 (from .../libpq5_8.4.1-1_i386.deb) ...
Selecting previously deselected package libssl-dev.
Unpacking libssl-dev (from .../libssl-dev_0.9.8g-16ubuntu3_i386.deb) ...
Selecting previously deselected package comerr-dev.
Unpacking comerr-dev (from .../comerr-dev_2.1-1.41.9-1ubuntu1_i386.deb) ...
Selecting previously deselected package libkrb5-dev.
Unpacking libkrb5-dev (from .../libkrb5-dev_1.7dfsg~beta3-1_i386.deb) ...
Selecting previously deselected package libpq-dev.
Unpacking libpq-dev (from .../libpq-dev_8.4.1-1_i386.deb) ...
Selecting previously deselected package libpython2.6.
Unpacking libpython2.6 (from .../libpython2.6_2.6.3-0ubuntu1_i386.deb) ...
Selecting previously deselected package libqtcore4.
Unpacking libqtcore4 (from .../libqtcore4_4.5.2-0ubuntu6_i386.deb) ...
Selecting previously deselected package libqt4-network.
Unpacking libqt4-network (from .../libqt4-network_4.5.2-0ubuntu6_i386.deb) ...
Selecting previously deselected package libqt4-assistant.
Unpacking libqt4-assistant (from .../libqt4-assistant_4.5.2-0ubuntu6_i386.deb) ...
Selecting previously deselected package libqt4-xml.
Unpacking libqt4-xml (from .../libqt4-xml_4.5.2-0ubuntu6_i386.deb) ...
Selecting previously deselected package libqt4-dbus.
Unpacking libqt4-dbus (from .../libqt4-dbus_4.5.2-0ubuntu6_i386.deb) ...
Selecting previously deselected package libqt4-script.
Unpacking libqt4-script (from .../libqt4-script_4.5.2-0ubuntu6_i386.deb) ...
Selecting previously deselected package libtiff4.
Unpacking libtiff4 (from .../libtiff4_3.8.2-13_i386.deb) ...
Selecting previously deselected package libqtgui4.
Unpacking libqtgui4 (from .../libqtgui4_4.5.2-0ubuntu6_i386.deb) ...
Selecting previously deselected package libqt4-designer.
Unpacking libqt4-designer (from .../libqt4-designer_4.5.2-0ubuntu6_i386.deb) ...
Selecting previously deselected package libqt4-sql.
Unpacking libqt4-sql (from .../libqt4-sql_4.5.2-0ubuntu6_i386.deb) ...
Selecting previously deselected package libqt4-qt3support.
Unpacking libqt4-qt3support (from .../libqt4-qt3support_4.5.2-0ubuntu6_i386.deb) ...
Selecting previously deselected package libqt4-svg.
Unpacking libqt4-svg (from .../libqt4-svg_4.5.2-0ubuntu6_i386.deb) ...
Selecting previously deselected package libqt4-phonon.
Unpacking libqt4-phonon (from .../libqt4-phonon_4.5.2-0ubuntu6_i386.deb) ...
Selecting previously deselected package libqt4-webkit.
Unpacking libqt4-webkit (from .../libqt4-webkit_4.5.2-0ubuntu6_i386.deb) ...
Selecting previously deselected package libqt4-scripttools.
Unpacking libqt4-scripttools (from .../libqt4-scripttools_4.5.2-0ubuntu6_i386.deb) ...
Selecting previously deselected package libqt4-xmlpatterns.
Unpacking libqt4-xmlpatterns (from .../libqt4-xmlpatterns_4.5.2-0ubuntu6_i386.deb) ...
Selecting previously deselected package libqt4-help.
Unpacking libqt4-help (from .../libqt4-help_4.5.2-0ubuntu6_i386.deb) ...
Selecting previously deselected package libqt4-test.
Unpacking libqt4-test (from .../libqt4-test_4.5.2-0ubuntu6_i386.deb) ...
Selecting previously deselected package qt4-qmake.
Unpacking qt4-qmake (from .../qt4-qmake_4.5.2-0ubuntu6_i386.deb) ...
Selecting previously deselected package libxmu6.
Unpacking libxmu6 (from .../libxmu6_2%3a1.0.4-2_i386.deb) ...
Selecting previously deselected package libxmu-dev.
Unpacking libxmu-dev (from .../libxmu-dev_2%3a1.0.4-2_i386.deb) ...
Selecting previously deselected package xlibmesa-gl-dev.
Unpacking xlibmesa-gl-dev (from .../xlibmesa-gl-dev_1%3a7.4+3ubuntu5_all.deb) ...
Selecting previously deselected package libaudio-dev.
Unpacking libaudio-dev (from .../libaudio-dev_1.9.2-1_i386.deb) ...
Selecting previously deselected package libsqlite0.
Unpacking libsqlite0 (from .../libsqlite0_2.8.17-4build2_i386.deb) ...
Selecting previously deselected package libsqlite0-dev.
Unpacking libsqlite0-dev (from .../libsqlite0-dev_2.8.17-4build2_i386.deb) ...
Selecting previously deselected package libqt4-dev.
Unpacking libqt4-dev (from .../libqt4-dev_4.5.2-0ubuntu6_i386.deb) ...
Selecting previously deselected package python2.6-dev.
Unpacking python2.6-dev (from .../python2.6-dev_2.6.3-0ubuntu1_i386.deb) ...
Selecting previously deselected package python-dev.
Unpacking python-dev (from .../python-dev_2.6.2-0ubuntu1_all.deb) ...
Selecting previously deselected package python-sip4.
Unpacking python-sip4 (from .../python-sip4_4.8.2-1_i386.deb) ...
Selecting previously deselected package python-qt4.
Unpacking python-qt4 (from .../python-qt4_4.5.4-0ubuntu1_i386.deb) ...
Selecting previously deselected package python-sip4-dev.
Unpacking python-sip4-dev (from .../python-sip4-dev_4.8.2-1_all.deb) ...
Selecting previously deselected package python-qt4-dev.
Unpacking python-qt4-dev (from .../python-qt4-dev_4.5.4-0ubuntu1_all.deb) ...
Selecting previously deselected package sip4.
Unpacking sip4 (from .../archives/sip4_4.8.2-1_i386.deb) ...
Setting up libice6 (2:1.0.5-1) ...
Setting up x11proto-core-dev (7.0.15-1) ...
Setting up libice-dev (2:1.0.5-1) ...
Setting up libsm6 (2:1.1.0-2) ...
Setting up libsm-dev (2:1.1.0-2) ...
Setting up libxau6 (1:1.0.4-2) ...
Setting up libxdmcp6 (1:1.0.2-3) ...
Setting up libxcb1 (1.4-1) ...
Setting up libx11-data (2:1.2.2-1ubuntu1) ...
Setting up libx11-6 (2:1.2.2-1ubuntu1) ...
Setting up libxau-dev (1:1.0.4-2) ...
Setting up libxdmcp-dev (1:1.0.2-3) ...
Setting up x11proto-input-dev (1.5.0-2ubuntu1) ...
Setting up x11proto-kb-dev (1.0.3-3ubuntu1) ...
Setting up xtrans-dev (1.2.4-1) ...
Setting up libpthread-stubs0 (0.1-2) ...
Setting up libpthread-stubs0-dev (0.1-2) ...
Setting up libxcb1-dev (1.4-1) ...
Setting up libx11-dev (2:1.2.2-1ubuntu1) ...
Setting up libxfixes3 (1:4.0.3-2build1) ...
Setting up libxrender1 (1:0.9.4-2) ...
Setting up libxcursor1 (1:1.1.9-1build1) ...
Setting up x11proto-render-dev (2:0.9.3-2) ...
Setting up libxrender-dev (1:0.9.4-2) ...
Setting up x11proto-xext-dev (7.0.4-2) ...
Setting up x11proto-fixes-dev (1:4.0-3) ...
Setting up libxfixes-dev (1:4.0.3-2build1) ...
Setting up libxcursor-dev (1:1.1.9-1build1) ...
Setting up libxext6 (2:1.0.99.1-0ubuntu3) ...
Setting up libxext-dev (2:1.0.99.1-0ubuntu3) ...
Setting up libexpat1 (2.0.1-4ubuntu1) ...
Setting up libfreetype6 (2.3.9-5) ...
Setting up ucf (3.0018ubuntu1) ...
debconf: unable to initialize frontend: Dialog
debconf: (Dialog frontend will not work on a dumb terminal, an emacs shell buffer, or without a controlling terminal.)
debconf: falling back to frontend: Readline
Setting up libnewt0.52 (0.52.10-4ubuntu1) ...
Setting up libpopt0 (1.14-4) ...
Setting up whiptail (0.52.10-4ubuntu1) ...
Setting up libmagic1 (5.03-1ubuntu1) ...
Setting up file (5.03-1ubuntu1) ...
Setting up defoma (0.11.10-0.2ubuntu1) ...
Setting up ttf-dejavu-core (2.29-2) ...
Setting up ttf-dejavu-extra (2.29-2) ...
Setting up ttf-dejavu (2.29-2) ...
Setting up fontconfig-config (2.6.0-1ubuntu12) ...
Setting up libfontconfig1 (2.6.0-1ubuntu12) ...
Setting up libxft2 (2.1.13-3ubuntu1) ...
Setting up libexpat1-dev (2.0.1-4ubuntu1) ...
Setting up zlib1g-dev (1:1.2.3.3.dfsg-13ubuntu3) ...
Setting up libfreetype6-dev (2.3.9-5) ...
Setting up libpcre3 (7.8-2ubuntu1) ...
Setting up libglib2.0-0 (2.22.1-0ubuntu1) ...
Setting up pkg-config (0.22-1build1) ...
Setting up libfontconfig1-dev (2.6.0-1ubuntu12) ...
Setting up libxft-dev (2.1.13-3ubuntu1) ...
Setting up libxi6 (2:1.2.1-2ubuntu1) ...
Setting up libxi-dev (2:1.2.1-2ubuntu1) ...
Setting up libxinerama1 (2:1.0.3-2) ...
Setting up x11proto-xinerama-dev (1.1.2-5ubuntu1) ...
Setting up libxinerama-dev (2:1.0.3-2) ...
Setting up libxmu-headers (2:1.0.4-2) ...
Setting up libxrandr2 (2:1.3.0-2) ...
Setting up x11proto-randr-dev (1.3.0-1) ...
Setting up libxrandr-dev (2:1.3.0-2) ...
Setting up libxt6 (1:1.0.5-3ubuntu1) ...
Setting up libxt-dev (1:1.0.5-3ubuntu1) ...
Setting up libncursesw5 (5.7+20090803-2ubuntu1) ...
Setting up libsqlite3-0 (3.6.16-1ubuntu1) ...
Setting up libxml2 (2.7.3.dfsg-1ubuntu2) ...
Setting up mime-support (3.46-1ubuntu1) ...
update-alternatives: using /usr/bin/see to provide /usr/bin/view (view) in auto mode.
Setting up python2.6 (2.6.3-0ubuntu1) ...
Setting up python (2.6.2-0ubuntu1) ...
Setting up bsdmainutils (6.1.10ubuntu4) ...
update-alternatives: using /usr/bin/bsd-write to provide /usr/bin/write (write) in auto mode.
Setting up gettext-base (0.17-6ubuntu2) ...
Setting up groff-base (1.20.1-5) ...
Setting up libhtml-tagset-perl (3.20-2) ...
Setting up liburi-perl (1.37+dfsg-1ubuntu1) ...
Setting up libhtml-parser-perl (3.61-1) ...
Setting up libhtml-tree-perl (3.23-1) ...
Setting up libjs-jquery (1.3.3-1ubuntu1) ...
Setting up libwww-perl (5.831-1) ...
Setting up libxml-parser-perl (2.36-1.1build2) ...
Setting up man-db (2.5.6-2) ...
debconf: unable to initialize frontend: Dialog
debconf: (Dialog frontend will not work on a dumb terminal, an emacs shell buffer, or without a controlling terminal.)
debconf: falling back to frontend: Readline
Building database of manual pages ...
... skipping, since this is a buildd
Setting up python-support (1.0.3ubuntu1) ...
Setting up m4 (1.4.13-1) ...
install-info: warning: maintainer scripts should not call install-info anymore,
install-info: warning: this is handled now by a dpkg trigger provided by the
install-info: warning: install-info package; package m4 should be updated.
Setting up autoconf (2.64-1ubuntu1) ...
install-info: warning: maintainer scripts should not call install-info anymore,
install-info: warning: this is handled now by a dpkg trigger provided by the
install-info: warning: install-info package; package autoconf should be updated.
install-info: warning: maintainer scripts should not call install-info anymore,
install-info: warning: this is handled now by a dpkg trigger provided by the
install-info: warning: install-info package; package autoconf should be updated.
install-info: warning: maintainer scripts should not call install-info anymore,
install-info: warning: this is handled now by a dpkg trigger provided by the
install-info: warning: install-info package; package autoconf should be updated.
Setting up autotools-dev (20090427.1) ...
Setting up automake (1:1.11-1) ...
update-alternatives: using /usr/bin/automake-1.11 to provide /usr/bin/automake (automake) in auto mode.
Setting up html2text (1.3.2a-14) ...
Setting up libcroco3 (0.6.1-2) ...
Setting up gettext (0.17-6ubuntu2) ...
install-info: warning: maintainer scripts should not call install-info anymore,
install-info: warning: this is handled now by a dpkg trigger provided by the
install-info: warning: install-info package; package gettext should be updated.
Setting up intltool-debian (0.35.0+20060710.1) ...
Setting up po-debconf (1.0.16) ...
Setting up debhelper (7.3.15ubuntu3) ...
Setting up fdupes (1.50-PR2-2) ...
Setting up intltool (0.41.0-0ubuntu1) ...
Setting up cdbs (0.4.59ubuntu2) ...
Setting up libcurl3 (7.19.5-1ubuntu2) ...
Setting up libxmlrpc-core-c3 (1.06.27-1ubuntu6) ...
Setting up emacsen-common (1.4.19) ...
emacsen-common: Handling install of emacsen flavor emacs
install-info: warning: maintainer scripts should not call install-info anymore,
install-info: warning: this is handled now by a dpkg trigger provided by the
install-info: warning: install-info package; package emacsen-common should be updated.
Setting up cmake-data (2.6.4-1ubuntu2) ...
emacsen-common: Handling install of emacsen flavor emacs
Setting up cmake (2.6.4-1ubuntu2) ...
Setting up fontconfig (2.6.0-1ubuntu12) ...
Updating font configuration of fontconfig...
Cleaning up category cid..
Cleaning up category truetype..
Cleaning up category type1..
Updating category type1..
Updating category truetype..
Updating category cid..
Updating fontconfig cache for /usr/share/fonts/truetype/ttf-dejavu
Cleaning up old fontconfig caches... done.
Regenerating fonts cache... done.
Setting up libaudio2 (1.9.2-1) ...
Setting up libdrm2 (2.4.13-1ubuntu1) ...
Setting up libxdamage1 (1:1.1.1-4) ...
Setting up libxxf86vm1 (1:1.0.2-1) ...
Setting up libgl1-mesa-glx (7.6.0~git20090817.7c422387-0ubuntu7) ...
Setting up libglib2.0-dev (2.22.1-0ubuntu1) ...
Setting up libglu1-mesa (7.6.0~git20090817.7c422387-0ubuntu7) ...
Setting up mesa-common-dev (7.6.0~git20090817.7c422387-0ubuntu7) ...
Setting up libgl1-mesa-dev (7.6.0~git20090817.7c422387-0ubuntu7) ...
Setting up libglu1-mesa-dev (7.6.0~git20090817.7c422387-0ubuntu7) ...
Setting up libglu1-xorg-dev (1:7.4+3ubuntu5) ...
Setting up libgssrpc4 (1.7dfsg~beta3-1) ...
Setting up libjpeg62 (6b-14build1) ...
Setting up libjpeg62-dev (6b-14build1) ...
Setting up libkdb5-4 (1.7dfsg~beta3-1) ...
Setting up libkadm5srv6 (1.7dfsg~beta3-1) ...
Setting up liblcms1 (1.18.dfsg-1ubuntu1) ...
Setting up liblcms1-dev (1.18.dfsg-1ubuntu1) ...
Setting up libmng1 (1.0.9-1build1) ...
Setting up libmng-dev (1.0.9-1build1) ...
Setting up libpng12-0 (1.2.37-1) ...
Setting up libpng12-dev (1.2.37-1) ...
Setting up libpq5 (8.4.1-1) ...
Setting up libssl-dev (0.9.8g-16ubuntu3) ...
Setting up comerr-dev (2.1-1.41.9-1ubuntu1) ...
Setting up libkrb5-dev (1.7dfsg~beta3-1) ...
Setting up libpq-dev (8.4.1-1) ...
Setting up libpython2.6 (2.6.3-0ubuntu1) ...
Setting up libqtcore4 (4.5.2-0ubuntu6) ...
Setting up libqt4-network (4.5.2-0ubuntu6) ...
Setting up libqt4-assistant (4.5.2-0ubuntu6) ...
Setting up libqt4-xml (4.5.2-0ubuntu6) ...
Setting up libqt4-dbus (4.5.2-0ubuntu6) ...
Setting up libqt4-script (4.5.2-0ubuntu6) ...
Setting up libtiff4 (3.8.2-13) ...
Setting up libqtgui4 (4.5.2-0ubuntu6) ...
Setting up libqt4-designer (4.5.2-0ubuntu6) ...
Setting up libqt4-sql (4.5.2-0ubuntu6) ...
Setting up libqt4-qt3support (4.5.2-0ubuntu6) ...
Setting up libqt4-svg (4.5.2-0ubuntu6) ...
Setting up libqt4-phonon (4.5.2-0ubuntu6) ...
Setting up libqt4-webkit (4.5.2-0ubuntu6) ...
Setting up libqt4-scripttools (4.5.2-0ubuntu6) ...
Setting up libqt4-xmlpatterns (4.5.2-0ubuntu6) ...
Setting up libqt4-help (4.5.2-0ubuntu6) ...
Setting up libqt4-test (4.5.2-0ubuntu6) ...
Setting up qt4-qmake (4.5.2-0ubuntu6) ...
update-alternatives: using /usr/bin/qmake-qt4 to provide /usr/bin/qmake (qmake) in auto mode.
Setting up libxmu6 (2:1.0.4-2) ...
Setting up libxmu-dev (2:1.0.4-2) ...
Setting up xlibmesa-gl-dev (1:7.4+3ubuntu5) ...
Setting up libaudio-dev (1.9.2-1) ...
Setting up libsqlite0 (2.8.17-4build2) ...
Setting up libsqlite0-dev (2.8.17-4build2) ...
Setting up libqt4-dev (4.5.2-0ubuntu6) ...
update-alternatives: using /usr/bin/moc-qt4 to provide /usr/bin/moc (moc) in auto mode.
update-alternatives: using /usr/bin/uic-qt4 to provide /usr/bin/uic (uic) in auto mode.
update-alternatives: using /usr/bin/lupdate-qt4 to provide /usr/bin/lupdate (lupdate) in auto mode.
update-alternatives: using /usr/bin/lrelease-qt4 to provide /usr/bin/lrelease (lrelease) in auto mode.
Setting up python2.6-dev (2.6.3-0ubuntu1) ...
Setting up python-dev (2.6.2-0ubuntu1) ...
Setting up python-sip4 (4.8.2-1) ...
Setting up python-qt4 (4.5.4-0ubuntu1) ...
Setting up python-sip4-dev (4.8.2-1) ...
Setting up python-qt4-dev (4.5.4-0ubuntu1) ...
Setting up sip4 (4.8.2-1) ...
Processing triggers for libc-bin ...
ldconfig deferred processing now taking place
Processing triggers for python-support ...
Checking correctness of source dependencies...
Toolchain package versions: libc6-dev_2.10.1-0ubuntu13 make_3.81-6 dpkg-dev_1.15.4ubuntu2 linux-libc-dev_2.6.31-11.38 g++-4.4_4.4.1-4ubuntu5 gcc-4.4_4.4.1-4ubuntu5 binutils_2.19.91.20091001-0ubuntu2 libstdc++6_4.4.1-4ubuntu5 libstdc++6-4.4-dev_4.4.1-4ubuntu5
------------------------------------------------------------------------------
sh: gcc: not found
dpkg-source: warning: Couldn't determine gcc system type, falling back to default (native compilation)
gpg: Signature made Fri May 15 00:26:22 2009 BST using DSA key ID DD4D5088
gpg: Can't check signature: public key not found
dpkg-source: extracting qzion in qzion-0.4.0
dpkg-source: unpacking qzion_0.4.0.orig.tar.gz
dpkg-source: applying /home/buildd/build-karmic-autotest/qzion_0.4.0-0ubuntu3.diff.gz
dpkg-buildpackage: set CFLAGS to default value: -g -O2
dpkg-buildpackage: set CPPFLAGS to default value:
dpkg-buildpackage: set LDFLAGS to default value: -Wl,-Bsymbolic-functions
dpkg-buildpackage: set FFLAGS to default value: -g -O2
dpkg-buildpackage: set CXXFLAGS to default value: -g -O2
dpkg-buildpackage: source package qzion
dpkg-buildpackage: source version 0.4.0-0ubuntu3
dpkg-buildpackage: host architecture i386
/usr/bin/fakeroot debian/rules clean
test -x debian/rules
dh_testroot
rmdir obj-i486-linux-gnu
rmdir: failed to remove `obj-i486-linux-gnu': No such file or directory
make: [cleanbuilddir] Error 1 (ignored)
/usr/bin/make -C obj-i486-linux-gnu -k clean
make: *** obj-i486-linux-gnu: No such file or directory. Stop.
make: [makefile-clean] Error 2 (ignored)
rm -f debian/stamp-makefile-build
rm -rf obj-i486-linux-gnu
dh_clean
/usr/bin/make -f debian/rules reverse-config
make[1]: Entering directory `/build/buildd/qzion-0.4.0'
make[1]: Nothing to be done for `reverse-config'.
make[1]: Leaving directory `/build/buildd/qzion-0.4.0'
if [ "reverse-patches" = "reverse-patches" ]; then rm -f debian/stamp-patched; fi
patches: debian/patches/kubuntu_01_python_path.diff
Patch debian/patches/kubuntu_01_python_path.diff is not applied.
if [ "reverse-patches" != "reverse-patches" ]; then touch debian/stamp-patched; fi
if [ "reverse-patches" != "reverse-patches" ] ; then \
/usr/bin/make -f debian/rules update-config ; \
fi
for dir in debian/patches ; do \
rm -f $dir/*.log ; \
done
debian/rules build
test -x debian/rules
mkdir -p "obj-i486-linux-gnu"
/usr/bin/make -f debian/rules reverse-config
make[1]: Entering directory `/build/buildd/qzion-0.4.0'
make[1]: Nothing to be done for `reverse-config'.
make[1]: Leaving directory `/build/buildd/qzion-0.4.0'
if [ "debian/stamp-patched" = "reverse-patches" ]; then rm -f debian/stamp-patched; fi
patches: debian/patches/kubuntu_01_python_path.diff
Trying patch debian/patches/kubuntu_01_python_path.diff at level 1 ... success.
if [ "debian/stamp-patched" != "reverse-patches" ]; then touch debian/stamp-patched; fi
if [ "debian/stamp-patched" != "reverse-patches" ] ; then \
/usr/bin/make -f debian/rules update-config ; \
fi
make[1]: Entering directory `/build/buildd/qzion-0.4.0'
make[1]: Nothing to be done for `update-config'.
make[1]: Leaving directory `/build/buildd/qzion-0.4.0'
cd obj-i486-linux-gnu && cmake /build/buildd/qzion-0.4.0/. -DCMAKE_INSTALL_PREFIX="/usr" -DCMAKE_C_COMPILER:FILEPATH="cc" -DCMAKE_CXX_COMPILER:FILEPATH="g++" -DCMAKE_C_FLAGS="-g -O2 -g -Wall -O2" -DCMAKE_CXX_FLAGS="-g -O2 -g -Wall -O2" -DCMAKE_SKIP_RPATH=ON -DCMAKE_VERBOSE_MAKEFILE=ON
-- The C compiler identification is GNU
-- The CXX compiler identification is GNU
-- Check for working C compiler: /usr/bin/cc
-- Check for working C compiler: /usr/bin/cc -- works
-- Detecting C compiler ABI info
-- Detecting C compiler ABI info - done
-- Check for working CXX compiler: /usr/bin/g++
-- Check for working CXX compiler: /usr/bin/g++ -- works
-- Detecting CXX compiler ABI info
-- Detecting CXX compiler ABI info - done
-- Looking for Q_WS_X11
-- Looking for Q_WS_X11 - found
-- Looking for Q_WS_WIN
-- Looking for Q_WS_WIN - not found.
-- Looking for Q_WS_QWS
-- Looking for Q_WS_QWS - not found.
-- Looking for Q_WS_MAC
-- Looking for Q_WS_MAC - not found.
-- Found Qt-Version 4.5.2
-- Using build type: RelWithDebInfo
-- Using QPainter backend
-- Found PythonInterp: /usr/bin/python2.6
-- Found Python executable: /usr/bin/python2.6
-- Found Python version: 2.6.3
-- Found Python library: /usr/lib/libpython2.6.so
-- Found SIP version: 4.8.2
-- Found PyQt4 version: 4.5.4
-- Configuring done
-- Generating done
-- Build files have been written to: /build/buildd/qzion-0.4.0/obj-i486-linux-gnu
/usr/bin/make -C obj-i486-linux-gnu
make[1]: Entering directory `/build/buildd/qzion-0.4.0/obj-i486-linux-gnu'
/usr/bin/cmake -H/build/buildd/qzion-0.4.0 -B/build/buildd/qzion-0.4.0/obj-i486-linux-gnu --check-build-system CMakeFiles/Makefile.cmake 0
/usr/bin/cmake -E cmake_progress_start /build/buildd/qzion-0.4.0/obj-i486-linux-gnu/CMakeFiles /build/buildd/qzion-0.4.0/obj-i486-linux-gnu/CMakeFiles/progress.make
/usr/bin/make -f CMakeFiles/Makefile2 all
make[2]: Entering directory `/build/buildd/qzion-0.4.0/obj-i486-linux-gnu'
/usr/bin/make -f src/qpainter/CMakeFiles/qzion.dir/build.make src/qpainter/CMakeFiles/qzion.dir/depend
make[3]: Entering directory `/build/buildd/qzion-0.4.0/obj-i486-linux-gnu'
/usr/bin/cmake -E cmake_progress_report /build/buildd/qzion-0.4.0/obj-i486-linux-gnu/CMakeFiles 36
[ 1%] Generating __/common/moc_qzioncustomobject.cxx
cd /build/buildd/qzion-0.4.0/obj-i486-linux-gnu/src/qpainter && /usr/bin/moc-qt4 -I/usr/include/qt4 -I/usr/include/qt4/QtWebKit -I/usr/include/qt4/QtGui -I/usr/include/qt4/QtCore -I/build/buildd/qzion-0.4.0/src/qpainter/../common -DQT_DLL -DQT_WEBKIT_LIB -DQT_GUI_LIB -DQT_CORE_LIB -o /build/buildd/qzion-0.4.0/obj-i486-linux-gnu/src/qpainter/__/common/moc_qzioncustomobject.cxx /build/buildd/qzion-0.4.0/src/common/qzioncustomobject.h
/usr/bin/cmake -E cmake_progress_report /build/buildd/qzion-0.4.0/obj-i486-linux-gnu/CMakeFiles 24
[ 3%] Generating moc_qziontextblock_p.cxx
cd /build/buildd/qzion-0.4.0/obj-i486-linux-gnu/src/qpainter && /usr/bin/moc-qt4 -I/usr/include/qt4 -I/usr/include/qt4/QtWebKit -I/usr/include/qt4/QtGui -I/usr/include/qt4/QtCore -I/build/buildd/qzion-0.4.0/src/qpainter/../common -DQT_DLL -DQT_WEBKIT_LIB -DQT_GUI_LIB -DQT_CORE_LIB -o /build/buildd/qzion-0.4.0/obj-i486-linux-gnu/src/qpainter/moc_qziontextblock_p.cxx /build/buildd/qzion-0.4.0/src/qpainter/qziontextblock_p.h
/usr/bin/cmake -E cmake_progress_report /build/buildd/qzion-0.4.0/obj-i486-linux-gnu/CMakeFiles 25
[ 4%] Generating __/common/moc_qzion.cxx
cd /build/buildd/qzion-0.4.0/obj-i486-linux-gnu/src/qpainter && /usr/bin/moc-qt4 -I/usr/include/qt4 -I/usr/include/qt4/QtWebKit -I/usr/include/qt4/QtGui -I/usr/include/qt4/QtCore -I/build/buildd/qzion-0.4.0/src/qpainter/../common -DQT_DLL -DQT_WEBKIT_LIB -DQT_GUI_LIB -DQT_CORE_LIB -o /build/buildd/qzion-0.4.0/obj-i486-linux-gnu/src/qpainter/__/common/moc_qzion.cxx /build/buildd/qzion-0.4.0/src/common/qzion.h
/build/buildd/qzion-0.4.0/src/common/qzion.h:0: Warning: No relevant classes found. No output generated.
/usr/bin/cmake -E cmake_progress_report /build/buildd/qzion-0.4.0/obj-i486-linux-gnu/CMakeFiles 26
[ 6%] Generating __/common/moc_qzionmacros.cxx
cd /build/buildd/qzion-0.4.0/obj-i486-linux-gnu/src/qpainter && /usr/bin/moc-qt4 -I/usr/include/qt4 -I/usr/include/qt4/QtWebKit -I/usr/include/qt4/QtGui -I/usr/include/qt4/QtCore -I/build/buildd/qzion-0.4.0/src/qpainter/../common -DQT_DLL -DQT_WEBKIT_LIB -DQT_GUI_LIB -DQT_CORE_LIB -o /build/buildd/qzion-0.4.0/obj-i486-linux-gnu/src/qpainter/__/common/moc_qzionmacros.cxx /build/buildd/qzion-0.4.0/src/common/qzionmacros.h
/build/buildd/qzion-0.4.0/src/common/qzionmacros.h:0: Warning: No relevant classes found. No output generated.
/usr/bin/cmake -E cmake_progress_report /build/buildd/qzion-0.4.0/obj-i486-linux-gnu/CMakeFiles 27
[ 8%] Generating __/common/moc_qziontext.cxx
cd /build/buildd/qzion-0.4.0/obj-i486-linux-gnu/src/qpainter && /usr/bin/moc-qt4 -I/usr/include/qt4 -I/usr/include/qt4/QtWebKit -I/usr/include/qt4/QtGui -I/usr/include/qt4/QtCore -I/build/buildd/qzion-0.4.0/src/qpainter/../common -DQT_DLL -DQT_WEBKIT_LIB -DQT_GUI_LIB -DQT_CORE_LIB -o /build/buildd/qzion-0.4.0/obj-i486-linux-gnu/src/qpainter/__/common/moc_qziontext.cxx /build/buildd/qzion-0.4.0/src/common/qziontext.h
/usr/bin/cmake -E cmake_progress_report /build/buildd/qzion-0.4.0/obj-i486-linux-gnu/CMakeFiles 28
[ 9%] Generating __/common/moc_qziontextblock.cxx
cd /build/buildd/qzion-0.4.0/obj-i486-linux-gnu/src/qpainter && /usr/bin/moc-qt4 -I/usr/include/qt4 -I/usr/include/qt4/QtWebKit -I/usr/include/qt4/QtGui -I/usr/include/qt4/QtCore -I/build/buildd/qzion-0.4.0/src/qpainter/../common -DQT_DLL -DQT_WEBKIT_LIB -DQT_GUI_LIB -DQT_CORE_LIB -o /build/buildd/qzion-0.4.0/obj-i486-linux-gnu/src/qpainter/__/common/moc_qziontextblock.cxx /build/buildd/qzion-0.4.0/src/common/qziontextblock.h
/usr/bin/cmake -E cmake_progress_report /build/buildd/qzion-0.4.0/obj-i486-linux-gnu/CMakeFiles 29
[ 11%] Generating __/common/moc_qzionrectangle.cxx
cd /build/buildd/qzion-0.4.0/obj-i486-linux-gnu/src/qpainter && /usr/bin/moc-qt4 -I/usr/include/qt4 -I/usr/include/qt4/QtWebKit -I/usr/include/qt4/QtGui -I/usr/include/qt4/QtCore -I/build/buildd/qzion-0.4.0/src/qpainter/../common -DQT_DLL -DQT_WEBKIT_LIB -DQT_GUI_LIB -DQT_CORE_LIB -o /build/buildd/qzion-0.4.0/obj-i486-linux-gnu/src/qpainter/__/common/moc_qzionrectangle.cxx /build/buildd/qzion-0.4.0/src/common/qzionrectangle.h
/usr/bin/cmake -E cmake_progress_report /build/buildd/qzion-0.4.0/obj-i486-linux-gnu/CMakeFiles 30
[ 13%] Generating __/common/moc_qziongroup.cxx
cd /build/buildd/qzion-0.4.0/obj-i486-linux-gnu/src/qpainter && /usr/bin/moc-qt4 -I/usr/include/qt4 -I/usr/include/qt4/QtWebKit -I/usr/include/qt4/QtGui -I/usr/include/qt4/QtCore -I/build/buildd/qzion-0.4.0/src/qpainter/../common -DQT_DLL -DQT_WEBKIT_LIB -DQT_GUI_LIB -DQT_CORE_LIB -o /build/buildd/qzion-0.4.0/obj-i486-linux-gnu/src/qpainter/__/common/moc_qziongroup.cxx /build/buildd/qzion-0.4.0/src/common/qziongroup.h
/usr/bin/cmake -E cmake_progress_report /build/buildd/qzion-0.4.0/obj-i486-linux-gnu/CMakeFiles 31
[ 14%] Generating __/common/moc_qzionclippedgroup.cxx
cd /build/buildd/qzion-0.4.0/obj-i486-linux-gnu/src/qpainter && /usr/bin/moc-qt4 -I/usr/include/qt4 -I/usr/include/qt4/QtWebKit -I/usr/include/qt4/QtGui -I/usr/include/qt4/QtCore -I/build/buildd/qzion-0.4.0/src/qpainter/../common -DQT_DLL -DQT_WEBKIT_LIB -DQT_GUI_LIB -DQT_CORE_LIB -o /build/buildd/qzion-0.4.0/obj-i486-linux-gnu/src/qpainter/__/common/moc_qzionclippedgroup.cxx /build/buildd/qzion-0.4.0/src/common/qzionclippedgroup.h
/usr/bin/cmake -E cmake_progress_report /build/buildd/qzion-0.4.0/obj-i486-linux-gnu/CMakeFiles 32
[ 16%] Generating __/common/moc_qzionimage.cxx
cd /build/buildd/qzion-0.4.0/obj-i486-linux-gnu/src/qpainter && /usr/bin/moc-qt4 -I/usr/include/qt4 -I/usr/include/qt4/QtWebKit -I/usr/include/qt4/QtGui -I/usr/include/qt4/QtCore -I/build/buildd/qzion-0.4.0/src/qpainter/../common -DQT_DLL -DQT_WEBKIT_LIB -DQT_GUI_LIB -DQT_CORE_LIB -o /build/buildd/qzion-0.4.0/obj-i486-linux-gnu/src/qpainter/__/common/moc_qzionimage.cxx /build/buildd/qzion-0.4.0/src/common/qzionimage.h
/usr/bin/cmake -E cmake_progress_report /build/buildd/qzion-0.4.0/obj-i486-linux-gnu/CMakeFiles 33
[ 18%] Generating __/common/moc_qzioncanvas.cxx
cd /build/buildd/qzion-0.4.0/obj-i486-linux-gnu/src/qpainter && /usr/bin/moc-qt4 -I/usr/include/qt4 -I/usr/include/qt4/QtWebKit -I/usr/include/qt4/QtGui -I/usr/include/qt4/QtCore -I/build/buildd/qzion-0.4.0/src/qpainter/../common -DQT_DLL -DQT_WEBKIT_LIB -DQT_GUI_LIB -DQT_CORE_LIB -o /build/buildd/qzion-0.4.0/obj-i486-linux-gnu/src/qpainter/__/common/moc_qzioncanvas.cxx /build/buildd/qzion-0.4.0/src/common/qzioncanvas.h
/usr/bin/cmake -E cmake_progress_report /build/buildd/qzion-0.4.0/obj-i486-linux-gnu/CMakeFiles 34
[ 19%] Generating __/common/moc_qzionobject.cxx
cd /build/buildd/qzion-0.4.0/obj-i486-linux-gnu/src/qpainter && /usr/bin/moc-qt4 -I/usr/include/qt4 -I/usr/include/qt4/QtWebKit -I/usr/include/qt4/QtGui -I/usr/include/qt4/QtCore -I/build/buildd/qzion-0.4.0/src/qpainter/../common -DQT_DLL -DQT_WEBKIT_LIB -DQT_GUI_LIB -DQT_CORE_LIB -o /build/buildd/qzion-0.4.0/obj-i486-linux-gnu/src/qpainter/__/common/moc_qzionobject.cxx /build/buildd/qzion-0.4.0/src/common/qzionobject.h
/usr/bin/cmake -E cmake_progress_report /build/buildd/qzion-0.4.0/obj-i486-linux-gnu/CMakeFiles 35
[ 21%] Generating __/common/moc_qzionabstractcanvas.cxx
cd /build/buildd/qzion-0.4.0/obj-i486-linux-gnu/src/qpainter && /usr/bin/moc-qt4 -I/usr/include/qt4 -I/usr/include/qt4/QtWebKit -I/usr/include/qt4/QtGui -I/usr/include/qt4/QtCore -I/build/buildd/qzion-0.4.0/src/qpainter/../common -DQT_DLL -DQT_WEBKIT_LIB -DQT_GUI_LIB -DQT_CORE_LIB -o /build/buildd/qzion-0.4.0/obj-i486-linux-gnu/src/qpainter/__/common/moc_qzionabstractcanvas.cxx /build/buildd/qzion-0.4.0/src/common/qzionabstractcanvas.h
/build/buildd/qzion-0.4.0/src/common/qzionabstractcanvas.h:0: Warning: No relevant classes found. No output generated.
cd /build/buildd/qzion-0.4.0/obj-i486-linux-gnu && /usr/bin/cmake -E cmake_depends "Unix Makefiles" /build/buildd/qzion-0.4.0 /build/buildd/qzion-0.4.0/src/qpainter /build/buildd/qzion-0.4.0/obj-i486-linux-gnu /build/buildd/qzion-0.4.0/obj-i486-linux-gnu/src/qpainter /build/buildd/qzion-0.4.0/obj-i486-linux-gnu/src/qpainter/CMakeFiles/qzion.dir/DependInfo.cmake --color=
Scanning dependencies of target qzion
make[3]: Leaving directory `/build/buildd/qzion-0.4.0/obj-i486-linux-gnu'
/usr/bin/make -f src/qpainter/CMakeFiles/qzion.dir/build.make src/qpainter/CMakeFiles/qzion.dir/build
make[3]: Entering directory `/build/buildd/qzion-0.4.0/obj-i486-linux-gnu'
/usr/bin/cmake -E cmake_progress_report /build/buildd/qzion-0.4.0/obj-i486-linux-gnu/CMakeFiles 1
[ 22%] Building CXX object src/qpainter/CMakeFiles/qzion.dir/qzioncanvas.cpp.o
cd /build/buildd/qzion-0.4.0/obj-i486-linux-gnu/src/qpainter && /usr/bin/g++ -Dqzion_EXPORTS -DQT_DLL -DQT_WEBKIT_LIB -DQT_GUI_LIB -DQT_CORE_LIB -DQT_NO_DEBUG -g -O2 -g -Wall -O2 -Wall -O2 -g -DQT_NO_DEBUG_OUTPUT -fPIC -I/build/buildd/qzion-0.4.0/obj-i486-linux-gnu/src/qpainter -I/build/buildd/qzion-0.4.0/src/qpainter -I/usr/include/qt4 -I/usr/include/qt4/QtWebKit -I/usr/include/qt4/QtGui -I/usr/include/qt4/QtCore -I/build/buildd/qzion-0.4.0/src/qpainter/../common -o CMakeFiles/qzion.dir/qzioncanvas.cpp.o -c /build/buildd/qzion-0.4.0/src/qpainter/qzioncanvas.cpp
/usr/bin/cmake -E cmake_progress_report /build/buildd/qzion-0.4.0/obj-i486-linux-gnu/CMakeFiles 2
[ 24%] Building CXX object src/qpainter/CMakeFiles/qzion.dir/qzionabstractcanvas.cpp.o
cd /build/buildd/qzion-0.4.0/obj-i486-linux-gnu/src/qpainter && /usr/bin/g++ -Dqzion_EXPORTS -DQT_DLL -DQT_WEBKIT_LIB -DQT_GUI_LIB -DQT_CORE_LIB -DQT_NO_DEBUG -g -O2 -g -Wall -O2 -Wall -O2 -g -DQT_NO_DEBUG_OUTPUT -fPIC -I/build/buildd/qzion-0.4.0/obj-i486-linux-gnu/src/qpainter -I/build/buildd/qzion-0.4.0/src/qpainter -I/usr/include/qt4 -I/usr/include/qt4/QtWebKit -I/usr/include/qt4/QtGui -I/usr/include/qt4/QtCore -I/build/buildd/qzion-0.4.0/src/qpainter/../common -o CMakeFiles/qzion.dir/qzionabstractcanvas.cpp.o -c /build/buildd/qzion-0.4.0/src/qpainter/qzionabstractcanvas.cpp
/usr/bin/cmake -E cmake_progress_report /build/buildd/qzion-0.4.0/obj-i486-linux-gnu/CMakeFiles 3
[ 26%] Building CXX object src/qpainter/CMakeFiles/qzion.dir/qziongroup.cpp.o
cd /build/buildd/qzion-0.4.0/obj-i486-linux-gnu/src/qpainter && /usr/bin/g++ -Dqzion_EXPORTS -DQT_DLL -DQT_WEBKIT_LIB -DQT_GUI_LIB -DQT_CORE_LIB -DQT_NO_DEBUG -g -O2 -g -Wall -O2 -Wall -O2 -g -DQT_NO_DEBUG_OUTPUT -fPIC -I/build/buildd/qzion-0.4.0/obj-i486-linux-gnu/src/qpainter -I/build/buildd/qzion-0.4.0/src/qpainter -I/usr/include/qt4 -I/usr/include/qt4/QtWebKit -I/usr/include/qt4/QtGui -I/usr/include/qt4/QtCore -I/build/buildd/qzion-0.4.0/src/qpainter/../common -o CMakeFiles/qzion.dir/qziongroup.cpp.o -c /build/buildd/qzion-0.4.0/src/qpainter/qziongroup.cpp
/build/buildd/qzion-0.4.0/src/qpainter/qziongroup.cpp: In member function 'virtual QColor QZionGroup::effectiveColor()':
/build/buildd/qzion-0.4.0/src/qpainter/qziongroup.cpp:224: warning: no return statement in function returning non-void
/usr/bin/cmake -E cmake_progress_report /build/buildd/qzion-0.4.0/obj-i486-linux-gnu/CMakeFiles 4
[ 27%] Building CXX object src/qpainter/CMakeFiles/qzion.dir/qzionimage.cpp.o
cd /build/buildd/qzion-0.4.0/obj-i486-linux-gnu/src/qpainter && /usr/bin/g++ -Dqzion_EXPORTS -DQT_DLL -DQT_WEBKIT_LIB -DQT_GUI_LIB -DQT_CORE_LIB -DQT_NO_DEBUG -g -O2 -g -Wall -O2 -Wall -O2 -g -DQT_NO_DEBUG_OUTPUT -fPIC -I/build/buildd/qzion-0.4.0/obj-i486-linux-gnu/src/qpainter -I/build/buildd/qzion-0.4.0/src/qpainter -I/usr/include/qt4 -I/usr/include/qt4/QtWebKit -I/usr/include/qt4/QtGui -I/usr/include/qt4/QtCore -I/build/buildd/qzion-0.4.0/src/qpainter/../common -o CMakeFiles/qzion.dir/qzionimage.cpp.o -c /build/buildd/qzion-0.4.0/src/qpainter/qzionimage.cpp
/usr/bin/cmake -E cmake_progress_report /build/buildd/qzion-0.4.0/obj-i486-linux-gnu/CMakeFiles 5
[ 29%] Building CXX object src/qpainter/CMakeFiles/qzion.dir/qzionobject.cpp.o
cd /build/buildd/qzion-0.4.0/obj-i486-linux-gnu/src/qpainter && /usr/bin/g++ -Dqzion_EXPORTS -DQT_DLL -DQT_WEBKIT_LIB -DQT_GUI_LIB -DQT_CORE_LIB -DQT_NO_DEBUG -g -O2 -g -Wall -O2 -Wall -O2 -g -DQT_NO_DEBUG_OUTPUT -fPIC -I/build/buildd/qzion-0.4.0/obj-i486-linux-gnu/src/qpainter -I/build/buildd/qzion-0.4.0/src/qpainter -I/usr/include/qt4 -I/usr/include/qt4/QtWebKit -I/usr/include/qt4/QtGui -I/usr/include/qt4/QtCore -I/build/buildd/qzion-0.4.0/src/qpainter/../common -o CMakeFiles/qzion.dir/qzionobject.cpp.o -c /build/buildd/qzion-0.4.0/src/qpainter/qzionobject.cpp
/usr/bin/cmake -E cmake_progress_report /build/buildd/qzion-0.4.0/obj-i486-linux-gnu/CMakeFiles 6
[ 31%] Building CXX object src/qpainter/CMakeFiles/qzion.dir/qzionrectangle.cpp.o
cd /build/buildd/qzion-0.4.0/obj-i486-linux-gnu/src/qpainter && /usr/bin/g++ -Dqzion_EXPORTS -DQT_DLL -DQT_WEBKIT_LIB -DQT_GUI_LIB -DQT_CORE_LIB -DQT_NO_DEBUG -g -O2 -g -Wall -O2 -Wall -O2 -g -DQT_NO_DEBUG_OUTPUT -fPIC -I/build/buildd/qzion-0.4.0/obj-i486-linux-gnu/src/qpainter -I/build/buildd/qzion-0.4.0/src/qpainter -I/usr/include/qt4 -I/usr/include/qt4/QtWebKit -I/usr/include/qt4/QtGui -I/usr/include/qt4/QtCore -I/build/buildd/qzion-0.4.0/src/qpainter/../common -o CMakeFiles/qzion.dir/qzionrectangle.cpp.o -c /build/buildd/qzion-0.4.0/src/qpainter/qzionrectangle.cpp
/usr/bin/cmake -E cmake_progress_report /build/buildd/qzion-0.4.0/obj-i486-linux-gnu/CMakeFiles 7
[ 32%] Building CXX object src/qpainter/CMakeFiles/qzion.dir/qziontext.cpp.o
cd /build/buildd/qzion-0.4.0/obj-i486-linux-gnu/src/qpainter && /usr/bin/g++ -Dqzion_EXPORTS -DQT_DLL -DQT_WEBKIT_LIB -DQT_GUI_LIB -DQT_CORE_LIB -DQT_NO_DEBUG -g -O2 -g -Wall -O2 -Wall -O2 -g -DQT_NO_DEBUG_OUTPUT -fPIC -I/build/buildd/qzion-0.4.0/obj-i486-linux-gnu/src/qpainter -I/build/buildd/qzion-0.4.0/src/qpainter -I/usr/include/qt4 -I/usr/include/qt4/QtWebKit -I/usr/include/qt4/QtGui -I/usr/include/qt4/QtCore -I/build/buildd/qzion-0.4.0/src/qpainter/../common -o CMakeFiles/qzion.dir/qziontext.cpp.o -c /build/buildd/qzion-0.4.0/src/qpainter/qziontext.cpp
/usr/bin/cmake -E cmake_progress_report /build/buildd/qzion-0.4.0/obj-i486-linux-gnu/CMakeFiles 8
[ 34%] Building CXX object src/qpainter/CMakeFiles/qzion.dir/qziontextblock.cpp.o
cd /build/buildd/qzion-0.4.0/obj-i486-linux-gnu/src/qpainter && /usr/bin/g++ -Dqzion_EXPORTS -DQT_DLL -DQT_WEBKIT_LIB -DQT_GUI_LIB -DQT_CORE_LIB -DQT_NO_DEBUG -g -O2 -g -Wall -O2 -Wall -O2 -g -DQT_NO_DEBUG_OUTPUT -fPIC -I/build/buildd/qzion-0.4.0/obj-i486-linux-gnu/src/qpainter -I/build/buildd/qzion-0.4.0/src/qpainter -I/usr/include/qt4 -I/usr/include/qt4/QtWebKit -I/usr/include/qt4/QtGui -I/usr/include/qt4/QtCore -I/build/buildd/qzion-0.4.0/src/qpainter/../common -o CMakeFiles/qzion.dir/qziontextblock.cpp.o -c /build/buildd/qzion-0.4.0/src/qpainter/qziontextblock.cpp
/usr/bin/cmake -E cmake_progress_report /build/buildd/qzion-0.4.0/obj-i486-linux-gnu/CMakeFiles 9
[ 36%] Building CXX object src/qpainter/CMakeFiles/qzion.dir/qzionclippedgroup.cpp.o
cd /build/buildd/qzion-0.4.0/obj-i486-linux-gnu/src/qpainter && /usr/bin/g++ -Dqzion_EXPORTS -DQT_DLL -DQT_WEBKIT_LIB -DQT_GUI_LIB -DQT_CORE_LIB -DQT_NO_DEBUG -g -O2 -g -Wall -O2 -Wall -O2 -g -DQT_NO_DEBUG_OUTPUT -fPIC -I/build/buildd/qzion-0.4.0/obj-i486-linux-gnu/src/qpainter -I/build/buildd/qzion-0.4.0/src/qpainter -I/usr/include/qt4 -I/usr/include/qt4/QtWebKit -I/usr/include/qt4/QtGui -I/usr/include/qt4/QtCore -I/build/buildd/qzion-0.4.0/src/qpainter/../common -o CMakeFiles/qzion.dir/qzionclippedgroup.cpp.o -c /build/buildd/qzion-0.4.0/src/qpainter/qzionclippedgroup.cpp
/usr/bin/cmake -E cmake_progress_report /build/buildd/qzion-0.4.0/obj-i486-linux-gnu/CMakeFiles 10
[ 37%] Building CXX object src/qpainter/CMakeFiles/qzion.dir/qzioncustomobject.cpp.o
cd /build/buildd/qzion-0.4.0/obj-i486-linux-gnu/src/qpainter && /usr/bin/g++ -Dqzion_EXPORTS -DQT_DLL -DQT_WEBKIT_LIB -DQT_GUI_LIB -DQT_CORE_LIB -DQT_NO_DEBUG -g -O2 -g -Wall -O2 -Wall -O2 -g -DQT_NO_DEBUG_OUTPUT -fPIC -I/build/buildd/qzion-0.4.0/obj-i486-linux-gnu/src/qpainter -I/build/buildd/qzion-0.4.0/src/qpainter -I/usr/include/qt4 -I/usr/include/qt4/QtWebKit -I/usr/include/qt4/QtGui -I/usr/include/qt4/QtCore -I/build/buildd/qzion-0.4.0/src/qpainter/../common -o CMakeFiles/qzion.dir/qzioncustomobject.cpp.o -c /build/buildd/qzion-0.4.0/src/qpainter/qzioncustomobject.cpp
/usr/bin/cmake -E cmake_progress_report /build/buildd/qzion-0.4.0/obj-i486-linux-gnu/CMakeFiles 11
[ 39%] Building CXX object src/qpainter/CMakeFiles/qzion.dir/moc_qziontextblock_p.cxx.o
cd /build/buildd/qzion-0.4.0/obj-i486-linux-gnu/src/qpainter && /usr/bin/g++ -Dqzion_EXPORTS -DQT_DLL -DQT_WEBKIT_LIB -DQT_GUI_LIB -DQT_CORE_LIB -DQT_NO_DEBUG -g -O2 -g -Wall -O2 -Wall -O2 -g -DQT_NO_DEBUG_OUTPUT -fPIC -I/build/buildd/qzion-0.4.0/obj-i486-linux-gnu/src/qpainter -I/build/buildd/qzion-0.4.0/src/qpainter -I/usr/include/qt4 -I/usr/include/qt4/QtWebKit -I/usr/include/qt4/QtGui -I/usr/include/qt4/QtCore -I/build/buildd/qzion-0.4.0/src/qpainter/../common -o CMakeFiles/qzion.dir/moc_qziontextblock_p.cxx.o -c /build/buildd/qzion-0.4.0/obj-i486-linux-gnu/src/qpainter/moc_qziontextblock_p.cxx
/usr/bin/cmake -E cmake_progress_report /build/buildd/qzion-0.4.0/obj-i486-linux-gnu/CMakeFiles 12
[ 40%] Building CXX object src/qpainter/CMakeFiles/qzion.dir/__/common/moc_qzion.cxx.o
cd /build/buildd/qzion-0.4.0/obj-i486-linux-gnu/src/qpainter && /usr/bin/g++ -Dqzion_EXPORTS -DQT_DLL -DQT_WEBKIT_LIB -DQT_GUI_LIB -DQT_CORE_LIB -DQT_NO_DEBUG -g -O2 -g -Wall -O2 -Wall -O2 -g -DQT_NO_DEBUG_OUTPUT -fPIC -I/build/buildd/qzion-0.4.0/obj-i486-linux-gnu/src/qpainter -I/build/buildd/qzion-0.4.0/src/qpainter -I/usr/include/qt4 -I/usr/include/qt4/QtWebKit -I/usr/include/qt4/QtGui -I/usr/include/qt4/QtCore -I/build/buildd/qzion-0.4.0/src/qpainter/../common -o CMakeFiles/qzion.dir/__/common/moc_qzion.cxx.o -c /build/buildd/qzion-0.4.0/obj-i486-linux-gnu/src/qpainter/__/common/moc_qzion.cxx
/usr/bin/cmake -E cmake_progress_report /build/buildd/qzion-0.4.0/obj-i486-linux-gnu/CMakeFiles 13
[ 42%] Building CXX object src/qpainter/CMakeFiles/qzion.dir/__/common/moc_qzionmacros.cxx.o
cd /build/buildd/qzion-0.4.0/obj-i486-linux-gnu/src/qpainter && /usr/bin/g++ -Dqzion_EXPORTS -DQT_DLL -DQT_WEBKIT_LIB -DQT_GUI_LIB -DQT_CORE_LIB -DQT_NO_DEBUG -g -O2 -g -Wall -O2 -Wall -O2 -g -DQT_NO_DEBUG_OUTPUT -fPIC -I/build/buildd/qzion-0.4.0/obj-i486-linux-gnu/src/qpainter -I/build/buildd/qzion-0.4.0/src/qpainter -I/usr/include/qt4 -I/usr/include/qt4/QtWebKit -I/usr/include/qt4/QtGui -I/usr/include/qt4/QtCore -I/build/buildd/qzion-0.4.0/src/qpainter/../common -o CMakeFiles/qzion.dir/__/common/moc_qzionmacros.cxx.o -c /build/buildd/qzion-0.4.0/obj-i486-linux-gnu/src/qpainter/__/common/moc_qzionmacros.cxx
/usr/bin/cmake -E cmake_progress_report /build/buildd/qzion-0.4.0/obj-i486-linux-gnu/CMakeFiles 14
[ 44%] Building CXX object src/qpainter/CMakeFiles/qzion.dir/__/common/moc_qziontext.cxx.o
cd /build/buildd/qzion-0.4.0/obj-i486-linux-gnu/src/qpainter && /usr/bin/g++ -Dqzion_EXPORTS -DQT_DLL -DQT_WEBKIT_LIB -DQT_GUI_LIB -DQT_CORE_LIB -DQT_NO_DEBUG -g -O2 -g -Wall -O2 -Wall -O2 -g -DQT_NO_DEBUG_OUTPUT -fPIC -I/build/buildd/qzion-0.4.0/obj-i486-linux-gnu/src/qpainter -I/build/buildd/qzion-0.4.0/src/qpainter -I/usr/include/qt4 -I/usr/include/qt4/QtWebKit -I/usr/include/qt4/QtGui -I/usr/include/qt4/QtCore -I/build/buildd/qzion-0.4.0/src/qpainter/../common -o CMakeFiles/qzion.dir/__/common/moc_qziontext.cxx.o -c /build/buildd/qzion-0.4.0/obj-i486-linux-gnu/src/qpainter/__/common/moc_qziontext.cxx
/usr/bin/cmake -E cmake_progress_report /build/buildd/qzion-0.4.0/obj-i486-linux-gnu/CMakeFiles 15
[ 45%] Building CXX object src/qpainter/CMakeFiles/qzion.dir/__/common/moc_qziontextblock.cxx.o
cd /build/buildd/qzion-0.4.0/obj-i486-linux-gnu/src/qpainter && /usr/bin/g++ -Dqzion_EXPORTS -DQT_DLL -DQT_WEBKIT_LIB -DQT_GUI_LIB -DQT_CORE_LIB -DQT_NO_DEBUG -g -O2 -g -Wall -O2 -Wall -O2 -g -DQT_NO_DEBUG_OUTPUT -fPIC -I/build/buildd/qzion-0.4.0/obj-i486-linux-gnu/src/qpainter -I/build/buildd/qzion-0.4.0/src/qpainter -I/usr/include/qt4 -I/usr/include/qt4/QtWebKit -I/usr/include/qt4/QtGui -I/usr/include/qt4/QtCore -I/build/buildd/qzion-0.4.0/src/qpainter/../common -o CMakeFiles/qzion.dir/__/common/moc_qziontextblock.cxx.o -c /build/buildd/qzion-0.4.0/obj-i486-linux-gnu/src/qpainter/__/common/moc_qziontextblock.cxx
/usr/bin/cmake -E cmake_progress_report /build/buildd/qzion-0.4.0/obj-i486-linux-gnu/CMakeFiles 16
[ 47%] Building CXX object src/qpainter/CMakeFiles/qzion.dir/__/common/moc_qzionrectangle.cxx.o
cd /build/buildd/qzion-0.4.0/obj-i486-linux-gnu/src/qpainter && /usr/bin/g++ -Dqzion_EXPORTS -DQT_DLL -DQT_WEBKIT_LIB -DQT_GUI_LIB -DQT_CORE_LIB -DQT_NO_DEBUG -g -O2 -g -Wall -O2 -Wall -O2 -g -DQT_NO_DEBUG_OUTPUT -fPIC -I/build/buildd/qzion-0.4.0/obj-i486-linux-gnu/src/qpainter -I/build/buildd/qzion-0.4.0/src/qpainter -I/usr/include/qt4 -I/usr/include/qt4/QtWebKit -I/usr/include/qt4/QtGui -I/usr/include/qt4/QtCore -I/build/buildd/qzion-0.4.0/src/qpainter/../common -o CMakeFiles/qzion.dir/__/common/moc_qzionrectangle.cxx.o -c /build/buildd/qzion-0.4.0/obj-i486-linux-gnu/src/qpainter/__/common/moc_qzionrectangle.cxx
/usr/bin/cmake -E cmake_progress_report /build/buildd/qzion-0.4.0/obj-i486-linux-gnu/CMakeFiles 17
[ 49%] Building CXX object src/qpainter/CMakeFiles/qzion.dir/__/common/moc_qziongroup.cxx.o
cd /build/buildd/qzion-0.4.0/obj-i486-linux-gnu/src/qpainter && /usr/bin/g++ -Dqzion_EXPORTS -DQT_DLL -DQT_WEBKIT_LIB -DQT_GUI_LIB -DQT_CORE_LIB -DQT_NO_DEBUG -g -O2 -g -Wall -O2 -Wall -O2 -g -DQT_NO_DEBUG_OUTPUT -fPIC -I/build/buildd/qzion-0.4.0/obj-i486-linux-gnu/src/qpainter -I/build/buildd/qzion-0.4.0/src/qpainter -I/usr/include/qt4 -I/usr/include/qt4/QtWebKit -I/usr/include/qt4/QtGui -I/usr/include/qt4/QtCore -I/build/buildd/qzion-0.4.0/src/qpainter/../common -o CMakeFiles/qzion.dir/__/common/moc_qziongroup.cxx.o -c /build/buildd/qzion-0.4.0/obj-i486-linux-gnu/src/qpainter/__/common/moc_qziongroup.cxx
/usr/bin/cmake -E cmake_progress_report /build/buildd/qzion-0.4.0/obj-i486-linux-gnu/CMakeFiles 18
[ 50%] Building CXX object src/qpainter/CMakeFiles/qzion.dir/__/common/moc_qzionclippedgroup.cxx.o
cd /build/buildd/qzion-0.4.0/obj-i486-linux-gnu/src/qpainter && /usr/bin/g++ -Dqzion_EXPORTS -DQT_DLL -DQT_WEBKIT_LIB -DQT_GUI_LIB -DQT_CORE_LIB -DQT_NO_DEBUG -g -O2 -g -Wall -O2 -Wall -O2 -g -DQT_NO_DEBUG_OUTPUT -fPIC -I/build/buildd/qzion-0.4.0/obj-i486-linux-gnu/src/qpainter -I/build/buildd/qzion-0.4.0/src/qpainter -I/usr/include/qt4 -I/usr/include/qt4/QtWebKit -I/usr/include/qt4/QtGui -I/usr/include/qt4/QtCore -I/build/buildd/qzion-0.4.0/src/qpainter/../common -o CMakeFiles/qzion.dir/__/common/moc_qzionclippedgroup.cxx.o -c /build/buildd/qzion-0.4.0/obj-i486-linux-gnu/src/qpainter/__/common/moc_qzionclippedgroup.cxx
/usr/bin/cmake -E cmake_progress_report /build/buildd/qzion-0.4.0/obj-i486-linux-gnu/CMakeFiles 19
[ 52%] Building CXX object src/qpainter/CMakeFiles/qzion.dir/__/common/moc_qzionimage.cxx.o
cd /build/buildd/qzion-0.4.0/obj-i486-linux-gnu/src/qpainter && /usr/bin/g++ -Dqzion_EXPORTS -DQT_DLL -DQT_WEBKIT_LIB -DQT_GUI_LIB -DQT_CORE_LIB -DQT_NO_DEBUG -g -O2 -g -Wall -O2 -Wall -O2 -g -DQT_NO_DEBUG_OUTPUT -fPIC -I/build/buildd/qzion-0.4.0/obj-i486-linux-gnu/src/qpainter -I/build/buildd/qzion-0.4.0/src/qpainter -I/usr/include/qt4 -I/usr/include/qt4/QtWebKit -I/usr/include/qt4/QtGui -I/usr/include/qt4/QtCore -I/build/buildd/qzion-0.4.0/src/qpainter/../common -o CMakeFiles/qzion.dir/__/common/moc_qzionimage.cxx.o -c /build/buildd/qzion-0.4.0/obj-i486-linux-gnu/src/qpainter/__/common/moc_qzionimage.cxx
/usr/bin/cmake -E cmake_progress_report /build/buildd/qzion-0.4.0/obj-i486-linux-gnu/CMakeFiles 20
[ 54%] Building CXX object src/qpainter/CMakeFiles/qzion.dir/__/common/moc_qzioncanvas.cxx.o
cd /build/buildd/qzion-0.4.0/obj-i486-linux-gnu/src/qpainter && /usr/bin/g++ -Dqzion_EXPORTS -DQT_DLL -DQT_WEBKIT_LIB -DQT_GUI_LIB -DQT_CORE_LIB -DQT_NO_DEBUG -g -O2 -g -Wall -O2 -Wall -O2 -g -DQT_NO_DEBUG_OUTPUT -fPIC -I/build/buildd/qzion-0.4.0/obj-i486-linux-gnu/src/qpainter -I/build/buildd/qzion-0.4.0/src/qpainter -I/usr/include/qt4 -I/usr/include/qt4/QtWebKit -I/usr/include/qt4/QtGui -I/usr/include/qt4/QtCore -I/build/buildd/qzion-0.4.0/src/qpainter/../common -o CMakeFiles/qzion.dir/__/common/moc_qzioncanvas.cxx.o -c /build/buildd/qzion-0.4.0/obj-i486-linux-gnu/src/qpainter/__/common/moc_qzioncanvas.cxx
/usr/bin/cmake -E cmake_progress_report /build/buildd/qzion-0.4.0/obj-i486-linux-gnu/CMakeFiles 21
[ 55%] Building CXX object src/qpainter/CMakeFiles/qzion.dir/__/common/moc_qzionobject.cxx.o
cd /build/buildd/qzion-0.4.0/obj-i486-linux-gnu/src/qpainter && /usr/bin/g++ -Dqzion_EXPORTS -DQT_DLL -DQT_WEBKIT_LIB -DQT_GUI_LIB -DQT_CORE_LIB -DQT_NO_DEBUG -g -O2 -g -Wall -O2 -Wall -O2 -g -DQT_NO_DEBUG_OUTPUT -fPIC -I/build/buildd/qzion-0.4.0/obj-i486-linux-gnu/src/qpainter -I/build/buildd/qzion-0.4.0/src/qpainter -I/usr/include/qt4 -I/usr/include/qt4/QtWebKit -I/usr/include/qt4/QtGui -I/usr/include/qt4/QtCore -I/build/buildd/qzion-0.4.0/src/qpainter/../common -o CMakeFiles/qzion.dir/__/common/moc_qzionobject.cxx.o -c /build/buildd/qzion-0.4.0/obj-i486-linux-gnu/src/qpainter/__/common/moc_qzionobject.cxx
/usr/bin/cmake -E cmake_progress_report /build/buildd/qzion-0.4.0/obj-i486-linux-gnu/CMakeFiles 22
[ 57%] Building CXX object src/qpainter/CMakeFiles/qzion.dir/__/common/moc_qzionabstractcanvas.cxx.o
cd /build/buildd/qzion-0.4.0/obj-i486-linux-gnu/src/qpainter && /usr/bin/g++ -Dqzion_EXPORTS -DQT_DLL -DQT_WEBKIT_LIB -DQT_GUI_LIB -DQT_CORE_LIB -DQT_NO_DEBUG -g -O2 -g -Wall -O2 -Wall -O2 -g -DQT_NO_DEBUG_OUTPUT -fPIC -I/build/buildd/qzion-0.4.0/obj-i486-linux-gnu/src/qpainter -I/build/buildd/qzion-0.4.0/src/qpainter -I/usr/include/qt4 -I/usr/include/qt4/QtWebKit -I/usr/include/qt4/QtGui -I/usr/include/qt4/QtCore -I/build/buildd/qzion-0.4.0/src/qpainter/../common -o CMakeFiles/qzion.dir/__/common/moc_qzionabstractcanvas.cxx.o -c /build/buildd/qzion-0.4.0/obj-i486-linux-gnu/src/qpainter/__/common/moc_qzionabstractcanvas.cxx
/usr/bin/cmake -E cmake_progress_report /build/buildd/qzion-0.4.0/obj-i486-linux-gnu/CMakeFiles 23
[ 59%] Building CXX object src/qpainter/CMakeFiles/qzion.dir/__/common/moc_qzioncustomobject.cxx.o
cd /build/buildd/qzion-0.4.0/obj-i486-linux-gnu/src/qpainter && /usr/bin/g++ -Dqzion_EXPORTS -DQT_DLL -DQT_WEBKIT_LIB -DQT_GUI_LIB -DQT_CORE_LIB -DQT_NO_DEBUG -g -O2 -g -Wall -O2 -Wall -O2 -g -DQT_NO_DEBUG_OUTPUT -fPIC -I/build/buildd/qzion-0.4.0/obj-i486-linux-gnu/src/qpainter -I/build/buildd/qzion-0.4.0/src/qpainter -I/usr/include/qt4 -I/usr/include/qt4/QtWebKit -I/usr/include/qt4/QtGui -I/usr/include/qt4/QtCore -I/build/buildd/qzion-0.4.0/src/qpainter/../common -o CMakeFiles/qzion.dir/__/common/moc_qzioncustomobject.cxx.o -c /build/buildd/qzion-0.4.0/obj-i486-linux-gnu/src/qpainter/__/common/moc_qzioncustomobject.cxx
Linking CXX shared library libqzion.so
cd /build/buildd/qzion-0.4.0/obj-i486-linux-gnu/src/qpainter && /usr/bin/cmake -E cmake_link_script CMakeFiles/qzion.dir/link.txt --verbose=1
/usr/bin/g++ -fPIC -g -O2 -g -Wall -O2 -Wall -O2 -g -DQT_NO_DEBUG_OUTPUT -Wl,-Bsymbolic-functions -shared -Wl,-soname,libqzion.so.0 -o libqzion.so.0.4.0 CMakeFiles/qzion.dir/qzioncanvas.cpp.o CMakeFiles/qzion.dir/qzionabstractcanvas.cpp.o CMakeFiles/qzion.dir/qziongroup.cpp.o CMakeFiles/qzion.dir/qzionimage.cpp.o CMakeFiles/qzion.dir/qzionobject.cpp.o CMakeFiles/qzion.dir/qzionrectangle.cpp.o CMakeFiles/qzion.dir/qziontext.cpp.o CMakeFiles/qzion.dir/qziontextblock.cpp.o CMakeFiles/qzion.dir/qzionclippedgroup.cpp.o CMakeFiles/qzion.dir/qzioncustomobject.cpp.o CMakeFiles/qzion.dir/moc_qziontextblock_p.cxx.o CMakeFiles/qzion.dir/__/common/moc_qzion.cxx.o CMakeFiles/qzion.dir/__/common/moc_qzionmacros.cxx.o CMakeFiles/qzion.dir/__/common/moc_qziontext.cxx.o CMakeFiles/qzion.dir/__/common/moc_qziontextblock.cxx.o CMakeFiles/qzion.dir/__/common/moc_qzionrectangle.cxx.o CMakeFiles/qzion.dir/__/common/moc_qziongroup.cxx.o CMakeFiles/qzion.dir/__/common/moc_qzionclippedgroup.cxx.o CM
akeFiles/qzion.dir/__/common/moc_qzionimage.cxx.o CMakeFiles/qzion.dir/__/common/moc_qzioncanvas.cxx.o CMakeFiles/qzion.dir/__/common/moc_qzionobject.cxx.o CMakeFiles/qzion.dir/__/common/moc_qzionabstractcanvas.cxx.o CMakeFiles/qzion.dir/__/common/moc_qzioncustomobject.cxx.o -lQtWebKit -lQtGui -lXext -lX11 -lm -lQtCore -lpthread -ldl
cd /build/buildd/qzion-0.4.0/obj-i486-linux-gnu/src/qpainter && /usr/bin/cmake -E cmake_symlink_library libqzion.so.0.4.0 libqzion.so.0 libqzion.so
make[3]: Leaving directory `/build/buildd/qzion-0.4.0/obj-i486-linux-gnu'
/usr/bin/cmake -E cmake_progress_report /build/buildd/qzion-0.4.0/obj-i486-linux-gnu/CMakeFiles 1 2 3 4 5 6 7 8 9 10 11 12 13 14 15 16 17 18 19 20 21 22 23 24 25 26 27 28 29 30 31 32 33 34 35 36
[ 59%] Built target qzion
/usr/bin/make -f tests/clipper/CMakeFiles/clipper.dir/build.make tests/clipper/CMakeFiles/clipper.dir/depend
make[3]: Entering directory `/build/buildd/qzion-0.4.0/obj-i486-linux-gnu'
cd /build/buildd/qzion-0.4.0/obj-i486-linux-gnu && /usr/bin/cmake -E cmake_depends "Unix Makefiles" /build/buildd/qzion-0.4.0 /build/buildd/qzion-0.4.0/tests/clipper /build/buildd/qzion-0.4.0/obj-i486-linux-gnu /build/buildd/qzion-0.4.0/obj-i486-linux-gnu/tests/clipper /build/buildd/qzion-0.4.0/obj-i486-linux-gnu/tests/clipper/CMakeFiles/clipper.dir/DependInfo.cmake --color=
Scanning dependencies of target clipper
make[3]: Leaving directory `/build/buildd/qzion-0.4.0/obj-i486-linux-gnu'
/usr/bin/make -f tests/clipper/CMakeFiles/clipper.dir/build.make tests/clipper/CMakeFiles/clipper.dir/build
make[3]: Entering directory `/build/buildd/qzion-0.4.0/obj-i486-linux-gnu'
/usr/bin/cmake -E cmake_progress_report /build/buildd/qzion-0.4.0/obj-i486-linux-gnu/CMakeFiles 37
[ 60%] Building CXX object tests/clipper/CMakeFiles/clipper.dir/main.cpp.o
cd /build/buildd/qzion-0.4.0/obj-i486-linux-gnu/tests/clipper && /usr/bin/g++ -DQT_DLL -DQT_WEBKIT_LIB -DQT_GUI_LIB -DQT_CORE_LIB -DQT_NO_DEBUG -g -O2 -g -Wall -O2 -Wall -O2 -g -DQT_NO_DEBUG_OUTPUT -I/usr/include/qt4 -I/usr/include/qt4/QtWebKit -I/usr/include/qt4/QtGui -I/usr/include/qt4/QtCore -I/build/buildd/qzion-0.4.0/tests/../src/common -o CMakeFiles/clipper.dir/main.cpp.o -c /build/buildd/qzion-0.4.0/tests/clipper/main.cpp
Linking CXX executable clipper
cd /build/buildd/qzion-0.4.0/obj-i486-linux-gnu/tests/clipper && /usr/bin/cmake -E cmake_link_script CMakeFiles/clipper.dir/link.txt --verbose=1
/usr/bin/g++ -g -O2 -g -Wall -O2 -Wall -O2 -g -DQT_NO_DEBUG_OUTPUT -Wl,-Bsymbolic-functions CMakeFiles/clipper.dir/main.cpp.o -o clipper -rdynamic ../../src/qpainter/libqzion.so.0.4.0 -lQtWebKit -lQtGui -lXext -lX11 -lm -lQtCore -lpthread -ldl
make[3]: Leaving directory `/build/buildd/qzion-0.4.0/obj-i486-linux-gnu'
/usr/bin/cmake -E cmake_progress_report /build/buildd/qzion-0.4.0/obj-i486-linux-gnu/CMakeFiles 37
[ 60%] Built target clipper
/usr/bin/make -f tests/expedite/CMakeFiles/expedite.dir/build.make tests/expedite/CMakeFiles/expedite.dir/depend
make[3]: Entering directory `/build/buildd/qzion-0.4.0/obj-i486-linux-gnu'
/usr/bin/cmake -E cmake_progress_report /build/buildd/qzion-0.4.0/obj-i486-linux-gnu/CMakeFiles 40
[ 62%] Generating moc_scene.cxx
cd /build/buildd/qzion-0.4.0/obj-i486-linux-gnu/tests/expedite && /usr/bin/moc-qt4 -I/usr/include/qt4 -I/usr/include/qt4/QtWebKit -I/usr/include/qt4/QtGui -I/usr/include/qt4/QtCore -I/build/buildd/qzion-0.4.0/tests/../src/common -DQT_DLL -DQT_WEBKIT_LIB -DQT_GUI_LIB -DQT_CORE_LIB -o /build/buildd/qzion-0.4.0/obj-i486-linux-gnu/tests/expedite/moc_scene.cxx /build/buildd/qzion-0.4.0/tests/expedite/scene.h
cd /build/buildd/qzion-0.4.0/obj-i486-linux-gnu && /usr/bin/cmake -E cmake_depends "Unix Makefiles" /build/buildd/qzion-0.4.0 /build/buildd/qzion-0.4.0/tests/expedite /build/buildd/qzion-0.4.0/obj-i486-linux-gnu /build/buildd/qzion-0.4.0/obj-i486-linux-gnu/tests/expedite /build/buildd/qzion-0.4.0/obj-i486-linux-gnu/tests/expedite/CMakeFiles/expedite.dir/DependInfo.cmake --color=
Scanning dependencies of target expedite
make[3]: Leaving directory `/build/buildd/qzion-0.4.0/obj-i486-linux-gnu'
/usr/bin/make -f tests/expedite/CMakeFiles/expedite.dir/build.make tests/expedite/CMakeFiles/expedite.dir/build
make[3]: Entering directory `/build/buildd/qzion-0.4.0/obj-i486-linux-gnu'
/usr/bin/cmake -E cmake_progress_report /build/buildd/qzion-0.4.0/obj-i486-linux-gnu/CMakeFiles 38
[ 63%] Building CXX object tests/expedite/CMakeFiles/expedite.dir/main.cpp.o
cd /build/buildd/qzion-0.4.0/obj-i486-linux-gnu/tests/expedite && /usr/bin/g++ -DQT_DLL -DQT_WEBKIT_LIB -DQT_GUI_LIB -DQT_CORE_LIB -DQT_NO_DEBUG -g -O2 -g -Wall -O2 -Wall -O2 -g -DQT_NO_DEBUG_OUTPUT -I/usr/include/qt4 -I/usr/include/qt4/QtWebKit -I/usr/include/qt4/QtGui -I/usr/include/qt4/QtCore -I/build/buildd/qzion-0.4.0/tests/../src/common -o CMakeFiles/expedite.dir/main.cpp.o -c /build/buildd/qzion-0.4.0/tests/expedite/main.cpp
/build/buildd/qzion-0.4.0/tests/expedite/main.cpp: In member function 'void Scene::tick_all()':
/build/buildd/qzion-0.4.0/tests/expedite/main.cpp:29: warning: unused variable 'i'
/usr/bin/cmake -E cmake_progress_report /build/buildd/qzion-0.4.0/obj-i486-linux-gnu/CMakeFiles 39
[ 65%] Building CXX object tests/expedite/CMakeFiles/expedite.dir/moc_scene.cxx.o
cd /build/buildd/qzion-0.4.0/obj-i486-linux-gnu/tests/expedite && /usr/bin/g++ -DQT_DLL -DQT_WEBKIT_LIB -DQT_GUI_LIB -DQT_CORE_LIB -DQT_NO_DEBUG -g -O2 -g -Wall -O2 -Wall -O2 -g -DQT_NO_DEBUG_OUTPUT -I/usr/include/qt4 -I/usr/include/qt4/QtWebKit -I/usr/include/qt4/QtGui -I/usr/include/qt4/QtCore -I/build/buildd/qzion-0.4.0/tests/../src/common -o CMakeFiles/expedite.dir/moc_scene.cxx.o -c /build/buildd/qzion-0.4.0/obj-i486-linux-gnu/tests/expedite/moc_scene.cxx
Linking CXX executable expedite
cd /build/buildd/qzion-0.4.0/obj-i486-linux-gnu/tests/expedite && /usr/bin/cmake -E cmake_link_script CMakeFiles/expedite.dir/link.txt --verbose=1
/usr/bin/g++ -g -O2 -g -Wall -O2 -Wall -O2 -g -DQT_NO_DEBUG_OUTPUT -Wl,-Bsymbolic-functions CMakeFiles/expedite.dir/main.cpp.o CMakeFiles/expedite.dir/moc_scene.cxx.o -o expedite -rdynamic ../../src/qpainter/libqzion.so.0.4.0 -lQtWebKit -lQtGui -lXext -lX11 -lm -lQtCore -lpthread -ldl
make[3]: Leaving directory `/build/buildd/qzion-0.4.0/obj-i486-linux-gnu'
/usr/bin/cmake -E cmake_progress_report /build/buildd/qzion-0.4.0/obj-i486-linux-gnu/CMakeFiles 38 39 40
[ 65%] Built target expedite
/usr/bin/make -f tests/simple/CMakeFiles/simple.dir/build.make tests/simple/CMakeFiles/simple.dir/depend
make[3]: Entering directory `/build/buildd/qzion-0.4.0/obj-i486-linux-gnu'
/usr/bin/cmake -E cmake_progress_report /build/buildd/qzion-0.4.0/obj-i486-linux-gnu/CMakeFiles 43
[ 67%] Generating moc_scene.cxx
cd /build/buildd/qzion-0.4.0/obj-i486-linux-gnu/tests/simple && /usr/bin/moc-qt4 -I/usr/include/qt4 -I/usr/include/qt4/QtWebKit -I/usr/include/qt4/QtGui -I/usr/include/qt4/QtCore -I/build/buildd/qzion-0.4.0/tests/../src/common -DQT_DLL -DQT_WEBKIT_LIB -DQT_GUI_LIB -DQT_CORE_LIB -o /build/buildd/qzion-0.4.0/obj-i486-linux-gnu/tests/simple/moc_scene.cxx /build/buildd/qzion-0.4.0/tests/simple/scene.h
cd /build/buildd/qzion-0.4.0/obj-i486-linux-gnu && /usr/bin/cmake -E cmake_depends "Unix Makefiles" /build/buildd/qzion-0.4.0 /build/buildd/qzion-0.4.0/tests/simple /build/buildd/qzion-0.4.0/obj-i486-linux-gnu /build/buildd/qzion-0.4.0/obj-i486-linux-gnu/tests/simple /build/buildd/qzion-0.4.0/obj-i486-linux-gnu/tests/simple/CMakeFiles/simple.dir/DependInfo.cmake --color=
Scanning dependencies of target simple
make[3]: Leaving directory `/build/buildd/qzion-0.4.0/obj-i486-linux-gnu'
/usr/bin/make -f tests/simple/CMakeFiles/simple.dir/build.make tests/simple/CMakeFiles/simple.dir/build
make[3]: Entering directory `/build/buildd/qzion-0.4.0/obj-i486-linux-gnu'
/usr/bin/cmake -E cmake_progress_report /build/buildd/qzion-0.4.0/obj-i486-linux-gnu/CMakeFiles 41
[ 68%] Building CXX object tests/simple/CMakeFiles/simple.dir/main.cpp.o
cd /build/buildd/qzion-0.4.0/obj-i486-linux-gnu/tests/simple && /usr/bin/g++ -DQT_DLL -DQT_WEBKIT_LIB -DQT_GUI_LIB -DQT_CORE_LIB -DQT_NO_DEBUG -g -O2 -g -Wall -O2 -Wall -O2 -g -DQT_NO_DEBUG_OUTPUT -I/usr/include/qt4 -I/usr/include/qt4/QtWebKit -I/usr/include/qt4/QtGui -I/usr/include/qt4/QtCore -I/build/buildd/qzion-0.4.0/tests/../src/common -o CMakeFiles/simple.dir/main.cpp.o -c /build/buildd/qzion-0.4.0/tests/simple/main.cpp
/usr/bin/cmake -E cmake_progress_report /build/buildd/qzion-0.4.0/obj-i486-linux-gnu/CMakeFiles 42
[ 70%] Building CXX object tests/simple/CMakeFiles/simple.dir/moc_scene.cxx.o
cd /build/buildd/qzion-0.4.0/obj-i486-linux-gnu/tests/simple && /usr/bin/g++ -DQT_DLL -DQT_WEBKIT_LIB -DQT_GUI_LIB -DQT_CORE_LIB -DQT_NO_DEBUG -g -O2 -g -Wall -O2 -Wall -O2 -g -DQT_NO_DEBUG_OUTPUT -I/usr/include/qt4 -I/usr/include/qt4/QtWebKit -I/usr/include/qt4/QtGui -I/usr/include/qt4/QtCore -I/build/buildd/qzion-0.4.0/tests/../src/common -o CMakeFiles/simple.dir/moc_scene.cxx.o -c /build/buildd/qzion-0.4.0/obj-i486-linux-gnu/tests/simple/moc_scene.cxx
Linking CXX executable simple
cd /build/buildd/qzion-0.4.0/obj-i486-linux-gnu/tests/simple && /usr/bin/cmake -E cmake_link_script CMakeFiles/simple.dir/link.txt --verbose=1
/usr/bin/g++ -g -O2 -g -Wall -O2 -Wall -O2 -g -DQT_NO_DEBUG_OUTPUT -Wl,-Bsymbolic-functions CMakeFiles/simple.dir/main.cpp.o CMakeFiles/simple.dir/moc_scene.cxx.o -o simple -rdynamic ../../src/qpainter/libqzion.so.0.4.0 -lQtWebKit -lQtGui -lXext -lX11 -lm -lQtCore -lpthread -ldl
make[3]: Leaving directory `/build/buildd/qzion-0.4.0/obj-i486-linux-gnu'
/usr/bin/cmake -E cmake_progress_report /build/buildd/qzion-0.4.0/obj-i486-linux-gnu/CMakeFiles 41 42 43
[ 70%] Built target simple
/usr/bin/make -f tests/zvalue/CMakeFiles/zvalue.dir/build.make tests/zvalue/CMakeFiles/zvalue.dir/depend
make[3]: Entering directory `/build/buildd/qzion-0.4.0/obj-i486-linux-gnu'
/usr/bin/cmake -E cmake_progress_report /build/buildd/qzion-0.4.0/obj-i486-linux-gnu/CMakeFiles 46
[ 72%] Generating moc_main.cxx
cd /build/buildd/qzion-0.4.0/obj-i486-linux-gnu/tests/zvalue && /usr/bin/moc-qt4 -I/usr/include/qt4 -I/usr/include/qt4/QtWebKit -I/usr/include/qt4/QtGui -I/usr/include/qt4/QtCore -I/build/buildd/qzion-0.4.0/tests/../src/common -DQT_DLL -DQT_WEBKIT_LIB -DQT_GUI_LIB -DQT_CORE_LIB -o /build/buildd/qzion-0.4.0/obj-i486-linux-gnu/tests/zvalue/moc_main.cxx /build/buildd/qzion-0.4.0/tests/zvalue/main.h
cd /build/buildd/qzion-0.4.0/obj-i486-linux-gnu && /usr/bin/cmake -E cmake_depends "Unix Makefiles" /build/buildd/qzion-0.4.0 /build/buildd/qzion-0.4.0/tests/zvalue /build/buildd/qzion-0.4.0/obj-i486-linux-gnu /build/buildd/qzion-0.4.0/obj-i486-linux-gnu/tests/zvalue /build/buildd/qzion-0.4.0/obj-i486-linux-gnu/tests/zvalue/CMakeFiles/zvalue.dir/DependInfo.cmake --color=
Scanning dependencies of target zvalue
make[3]: Leaving directory `/build/buildd/qzion-0.4.0/obj-i486-linux-gnu'
/usr/bin/make -f tests/zvalue/CMakeFiles/zvalue.dir/build.make tests/zvalue/CMakeFiles/zvalue.dir/build
make[3]: Entering directory `/build/buildd/qzion-0.4.0/obj-i486-linux-gnu'
/usr/bin/cmake -E cmake_progress_report /build/buildd/qzion-0.4.0/obj-i486-linux-gnu/CMakeFiles 44
[ 73%] Building CXX object tests/zvalue/CMakeFiles/zvalue.dir/main.cpp.o
cd /build/buildd/qzion-0.4.0/obj-i486-linux-gnu/tests/zvalue && /usr/bin/g++ -DQT_DLL -DQT_WEBKIT_LIB -DQT_GUI_LIB -DQT_CORE_LIB -DQT_NO_DEBUG -g -O2 -g -Wall -O2 -Wall -O2 -g -DQT_NO_DEBUG_OUTPUT -I/usr/include/qt4 -I/usr/include/qt4/QtWebKit -I/usr/include/qt4/QtGui -I/usr/include/qt4/QtCore -I/build/buildd/qzion-0.4.0/tests/../src/common -o CMakeFiles/zvalue.dir/main.cpp.o -c /build/buildd/qzion-0.4.0/tests/zvalue/main.cpp
/usr/bin/cmake -E cmake_progress_report /build/buildd/qzion-0.4.0/obj-i486-linux-gnu/CMakeFiles 45
[ 75%] Building CXX object tests/zvalue/CMakeFiles/zvalue.dir/moc_main.cxx.o
cd /build/buildd/qzion-0.4.0/obj-i486-linux-gnu/tests/zvalue && /usr/bin/g++ -DQT_DLL -DQT_WEBKIT_LIB -DQT_GUI_LIB -DQT_CORE_LIB -DQT_NO_DEBUG -g -O2 -g -Wall -O2 -Wall -O2 -g -DQT_NO_DEBUG_OUTPUT -I/usr/include/qt4 -I/usr/include/qt4/QtWebKit -I/usr/include/qt4/QtGui -I/usr/include/qt4/QtCore -I/build/buildd/qzion-0.4.0/tests/../src/common -o CMakeFiles/zvalue.dir/moc_main.cxx.o -c /build/buildd/qzion-0.4.0/obj-i486-linux-gnu/tests/zvalue/moc_main.cxx
Linking CXX executable zvalue
cd /build/buildd/qzion-0.4.0/obj-i486-linux-gnu/tests/zvalue && /usr/bin/cmake -E cmake_link_script CMakeFiles/zvalue.dir/link.txt --verbose=1
/usr/bin/g++ -g -O2 -g -Wall -O2 -Wall -O2 -g -DQT_NO_DEBUG_OUTPUT -Wl,-Bsymbolic-functions CMakeFiles/zvalue.dir/main.cpp.o CMakeFiles/zvalue.dir/moc_main.cxx.o -o zvalue -rdynamic ../../src/qpainter/libqzion.so.0.4.0 -lQtWebKit -lQtGui -lXext -lX11 -lm -lQtCore -lpthread -ldl
make[3]: Leaving directory `/build/buildd/qzion-0.4.0/obj-i486-linux-gnu'
/usr/bin/cmake -E cmake_progress_report /build/buildd/qzion-0.4.0/obj-i486-linux-gnu/CMakeFiles 44 45 46
[ 75%] Built target zvalue
/usr/bin/make -f tests/text/CMakeFiles/text.dir/build.make tests/text/CMakeFiles/text.dir/depend
make[3]: Entering directory `/build/buildd/qzion-0.4.0/obj-i486-linux-gnu'
/usr/bin/cmake -E cmake_progress_report /build/buildd/qzion-0.4.0/obj-i486-linux-gnu/CMakeFiles 49
[ 77%] Generating moc_scene.cxx
cd /build/buildd/qzion-0.4.0/obj-i486-linux-gnu/tests/text && /usr/bin/moc-qt4 -I/usr/include/qt4 -I/usr/include/qt4/QtWebKit -I/usr/include/qt4/QtGui -I/usr/include/qt4/QtCore -I/build/buildd/qzion-0.4.0/tests/../src/common -DQT_DLL -DQT_WEBKIT_LIB -DQT_GUI_LIB -DQT_CORE_LIB -o /build/buildd/qzion-0.4.0/obj-i486-linux-gnu/tests/text/moc_scene.cxx /build/buildd/qzion-0.4.0/tests/text/scene.h
cd /build/buildd/qzion-0.4.0/obj-i486-linux-gnu && /usr/bin/cmake -E cmake_depends "Unix Makefiles" /build/buildd/qzion-0.4.0 /build/buildd/qzion-0.4.0/tests/text /build/buildd/qzion-0.4.0/obj-i486-linux-gnu /build/buildd/qzion-0.4.0/obj-i486-linux-gnu/tests/text /build/buildd/qzion-0.4.0/obj-i486-linux-gnu/tests/text/CMakeFiles/text.dir/DependInfo.cmake --color=
Scanning dependencies of target text
make[3]: Leaving directory `/build/buildd/qzion-0.4.0/obj-i486-linux-gnu'
/usr/bin/make -f tests/text/CMakeFiles/text.dir/build.make tests/text/CMakeFiles/text.dir/build
make[3]: Entering directory `/build/buildd/qzion-0.4.0/obj-i486-linux-gnu'
/usr/bin/cmake -E cmake_progress_report /build/buildd/qzion-0.4.0/obj-i486-linux-gnu/CMakeFiles 47
[ 78%] Building CXX object tests/text/CMakeFiles/text.dir/main.cpp.o
cd /build/buildd/qzion-0.4.0/obj-i486-linux-gnu/tests/text && /usr/bin/g++ -DQT_DLL -DQT_WEBKIT_LIB -DQT_GUI_LIB -DQT_CORE_LIB -DQT_NO_DEBUG -g -O2 -g -Wall -O2 -Wall -O2 -g -DQT_NO_DEBUG_OUTPUT -I/usr/include/qt4 -I/usr/include/qt4/QtWebKit -I/usr/include/qt4/QtGui -I/usr/include/qt4/QtCore -I/build/buildd/qzion-0.4.0/tests/../src/common -o CMakeFiles/text.dir/main.cpp.o -c /build/buildd/qzion-0.4.0/tests/text/main.cpp
/usr/bin/cmake -E cmake_progress_report /build/buildd/qzion-0.4.0/obj-i486-linux-gnu/CMakeFiles 48
[ 80%] Building CXX object tests/text/CMakeFiles/text.dir/moc_scene.cxx.o
cd /build/buildd/qzion-0.4.0/obj-i486-linux-gnu/tests/text && /usr/bin/g++ -DQT_DLL -DQT_WEBKIT_LIB -DQT_GUI_LIB -DQT_CORE_LIB -DQT_NO_DEBUG -g -O2 -g -Wall -O2 -Wall -O2 -g -DQT_NO_DEBUG_OUTPUT -I/usr/include/qt4 -I/usr/include/qt4/QtWebKit -I/usr/include/qt4/QtGui -I/usr/include/qt4/QtCore -I/build/buildd/qzion-0.4.0/tests/../src/common -o CMakeFiles/text.dir/moc_scene.cxx.o -c /build/buildd/qzion-0.4.0/obj-i486-linux-gnu/tests/text/moc_scene.cxx
Linking CXX executable text
cd /build/buildd/qzion-0.4.0/obj-i486-linux-gnu/tests/text && /usr/bin/cmake -E cmake_link_script CMakeFiles/text.dir/link.txt --verbose=1
/usr/bin/g++ -g -O2 -g -Wall -O2 -Wall -O2 -g -DQT_NO_DEBUG_OUTPUT -Wl,-Bsymbolic-functions CMakeFiles/text.dir/main.cpp.o CMakeFiles/text.dir/moc_scene.cxx.o -o text -rdynamic ../../src/qpainter/libqzion.so.0.4.0 -lQtWebKit -lQtGui -lXext -lX11 -lm -lQtCore -lpthread -ldl
make[3]: Leaving directory `/build/buildd/qzion-0.4.0/obj-i486-linux-gnu'
/usr/bin/cmake -E cmake_progress_report /build/buildd/qzion-0.4.0/obj-i486-linux-gnu/CMakeFiles 47 48 49
[ 80%] Built target text
/usr/bin/make -f tests/resize/CMakeFiles/resize.dir/build.make tests/resize/CMakeFiles/resize.dir/depend
make[3]: Entering directory `/build/buildd/qzion-0.4.0/obj-i486-linux-gnu'
/usr/bin/cmake -E cmake_progress_report /build/buildd/qzion-0.4.0/obj-i486-linux-gnu/CMakeFiles 52
[ 81%] Generating moc_main.cxx
cd /build/buildd/qzion-0.4.0/obj-i486-linux-gnu/tests/resize && /usr/bin/moc-qt4 -I/usr/include/qt4 -I/usr/include/qt4/QtWebKit -I/usr/include/qt4/QtGui -I/usr/include/qt4/QtCore -I/build/buildd/qzion-0.4.0/tests/../src/common -DQT_DLL -DQT_WEBKIT_LIB -DQT_GUI_LIB -DQT_CORE_LIB -o /build/buildd/qzion-0.4.0/obj-i486-linux-gnu/tests/resize/moc_main.cxx /build/buildd/qzion-0.4.0/tests/resize/main.h
cd /build/buildd/qzion-0.4.0/obj-i486-linux-gnu && /usr/bin/cmake -E cmake_depends "Unix Makefiles" /build/buildd/qzion-0.4.0 /build/buildd/qzion-0.4.0/tests/resize /build/buildd/qzion-0.4.0/obj-i486-linux-gnu /build/buildd/qzion-0.4.0/obj-i486-linux-gnu/tests/resize /build/buildd/qzion-0.4.0/obj-i486-linux-gnu/tests/resize/CMakeFiles/resize.dir/DependInfo.cmake --color=
Scanning dependencies of target resize
make[3]: Leaving directory `/build/buildd/qzion-0.4.0/obj-i486-linux-gnu'
/usr/bin/make -f tests/resize/CMakeFiles/resize.dir/build.make tests/resize/CMakeFiles/resize.dir/build
make[3]: Entering directory `/build/buildd/qzion-0.4.0/obj-i486-linux-gnu'
/usr/bin/cmake -E cmake_progress_report /build/buildd/qzion-0.4.0/obj-i486-linux-gnu/CMakeFiles 50
[ 83%] Building CXX object tests/resize/CMakeFiles/resize.dir/main.cpp.o
cd /build/buildd/qzion-0.4.0/obj-i486-linux-gnu/tests/resize && /usr/bin/g++ -DQT_DLL -DQT_WEBKIT_LIB -DQT_GUI_LIB -DQT_CORE_LIB -DQT_NO_DEBUG -g -O2 -g -Wall -O2 -Wall -O2 -g -DQT_NO_DEBUG_OUTPUT -I/usr/include/qt4 -I/usr/include/qt4/QtWebKit -I/usr/include/qt4/QtGui -I/usr/include/qt4/QtCore -I/build/buildd/qzion-0.4.0/tests/../src/common -o CMakeFiles/resize.dir/main.cpp.o -c /build/buildd/qzion-0.4.0/tests/resize/main.cpp
/usr/bin/cmake -E cmake_progress_report /build/buildd/qzion-0.4.0/obj-i486-linux-gnu/CMakeFiles 51
[ 85%] Building CXX object tests/resize/CMakeFiles/resize.dir/moc_main.cxx.o
cd /build/buildd/qzion-0.4.0/obj-i486-linux-gnu/tests/resize && /usr/bin/g++ -DQT_DLL -DQT_WEBKIT_LIB -DQT_GUI_LIB -DQT_CORE_LIB -DQT_NO_DEBUG -g -O2 -g -Wall -O2 -Wall -O2 -g -DQT_NO_DEBUG_OUTPUT -I/usr/include/qt4 -I/usr/include/qt4/QtWebKit -I/usr/include/qt4/QtGui -I/usr/include/qt4/QtCore -I/build/buildd/qzion-0.4.0/tests/../src/common -o CMakeFiles/resize.dir/moc_main.cxx.o -c /build/buildd/qzion-0.4.0/obj-i486-linux-gnu/tests/resize/moc_main.cxx
Linking CXX executable resize
cd /build/buildd/qzion-0.4.0/obj-i486-linux-gnu/tests/resize && /usr/bin/cmake -E cmake_link_script CMakeFiles/resize.dir/link.txt --verbose=1
/usr/bin/g++ -g -O2 -g -Wall -O2 -Wall -O2 -g -DQT_NO_DEBUG_OUTPUT -Wl,-Bsymbolic-functions CMakeFiles/resize.dir/main.cpp.o CMakeFiles/resize.dir/moc_main.cxx.o -o resize -rdynamic ../../src/qpainter/libqzion.so.0.4.0 -lQtWebKit -lQtGui -lXext -lX11 -lm -lQtCore -lpthread -ldl
make[3]: Leaving directory `/build/buildd/qzion-0.4.0/obj-i486-linux-gnu'
/usr/bin/cmake -E cmake_progress_report /build/buildd/qzion-0.4.0/obj-i486-linux-gnu/CMakeFiles 50 51 52
[ 85%] Built target resize
/usr/bin/make -f python/CMakeFiles/compile_python_files.dir/build.make python/CMakeFiles/compile_python_files.dir/depend
make[3]: Entering directory `/build/buildd/qzion-0.4.0/obj-i486-linux-gnu'
cd /build/buildd/qzion-0.4.0/obj-i486-linux-gnu && /usr/bin/cmake -E cmake_depends "Unix Makefiles" /build/buildd/qzion-0.4.0 /build/buildd/qzion-0.4.0/python /build/buildd/qzion-0.4.0/obj-i486-linux-gnu /build/buildd/qzion-0.4.0/obj-i486-linux-gnu/python /build/buildd/qzion-0.4.0/obj-i486-linux-gnu/python/CMakeFiles/compile_python_files.dir/DependInfo.cmake --color=
Scanning dependencies of target compile_python_files
make[3]: Leaving directory `/build/buildd/qzion-0.4.0/obj-i486-linux-gnu'
/usr/bin/make -f python/CMakeFiles/compile_python_files.dir/build.make python/CMakeFiles/compile_python_files.dir/build
make[3]: Entering directory `/build/buildd/qzion-0.4.0/obj-i486-linux-gnu'
cd /build/buildd/qzion-0.4.0/obj-i486-linux-gnu/python && /usr/bin/cmake -E echo
cd /build/buildd/qzion-0.4.0/obj-i486-linux-gnu/python && /usr/bin/cmake -E copy /build/buildd/qzion-0.4.0/python/qzion/__init__.py /build/buildd/qzion-0.4.0/obj-i486-linux-gnu/python/qzion/__init__.py
cd /build/buildd/qzion-0.4.0/obj-i486-linux-gnu/python && /usr/bin/python2.6 /build/buildd/qzion-0.4.0/cmake/modules/PythonCompile.py /build/buildd/qzion-0.4.0/obj-i486-linux-gnu/python/qzion/__init__.py
make[3]: Leaving directory `/build/buildd/qzion-0.4.0/obj-i486-linux-gnu'
/usr/bin/cmake -E cmake_progress_report /build/buildd/qzion-0.4.0/obj-i486-linux-gnu/CMakeFiles
[ 85%] Built target compile_python_files
/usr/bin/make -f python/CMakeFiles/python_module_qzion_qzion.dir/build.make python/CMakeFiles/python_module_qzion_qzion.dir/depend
make[3]: Entering directory `/build/buildd/qzion-0.4.0/obj-i486-linux-gnu'
/usr/bin/cmake -E cmake_progress_report /build/buildd/qzion-0.4.0/obj-i486-linux-gnu/CMakeFiles 61
[ 86%] Generating qzion/sipqzionpart0.cpp, qzion/sipqzionpart1.cpp, qzion/sipqzionpart2.cpp, qzion/sipqzionpart3.cpp, qzion/sipqzionpart4.cpp, qzion/sipqzionpart5.cpp, qzion/sipqzionpart6.cpp, qzion/sipqzionpart7.cpp
cd /build/buildd/qzion-0.4.0/obj-i486-linux-gnu/python && /usr/bin/cmake -E echo
cd /build/buildd/qzion-0.4.0/obj-i486-linux-gnu/python && touch /build/buildd/qzion-0.4.0/obj-i486-linux-gnu/python/qzion/sipqzionpart0.cpp /build/buildd/qzion-0.4.0/obj-i486-linux-gnu/python/qzion/sipqzionpart1.cpp /build/buildd/qzion-0.4.0/obj-i486-linux-gnu/python/qzion/sipqzionpart2.cpp /build/buildd/qzion-0.4.0/obj-i486-linux-gnu/python/qzion/sipqzionpart3.cpp /build/buildd/qzion-0.4.0/obj-i486-linux-gnu/python/qzion/sipqzionpart4.cpp /build/buildd/qzion-0.4.0/obj-i486-linux-gnu/python/qzion/sipqzionpart5.cpp /build/buildd/qzion-0.4.0/obj-i486-linux-gnu/python/qzion/sipqzionpart6.cpp /build/buildd/qzion-0.4.0/obj-i486-linux-gnu/python/qzion/sipqzionpart7.cpp
cd /build/buildd/qzion-0.4.0/obj-i486-linux-gnu/python && /usr/bin/sip -t ALL -t WS_X11 -t Qt_4_5_0 -g -j 8 -c /build/buildd/qzion-0.4.0/obj-i486-linux-gnu/python/qzion -I /usr/share/sip/PyQt4 -I /build/buildd/qzion-0.4.0/python/qzion /build/buildd/qzion-0.4.0/python/qzion/qzionmod.sip
cd /build/buildd/qzion-0.4.0/obj-i486-linux-gnu && /usr/bin/cmake -E cmake_depends "Unix Makefiles" /build/buildd/qzion-0.4.0 /build/buildd/qzion-0.4.0/python /build/buildd/qzion-0.4.0/obj-i486-linux-gnu /build/buildd/qzion-0.4.0/obj-i486-linux-gnu/python /build/buildd/qzion-0.4.0/obj-i486-linux-gnu/python/CMakeFiles/python_module_qzion_qzion.dir/DependInfo.cmake --color=
Scanning dependencies of target python_module_qzion_qzion
make[3]: Leaving directory `/build/buildd/qzion-0.4.0/obj-i486-linux-gnu'
/usr/bin/make -f python/CMakeFiles/python_module_qzion_qzion.dir/build.make python/CMakeFiles/python_module_qzion_qzion.dir/build
make[3]: Entering directory `/build/buildd/qzion-0.4.0/obj-i486-linux-gnu'
/usr/bin/cmake -E cmake_progress_report /build/buildd/qzion-0.4.0/obj-i486-linux-gnu/CMakeFiles 53
[ 88%] Building CXX object python/CMakeFiles/python_module_qzion_qzion.dir/qzion/sipqzionpart0.cpp.o
cd /build/buildd/qzion-0.4.0/obj-i486-linux-gnu/python && /usr/bin/g++ -Dpython_module_qzion_qzion_EXPORTS -DQT_DLL -DQT_WEBKIT_LIB -DQT_GUI_LIB -DQT_CORE_LIB -DQT_NO_DEBUG -g -O2 -g -Wall -O2 -Wall -O2 -g -DQT_NO_DEBUG_OUTPUT -fPIC -I/usr/include/python2.6 -I/build/buildd/qzion-0.4.0/python/../src/common -I/usr/include/qt4 -I/usr/include/qt4/QtWebKit -I/usr/include/qt4/QtGui -I/usr/include/qt4/QtCore -o CMakeFiles/python_module_qzion_qzion.dir/qzion/sipqzionpart0.cpp.o -c /build/buildd/qzion-0.4.0/obj-i486-linux-gnu/python/qzion/sipqzionpart0.cpp
/build/buildd/qzion-0.4.0/python/qzion/qzionobject.sip: In function 'const sipTypeDef* sipSubClass_QZionObject(void**)':
/build/buildd/qzion-0.4.0/python/qzion/qzionobject.sip:22: error: invalid conversion from 'const char*' to 'char*'
/build/buildd/qzion-0.4.0/python/qzion/qzionobject.sip:22: error: invalid conversion from 'const char*' to 'char*'
/build/buildd/qzion-0.4.0/python/qzion/qzionobject.sip:22: error: invalid conversion from 'const char*' to 'char*'
/build/buildd/qzion-0.4.0/python/qzion/qzionobject.sip:22: error: invalid conversion from 'const char*' to 'char*'
/build/buildd/qzion-0.4.0/python/qzion/qzionobject.sip:22: error: invalid conversion from 'const char*' to 'char*'
make[3]: *** [python/CMakeFiles/python_module_qzion_qzion.dir/qzion/sipqzionpart0.cpp.o] Error 1
make[3]: Leaving directory `/build/buildd/qzion-0.4.0/obj-i486-linux-gnu'
make[2]: *** [python/CMakeFiles/python_module_qzion_qzion.dir/all] Error 2
make[2]: Leaving directory `/build/buildd/qzion-0.4.0/obj-i486-linux-gnu'
make[1]: *** [all] Error 2
make[1]: Leaving directory `/build/buildd/qzion-0.4.0/obj-i486-linux-gnu'
make: *** [debian/stamp-makefile-build] Error 2
dpkg-buildpackage: error: debian/rules build gave error exit status 2
******************************************************************************
Build finished at 20091003-2143
FAILED [dpkg-buildpackage died]
Purging chroot-karmic-autotest/build/buildd/qzion-0.4.0
------------------------------------------------------------------------------
/usr/bin/sudo dpkg --root=/home/buildd/build-karmic-autotest/chroot-karmic-autotest --purge groff-base libxfixes-dev libx11-data m4 fontconfig-config gettext file zlib1g-dev libqt4-sql libhtml-parser-perl ttf-dejavu libqt4-help libkadm5srv6 libqtgui4 x11-common libqt4-qt3support xlibmesa-gl-dev python2.6 libx11-dev libxi6 automake libjpeg62 sip4 libxcursor1 x11proto-input-dev libexpat1-dev libqtcore4 libjpeg62-dev libfontconfig1 libqt4-script qt4-qmake libx11-6 libqt4-assistant xtrans-dev x11proto-randr-dev libglib2.0-0 libglu1-mesa libnewt0.52 libxinerama-dev libxdamage1 libxt6 libqt4-dev libmng1 comerr-dev libhtml-tree-perl libglib2.0-dev emacsen-common libkrb5-dev libhtml-tagset-perl libxml2 cmake-data x11proto-xext-dev pkg-config python-sip4-dev libsqlite0-dev libice6 intltool-debian libxrender1 libfontconfig1-dev python-qt4 mesa-common-dev libxrandr-dev libxext-dev libjs-jquery libxau-dev libxmu-headers libmng-dev libxrender-dev libqt4-network ttf-dejavu-extra libqt4-d
esigner libpng12-dev libglu1-mesa-dev libxft2 x11proto-render-dev libxext6 libsqlite3-0 libxinerama1 libpcre3 libsm-dev libaudio2 libncursesw5 libxmu6 defoma libxdmcp-dev ttf-dejavu-core fontconfig libdrm2 liburi-perl autotools-dev libcroco3 python-support libkdb5-4 libpopt0 libxt-dev libfreetype6 libice-dev libgl1-mesa-dev libpq5 x11proto-fixes-dev libfreetype6-dev libgl1-mesa-glx libxcb1 libcurl3 html2text python2.6-dev debhelper libpthread-stubs0 libxrandr2 python-sip4 python libmagic1 libqt4-xmlpatterns libglu1-xorg-dev libtiff4 libexpat1 libssl-dev bsdmainutils fdupes libxau6 liblcms1-dev libxcursor-dev mime-support x11proto-core-dev whiptail intltool libxmlrpc-core-c3 libaudio-dev libqt4-dbus libxcb1-dev libxi-dev libwww-perl libxdmcp6 libxfixes3 libxmu-dev libpq-dev po-debconf libqt4-xml libxml-parser-perl libxft-dev libqt4-phonon liblcms1 libpython2.6 libpng12-0 python-dev man-db libxxf86vm1 cmake x11proto-kb-dev libqt4-svg x11proto-xinerama-dev libpthread-stubs0-dev
ucf cdbs gettext-base libsqlite0 libqt4-scripttools libqt4-test libsm6 python-qt4-dev libqt4-webkit libgssrpc4 autoconf
(Reading database ... 22283 files and directories currently installed.)
Removing xlibmesa-gl-dev ...
Removing sip4 ...
Removing libqt4-dev ...
Removing libglib2.0-dev ...
Removing libsqlite0-dev ...
Removing python-qt4 ...
Removing libxrandr-dev ...
Removing libjs-jquery ...
Removing libmng-dev ...
Removing libpng12-dev ...
Removing libxrandr2 ...
Purging configuration files for libxrandr2 ...
Removing python-sip4 ...
Removing libqt4-xmlpatterns ...
Purging configuration files for libqt4-xmlpatterns ...
Removing libglu1-xorg-dev ...
Removing liblcms1-dev ...
Removing libxcursor-dev ...
Removing libaudio-dev ...
Removing libxi-dev ...
Removing libxmu-dev ...
Removing libpq-dev ...
Removing libxft-dev ...
Removing cmake ...
Removing libqt4-svg ...
Purging configuration files for libqt4-svg ...
Removing cdbs ...
Removing libsqlite0 ...
Purging configuration files for libsqlite0 ...
Removing libqt4-scripttools ...
Purging configuration files for libqt4-scripttools ...
Removing libqt4-test ...
Purging configuration files for libqt4-test ...
Removing python-qt4-dev ...
Removing libqt4-webkit ...
Purging configuration files for libqt4-webkit ...
Removing libxfixes-dev ...
Removing libqt4-help ...
Purging configuration files for libqt4-help ...
Removing libqt4-qt3support ...
Purging configuration files for libqt4-qt3support ...
Removing libxi6 ...
Purging configuration files for libxi6 ...
Removing libxcursor1 ...
Purging configuration files for libxcursor1 ...
Removing libjpeg62-dev ...
Removing qt4-qmake ...
Removing libqt4-assistant ...
Purging configuration files for libqt4-assistant ...
Removing x11proto-randr-dev ...
Removing libxinerama-dev ...
Removing libkrb5-dev ...
Removing cmake-data ...
Purging configuration files for cmake-data ...
Removing python-sip4-dev ...
Removing libfontconfig1-dev ...
Removing libxext-dev ...
Removing libxmu-headers ...
Removing libxrender-dev ...
Removing libqt4-network ...
Purging configuration files for libqt4-network ...
Removing libqt4-designer ...
Purging configuration files for libqt4-designer ...
Removing libglu1-mesa-dev ...
Removing libxft2 ...
Purging configuration files for libxft2 ...
Removing x11proto-render-dev ...
Removing libxinerama1 ...
Purging configuration files for libxinerama1 ...
Removing libxmu6 ...
Purging configuration files for libxmu6 ...
Removing python-support ...
Purging configuration files for python-support ...
dpkg - warning: while removing python-support, directory `/usr/share/python/runtime.d' not empty so not removed.
dpkg - warning: while removing python-support, directory `/usr/share/doc/python-support' not empty so not removed.
dpkg - warning: while removing python-support, directory `/usr/share/python-support/private' not empty so not removed.
dpkg - warning: while removing python-support, directory `/usr/share/python-support' not empty so not removed.
Removing libxt-dev ...
Removing libgl1-mesa-dev ...
Removing libpq5 ...
Purging configuration files for libpq5 ...
Removing x11proto-fixes-dev ...
Removing libfreetype6-dev ...
Removing debhelper ...
dpkg - warning: while removing debhelper, directory `/usr/share/perl5/Debian/Debhelper/Sequence' not empty so not removed.
dpkg - warning: while removing debhelper, directory `/usr/share/perl5/Debian/Debhelper' not empty so not removed.
Removing libssl-dev ...
Removing fdupes ...
Removing intltool ...
Removing libxmlrpc-core-c3 ...
Purging configuration files for libxmlrpc-core-c3 ...
Removing po-debconf ...
Removing libxml-parser-perl ...
Removing libqt4-phonon ...
Purging configuration files for libqt4-phonon ...
Removing python-dev ...
Removing man-db ...
Purging configuration files for man-db ...
Removing catpages as well as /var/cache/man hierarchy.
debconf: unable to initialize frontend: Dialog
debconf: (Dialog frontend will not work on a dumb terminal, an emacs shell buffer, or without a controlling terminal.)
debconf: falling back to frontend: Readline
debconf: unable to initialize frontend: Readline
debconf: (This frontend requires a controlling tty.)
debconf: falling back to frontend: Teletype
dpkg - warning: while removing man-db, directory `/usr/lib/man-db' not empty so not removed.
dpkg - warning: while removing man-db, directory `/usr/share/bug/man-db' not empty so not removed.
dpkg - warning: while removing man-db, directory `/usr/share/doc/man-db/examples' not empty so not removed.
dpkg - warning: while removing man-db, directory `/usr/share/doc/man-db' not empty so not removed.
dpkg - warning: while removing man-db, directory `/usr/share/man/id/man5' not empty so not removed.
dpkg - warning: while removing man-db, directory `/usr/share/man-db' not empty so not removed.
Removing x11proto-xinerama-dev ...
Removing groff-base ...
Purging configuration files for groff-base ...
Removing zlib1g-dev ...
Removing libqt4-sql ...
Purging configuration files for libqt4-sql ...
Removing libkadm5srv6 ...
Purging configuration files for libkadm5srv6 ...
Removing libqtgui4 ...
Purging configuration files for libqtgui4 ...
Removing automake ...
Removing libexpat1-dev ...
Removing libqt4-script ...
Purging configuration files for libqt4-script ...
Removing libglu1-mesa ...
Purging configuration files for libglu1-mesa ...
Removing libmng1 ...
Purging configuration files for libmng1 ...
Removing comerr-dev ...
Removing emacsen-common ...
emacsen-common: Handling removal of emacsen flavor emacs
Purging configuration files for emacsen-common ...
Removing x11proto-xext-dev ...
Removing pkg-config ...
Removing intltool-debian ...
Removing libxrender1 ...
Purging configuration files for libxrender1 ...
Removing mesa-common-dev ...
Removing libsm-dev ...
Removing libaudio2 ...
Removing fontconfig ...
Purging font configuration of fontconfig...
Purging category cid..
Purging category truetype..
Purging category type1..
Updating fontconfig cache for /usr/share/fonts/truetype/ttf-dejavu
Purging configuration files for fontconfig ...
Removing autotools-dev ...
Removing libkdb5-4 ...
Purging configuration files for libkdb5-4 ...
Removing libice-dev ...
Removing libgl1-mesa-glx ...
Purging configuration files for libgl1-mesa-glx ...
Removing libcurl3 ...
Purging configuration files for libcurl3 ...
Removing html2text ...
Purging configuration files for html2text ...
Removing python2.6-dev ...
Removing python ...
Purging configuration files for python ...
Removing libtiff4 ...
Purging configuration files for libtiff4 ...
Removing bsdmainutils ...
Purging configuration files for bsdmainutils ...
Removing libqt4-dbus ...
Purging configuration files for libqt4-dbus ...
Removing libwww-perl ...
Removing libqt4-xml ...
Purging configuration files for libqt4-xml ...
Removing liblcms1 ...
Purging configuration files for liblcms1 ...
Removing libpython2.6 ...
Purging configuration files for libpython2.6 ...
Removing libpng12-0 ...
Purging configuration files for libpng12-0 ...
Removing libxxf86vm1 ...
Purging configuration files for libxxf86vm1 ...
Removing libgssrpc4 ...
Purging configuration files for libgssrpc4 ...
Removing autoconf ...
Purging configuration files for autoconf ...
Removing m4 ...
install-info: warning: maintainer scripts should not call install-info anymore,
install-info: warning: this is handled now by a dpkg trigger provided by the
install-info: warning: install-info package; package m4 should be updated.
Removing gettext ...
install-info: warning: maintainer scripts should not call install-info anymore,
install-info: warning: this is handled now by a dpkg trigger provided by the
install-info: warning: install-info package; package gettext should be updated.
Removing python2.6 ...
Purging configuration files for python2.6 ...
Removing libx11-dev ...
Removing libjpeg62 ...
Removing x11proto-input-dev ...
Removing libqtcore4 ...
Purging configuration files for libqtcore4 ...
Removing libfontconfig1 ...
Purging configuration files for libfontconfig1 ...
Removing xtrans-dev ...
Removing libxdamage1 ...
Purging configuration files for libxdamage1 ...
Removing libxt6 ...
Purging configuration files for libxt6 ...
Removing libhtml-tree-perl ...
Removing libxext6 ...
Purging configuration files for libxext6 ...
Removing libsqlite3-0 ...
Purging configuration files for libsqlite3-0 ...
Removing libncursesw5 ...
Purging configuration files for libncursesw5 ...
Removing libdrm2 ...
Purging configuration files for libdrm2 ...
Removing libcroco3 ...
Purging configuration files for libcroco3 ...
Removing libfreetype6 ...
Purging configuration files for libfreetype6 ...
Removing libexpat1 ...
Purging configuration files for libexpat1 ...
Removing mime-support ...
Purging configuration files for mime-support ...
Removing libxcb1-dev ...
Removing libxfixes3 ...
Purging configuration files for libxfixes3 ...
Removing x11proto-kb-dev ...
Removing libpthread-stubs0-dev ...
Removing gettext-base ...
Removing libsm6 ...
Purging configuration files for libsm6 ...
Removing fontconfig-config ...
Purging configuration files for fontconfig-config ...
debconf: unable to initialize frontend: Dialog
debconf: (Dialog frontend will not work on a dumb terminal, an emacs shell buffer, or without a controlling terminal.)
debconf: falling back to frontend: Readline
debconf: unable to initialize frontend: Readline
debconf: (This frontend requires a controlling tty.)
debconf: falling back to frontend: Teletype
Removing libhtml-parser-perl ...
Removing ttf-dejavu ...
Removing libx11-6 ...
Purging configuration files for libx11-6 ...
Removing libglib2.0-0 ...
Purging configuration files for libglib2.0-0 ...
Removing libhtml-tagset-perl ...
Removing libxml2 ...
Purging configuration files for libxml2 ...
Removing libice6 ...
Purging configuration files for libice6 ...
Removing libxau-dev ...
Removing ttf-dejavu-extra ...
Purging configuration files for ttf-dejavu-extra ...
Removing libpcre3 ...
Purging configuration files for libpcre3 ...
Removing libxdmcp-dev ...
Removing ttf-dejavu-core ...
Purging configuration files for ttf-dejavu-core ...
Removing liburi-perl ...
Removing libxcb1 ...
Purging configuration files for libxcb1 ...
Removing libpthread-stubs0 ...
Removing libxau6 ...
Purging configuration files for libxau6 ...
Removing x11proto-core-dev ...
Removing libxdmcp6 ...
Purging configuration files for libxdmcp6 ...
Removing ucf ...
Purging configuration files for ucf ...
debconf: unable to initialize frontend: Dialog
debconf: (Dialog frontend will not work on a dumb terminal, an emacs shell buffer, or without a controlling terminal.)
debconf: falling back to frontend: Readline
debconf: unable to initialize frontend: Readline
debconf: (This frontend requires a controlling tty.)
debconf: falling back to frontend: Teletype
Removing libx11-data ...
Removing x11-common ...
Purging configuration files for x11-common ...
debconf: unable to initialize frontend: Dialog
debconf: (Dialog frontend will not work on a dumb terminal, an emacs shell buffer, or without a controlling terminal.)
debconf: falling back to frontend: Readline
debconf: unable to initialize frontend: Readline
debconf: (This frontend requires a controlling tty.)
debconf: falling back to frontend: Teletype
Removing defoma ...
Purging configuration files for defoma ...
dpkg - warning: while removing defoma, directory `/usr/share/debhelper/autoscripts' not empty so not removed.
dpkg - warning: while removing defoma, directory `/usr/share/debhelper' not empty so not removed.
Removing whiptail ...
Removing file ...
Purging configuration files for file ...
Removing libnewt0.52 ...
Purging configuration files for libnewt0.52 ...
Removing libpopt0 ...
Purging configuration files for libpopt0 ...
Removing libmagic1 ...
Purging configuration files for libmagic1 ...
Processing triggers for libc-bin ...
ldconfig deferred processing now taking place
******************************************************************************
Finished at 20091003-2143
Build needed 00:01:25, 21120k disk space
More information about the ubuntu-autotest
mailing list