Log for failed build of adns_1.4-2 (dist=karmic-autotest)

Build Daemon user noreply at buildd.ubuntu.com
Sat Oct 3 20:14:14 BST 2009


Automatic build of adns_1.4-2 on weddell by sbuild/ia64 1.170.5
Build started at 20091003-2012
******************************************************************************
Checking available source versions...
Fetching source files...
Reading package lists...
Building dependency tree...
Reading state information...
Need to get 259kB of source archives.
Get:1 http://ftpmaster.internal karmic/main adns 1.4-2 (dsc) [1006B]
Get:2 http://ftpmaster.internal karmic/main adns 1.4-2 (tar) [253kB]
Get:3 http://ftpmaster.internal karmic/main adns 1.4-2 (diff) [5717B]
Fetched 259kB in 0s (3730kB/s)
Download complete and in download only mode
** Using build dependencies supplied by package:
Build-Depends: debhelper (>= 7), netbase, m4
Checking for already installed source dependencies...
debhelper: missing
netbase: already installed (4.35ubuntu2)
m4: missing
Checking for source dependency conflicts...
  /usr/bin/sudo /usr/bin/apt-get --purge $CHROOT_OPTIONS -q -y install debhelper m4
Reading package lists...
Building dependency tree...
Reading state information...
The following extra packages will be installed:
  bsdmainutils file gettext gettext-base groff-base html2text intltool-debian
  libcroco3 libglib2.0-0 libmagic1 libpcre3 libxml2 man-db po-debconf
Suggested packages:
  wamerican wordlist whois vacation dh-make cvs gettext-doc groff less
  www-browser libmail-box-perl
Recommended packages:
  curl wget lynx libglib2.0-data shared-mime-info xml-core
  libmail-sendmail-perl
The following NEW packages will be installed:
  bsdmainutils debhelper file gettext gettext-base groff-base html2text
  intltool-debian libcroco3 libglib2.0-0 libmagic1 libpcre3 libxml2 m4 man-db
  po-debconf
0 upgraded, 16 newly installed, 0 to remove and 0 not upgraded.
Need to get 0B/10.3MB of archives.
After this operation, 36.7MB of additional disk space will be used.
WARNING: The following packages cannot be authenticated!
  libmagic1 file libpcre3 libglib2.0-0 libxml2 bsdmainutils gettext-base
  groff-base man-db html2text libcroco3 gettext intltool-debian po-debconf
  debhelper m4
debconf: unable to initialize frontend: Dialog
debconf: (Dialog frontend will not work on a dumb terminal, an emacs shell buffer, or without a controlling terminal.)
debconf: falling back to frontend: Readline
debconf: unable to initialize frontend: Readline
debconf: (This frontend requires a controlling tty.)
debconf: falling back to frontend: Teletype
dpkg-preconfigure: unable to re-open stdin: 
Authentication warning overridden.
Selecting previously deselected package libmagic1.
(Reading database ... 10575 files and directories currently installed.)
Unpacking libmagic1 (from .../libmagic1_5.03-1ubuntu1_ia64.deb) ...
Selecting previously deselected package file.
Unpacking file (from .../file_5.03-1ubuntu1_ia64.deb) ...
Selecting previously deselected package libpcre3.
Unpacking libpcre3 (from .../libpcre3_7.8-2ubuntu1_ia64.deb) ...
Selecting previously deselected package libglib2.0-0.
Unpacking libglib2.0-0 (from .../libglib2.0-0_2.22.0-1ubuntu1_ia64.deb) ...
Selecting previously deselected package libxml2.
Unpacking libxml2 (from .../libxml2_2.7.3.dfsg-1ubuntu2_ia64.deb) ...
Selecting previously deselected package bsdmainutils.
Unpacking bsdmainutils (from .../bsdmainutils_6.1.10ubuntu4_ia64.deb) ...
Selecting previously deselected package gettext-base.
Unpacking gettext-base (from .../gettext-base_0.17-6ubuntu2_ia64.deb) ...
Selecting previously deselected package groff-base.
Unpacking groff-base (from .../groff-base_1.20.1-5_ia64.deb) ...
Selecting previously deselected package man-db.
Unpacking man-db (from .../man-db_2.5.6-2_ia64.deb) ...
Selecting previously deselected package html2text.
Unpacking html2text (from .../html2text_1.3.2a-14_ia64.deb) ...
Selecting previously deselected package libcroco3.
Unpacking libcroco3 (from .../libcroco3_0.6.1-2_ia64.deb) ...
Selecting previously deselected package gettext.
Unpacking gettext (from .../gettext_0.17-6ubuntu2_ia64.deb) ...
Selecting previously deselected package intltool-debian.
Unpacking intltool-debian (from .../intltool-debian_0.35.0+20060710.1_all.deb) ...
Selecting previously deselected package po-debconf.
Unpacking po-debconf (from .../po-debconf_1.0.16_all.deb) ...
Selecting previously deselected package debhelper.
Unpacking debhelper (from .../debhelper_7.3.15ubuntu3_all.deb) ...
Selecting previously deselected package m4.
Unpacking m4 (from .../archives/m4_1.4.13-1_ia64.deb) ...
Setting up libmagic1 (5.03-1ubuntu1) ...

Setting up file (5.03-1ubuntu1) ...
Setting up libpcre3 (7.8-2ubuntu1) ...

Setting up libglib2.0-0 (2.22.0-1ubuntu1) ...

Setting up libxml2 (2.7.3.dfsg-1ubuntu2) ...

Setting up bsdmainutils (6.1.10ubuntu4) ...
update-alternatives: using /usr/bin/bsd-write to provide /usr/bin/write (write) in auto mode.

Setting up gettext-base (0.17-6ubuntu2) ...

Setting up groff-base (1.20.1-5) ...

Setting up man-db (2.5.6-2) ...
debconf: unable to initialize frontend: Dialog
debconf: (Dialog frontend will not work on a dumb terminal, an emacs shell buffer, or without a controlling terminal.)
debconf: falling back to frontend: Readline
Building database of manual pages ...
... skipping, since this is a buildd

Setting up html2text (1.3.2a-14) ...

Setting up libcroco3 (0.6.1-2) ...

Setting up gettext (0.17-6ubuntu2) ...
install-info: warning: maintainer scripts should not call install-info anymore,
install-info: warning: this is handled now by a dpkg trigger provided by the
install-info: warning: install-info package; package gettext should be updated.

Setting up intltool-debian (0.35.0+20060710.1) ...
Setting up po-debconf (1.0.16) ...
Setting up debhelper (7.3.15ubuntu3) ...
Setting up m4 (1.4.13-1) ...
install-info: warning: maintainer scripts should not call install-info anymore,
install-info: warning: this is handled now by a dpkg trigger provided by the
install-info: warning: install-info package; package m4 should be updated.

Processing triggers for libc-bin ...
ldconfig deferred processing now taking place
Checking correctness of source dependencies...
Toolchain package versions: libc6.1-dev_2.10.1-0ubuntu13 make_3.81-6 dpkg-dev_1.15.4ubuntu2 linux-libc-dev_2.6.31-11.38 g++-4.4_4.4.1-4ubuntu5 gcc-4.4_4.4.1-4ubuntu5 binutils_2.19.91.20091001-0ubuntu2 libstdc++6_4.4.1-4ubuntu5 libstdc++6-4.4-dev_4.4.1-4ubuntu5
------------------------------------------------------------------------------
sh: gcc: not found
dpkg-source: warning: Couldn't determine gcc system type, falling back to default (native compilation)
gpg: Signature made Wed Sep 17 16:13:44 2008 BST using DSA key ID 73014091
gpg: Can't check signature: public key not found
dpkg-source: extracting adns in adns-1.4
dpkg-source: unpacking adns_1.4.orig.tar.gz
dpkg-source: applying /srv/weddell.ubuntu.com/home/buildd/build-karmic-autotest/adns_1.4-2.diff.gz
dpkg-buildpackage: set CFLAGS to default value: -g -O2
dpkg-buildpackage: set CPPFLAGS to default value: 
dpkg-buildpackage: set LDFLAGS to default value: -Wl,-Bsymbolic-functions
dpkg-buildpackage: set FFLAGS to default value: -g -O2
dpkg-buildpackage: set CXXFLAGS to default value: -g -O2
dpkg-buildpackage: source package adns
dpkg-buildpackage: source version 1.4-2
dpkg-buildpackage: host architecture ia64
 /usr/bin/fakeroot debian/rules clean
dh clean --before dh_auto_clean
   dh_testdir
/usr/bin/make distclean
make[1]: Entering directory `/build/buildd/adns-1.4'
set -e; for d in src dynamic client regress; do /usr/bin/make -C $d distclean; done
make[2]: Entering directory `/build/buildd/adns-1.4/src'
make[2]: *** No rule to make target `distclean'.  Stop.
make[2]: Leaving directory `/build/buildd/adns-1.4/src'
make[1]: *** [distclean] Error 2
make[1]: Leaving directory `/build/buildd/adns-1.4'
make: [clean] Error 2 (ignored)
/usr/bin/make -C regress distclean
make[1]: Entering directory `/build/buildd/adns-1.4/regress'
make[1]: *** No rule to make target `distclean'.  Stop.
make[1]: Leaving directory `/build/buildd/adns-1.4/regress'
make: [clean] Error 2 (ignored)
rm -f regress/output-*
dh clean --after dh_auto_clean
   dh_clean
 debian/rules build
dh build --before configure
   dh_testdir
dh_auto_configure
creating cache ./config.cache
checking whether you requested dynamic linking... yes, by default
checking for gcc... gcc
checking whether the C compiler (gcc -g -O2 -Wl,-Bsymbolic-functions) works... yes
checking whether the C compiler (gcc -g -O2 -Wl,-Bsymbolic-functions) is a cross-compiler... no
checking whether we are using GNU C... yes
checking whether gcc accepts -g... yes
checking how to run the C preprocessor... gcc -E
checking for ranlib... ranlib
checking for a BSD compatible install... /usr/bin/install -c
checking for poll... yes
checking for socket... yes
checking for inet_ntoa... yes
checking for tsearch... yes
checking for INADDR_LOOPBACK... found
checking for inet_aton... yes
checking inlines... yes
checking -Wno-pointer-sign... yes
checking __attribute__((,,))... yes
checking __attribute__((noreturn))... yes
checking __attribute__((const))... yes
checking __attribute__((format...))... yes
updating cache ./config.cache
creating ./config.status
creating settings.make
creating Makefile
creating src/Makefile
creating client/Makefile
creating dynamic/Makefile
creating regress/Makefile
creating src/config.h
src/config.h is unchanged
dh_auto_build
make[1]: Entering directory `/build/buildd/adns-1.4'
set -e; for d in src dynamic client regress; do make -C $d all; done
make[2]: Entering directory `/build/buildd/adns-1.4/src'
gcc -g -O2 -Wall -Wmissing-prototypes -Wwrite-strings -Wstrict-prototypes -Wcast-qual -Wpointer-arith -Wno-pointer-sign      -c -o types.o types.c
gcc -g -O2 -Wall -Wmissing-prototypes -Wwrite-strings -Wstrict-prototypes -Wcast-qual -Wpointer-arith -Wno-pointer-sign      -c -o event.o event.c
gcc -g -O2 -Wall -Wmissing-prototypes -Wwrite-strings -Wstrict-prototypes -Wcast-qual -Wpointer-arith -Wno-pointer-sign      -c -o query.o query.c
gcc -g -O2 -Wall -Wmissing-prototypes -Wwrite-strings -Wstrict-prototypes -Wcast-qual -Wpointer-arith -Wno-pointer-sign      -c -o reply.o reply.c
gcc -g -O2 -Wall -Wmissing-prototypes -Wwrite-strings -Wstrict-prototypes -Wcast-qual -Wpointer-arith -Wno-pointer-sign      -c -o general.o general.c
gcc -g -O2 -Wall -Wmissing-prototypes -Wwrite-strings -Wstrict-prototypes -Wcast-qual -Wpointer-arith -Wno-pointer-sign      -c -o setup.o setup.c
setup.c: In function 'ccf_sortlist':
setup.c:204: warning: suggest parentheses around operand of '!' or change '&' to '&&' or '!' to '~'
gcc -g -O2 -Wall -Wmissing-prototypes -Wwrite-strings -Wstrict-prototypes -Wcast-qual -Wpointer-arith -Wno-pointer-sign      -c -o transmit.o transmit.c
gcc -g -O2 -Wall -Wmissing-prototypes -Wwrite-strings -Wstrict-prototypes -Wcast-qual -Wpointer-arith -Wno-pointer-sign      -c -o parse.o parse.c
gcc -g -O2 -Wall -Wmissing-prototypes -Wwrite-strings -Wstrict-prototypes -Wcast-qual -Wpointer-arith -Wno-pointer-sign      -c -o poll.o poll.c
gcc -g -O2 -Wall -Wmissing-prototypes -Wwrite-strings -Wstrict-prototypes -Wcast-qual -Wpointer-arith -Wno-pointer-sign      -c -o check.o check.c
rm -f libadns.a
ar cqv libadns.a.new types.o event.o query.o reply.o general.o setup.o transmit.o parse.o poll.o check.o
a - types.o
a - event.o
a - query.o
a - reply.o
a - general.o
a - setup.o
a - transmit.o
a - parse.o
a - poll.o
a - check.o
ranlib libadns.a.new
mv -f libadns.a.new libadns.a
make[2]: Leaving directory `/build/buildd/adns-1.4/src'
make[2]: Entering directory `/build/buildd/adns-1.4/dynamic'
gcc -g -O2 -Wall -Wmissing-prototypes -Wwrite-strings -Wstrict-prototypes -Wcast-qual -Wpointer-arith -Wno-pointer-sign    -fpic -I./../src -c -o types_p.o ../src/types.c
gcc -g -O2 -Wall -Wmissing-prototypes -Wwrite-strings -Wstrict-prototypes -Wcast-qual -Wpointer-arith -Wno-pointer-sign    -fpic -I./../src -c -o event_p.o ../src/event.c
gcc -g -O2 -Wall -Wmissing-prototypes -Wwrite-strings -Wstrict-prototypes -Wcast-qual -Wpointer-arith -Wno-pointer-sign    -fpic -I./../src -c -o query_p.o ../src/query.c
gcc -g -O2 -Wall -Wmissing-prototypes -Wwrite-strings -Wstrict-prototypes -Wcast-qual -Wpointer-arith -Wno-pointer-sign    -fpic -I./../src -c -o reply_p.o ../src/reply.c
gcc -g -O2 -Wall -Wmissing-prototypes -Wwrite-strings -Wstrict-prototypes -Wcast-qual -Wpointer-arith -Wno-pointer-sign    -fpic -I./../src -c -o general_p.o ../src/general.c
gcc -g -O2 -Wall -Wmissing-prototypes -Wwrite-strings -Wstrict-prototypes -Wcast-qual -Wpointer-arith -Wno-pointer-sign    -fpic -I./../src -c -o setup_p.o ../src/setup.c
../src/setup.c: In function 'ccf_sortlist':
../src/setup.c:204: warning: suggest parentheses around operand of '!' or change '&' to '&&' or '!' to '~'
gcc -g -O2 -Wall -Wmissing-prototypes -Wwrite-strings -Wstrict-prototypes -Wcast-qual -Wpointer-arith -Wno-pointer-sign    -fpic -I./../src -c -o transmit_p.o ../src/transmit.c
gcc -g -O2 -Wall -Wmissing-prototypes -Wwrite-strings -Wstrict-prototypes -Wcast-qual -Wpointer-arith -Wno-pointer-sign    -fpic -I./../src -c -o parse_p.o ../src/parse.c
gcc -g -O2 -Wall -Wmissing-prototypes -Wwrite-strings -Wstrict-prototypes -Wcast-qual -Wpointer-arith -Wno-pointer-sign    -fpic -I./../src -c -o poll_p.o ../src/poll.c
gcc -g -O2 -Wall -Wmissing-prototypes -Wwrite-strings -Wstrict-prototypes -Wcast-qual -Wpointer-arith -Wno-pointer-sign    -fpic -I./../src -c -o check_p.o ../src/check.c
rm -f libadns.so.1.3
gcc -Wl,-Bsymbolic-functions   -shared -Wl,-soname=libadns.so.1 -o libadns.so.1.3  types_p.o event_p.o query_p.o reply_p.o general_p.o setup_p.o transmit_p.o parse_p.o poll_p.o check_p.o  -lc
ln -s libadns.so.1.3 libadns.so.1
ln -s libadns.so.1 libadns.so
make[2]: Leaving directory `/build/buildd/adns-1.4/dynamic'
make[2]: Entering directory `/build/buildd/adns-1.4/client'
gcc -g -O2 -Wall -Wmissing-prototypes -Wwrite-strings -Wstrict-prototypes -Wcast-qual -Wpointer-arith -Wno-pointer-sign  -I./../src    -c -o adnslogres.o adnslogres.c
gcc -Wl,-Bsymbolic-functions   adnslogres.o ./../src//libadns.a -o adnslogres_s 
gcc -g -O2 -Wall -Wmissing-prototypes -Wwrite-strings -Wstrict-prototypes -Wcast-qual -Wpointer-arith -Wno-pointer-sign  -I./../src    -c -o adnsheloex.o adnsheloex.c
gcc -Wl,-Bsymbolic-functions   adnsheloex.o ./../src//libadns.a -o adnsheloex_s 
gcc -g -O2 -Wall -Wmissing-prototypes -Wwrite-strings -Wstrict-prototypes -Wcast-qual -Wpointer-arith -Wno-pointer-sign  -I./../src    -c -o adh-main.o adh-main.c
gcc -g -O2 -Wall -Wmissing-prototypes -Wwrite-strings -Wstrict-prototypes -Wcast-qual -Wpointer-arith -Wno-pointer-sign  -I./../src    -c -o adh-opts.o adh-opts.c
gcc -g -O2 -Wall -Wmissing-prototypes -Wwrite-strings -Wstrict-prototypes -Wcast-qual -Wpointer-arith -Wno-pointer-sign  -I./../src    -c -o adh-query.o adh-query.c
gcc -Wl,-Bsymbolic-functions   adh-main.o adh-opts.o adh-query.o ./../src//libadns.a -o adnshost_s 
gcc -g -O2 -Wall -Wmissing-prototypes -Wwrite-strings -Wstrict-prototypes -Wcast-qual -Wpointer-arith -Wno-pointer-sign  -I./../src    -c -o adnsresfilter.o adnsresfilter.c
gcc -Wl,-Bsymbolic-functions   adnsresfilter.o ./../src//libadns.a -o adnsresfilter_s 
gcc -g -O2 -Wall -Wmissing-prototypes -Wwrite-strings -Wstrict-prototypes -Wcast-qual -Wpointer-arith -Wno-pointer-sign  -I./../src    -c -o fanftest.o fanftest.c
gcc -Wl,-Bsymbolic-functions   fanftest.o ./../src//libadns.a -o fanftest_s 
gcc -g -O2 -Wall -Wmissing-prototypes -Wwrite-strings -Wstrict-prototypes -Wcast-qual -Wpointer-arith -Wno-pointer-sign  -I./../src    -c -o adnstest.o adnstest.c
gcc -Wl,-Bsymbolic-functions   adnstest.o ./../src//libadns.a -o adnstest_s 
gcc -Wl,-Bsymbolic-functions   adnslogres.o -L./../dynamic -ladns -o adnslogres 
gcc -Wl,-Bsymbolic-functions   adnsheloex.o -L./../dynamic -ladns -o adnsheloex 
gcc -Wl,-Bsymbolic-functions   adh-main.o adh-opts.o adh-query.o -L./../dynamic -ladns -o adnshost 
gcc -Wl,-Bsymbolic-functions   adnsresfilter.o -L./../dynamic -ladns -o adnsresfilter 
make[2]: Leaving directory `/build/buildd/adns-1.4/client'
make[2]: Entering directory `/build/buildd/adns-1.4/regress'
gcc -g -O2 -Wall -Wmissing-prototypes -Wwrite-strings -Wstrict-prototypes -Wcast-qual -Wpointer-arith -Wno-pointer-sign  -I./../src    -c -o hrecord.o hrecord.c
gcc -g -O2 -Wall -Wmissing-prototypes -Wwrite-strings -Wstrict-prototypes -Wcast-qual -Wpointer-arith -Wno-pointer-sign  -I./../src    -c -o hcommon.o hcommon.c
gcc -g -O2 -Wall -Wmissing-prototypes -Wwrite-strings -Wstrict-prototypes -Wcast-qual -Wpointer-arith -Wno-pointer-sign  -I./../src  -DADNS_REGRESS_TEST -I. -c -g -o types_d.o ../src/types.c
gcc -g -O2 -Wall -Wmissing-prototypes -Wwrite-strings -Wstrict-prototypes -Wcast-qual -Wpointer-arith -Wno-pointer-sign  -I./../src  -DADNS_REGRESS_TEST -I. -c -g -o event_d.o ../src/event.c
gcc -g -O2 -Wall -Wmissing-prototypes -Wwrite-strings -Wstrict-prototypes -Wcast-qual -Wpointer-arith -Wno-pointer-sign  -I./../src  -DADNS_REGRESS_TEST -I. -c -g -o query_d.o ../src/query.c
gcc -g -O2 -Wall -Wmissing-prototypes -Wwrite-strings -Wstrict-prototypes -Wcast-qual -Wpointer-arith -Wno-pointer-sign  -I./../src  -DADNS_REGRESS_TEST -I. -c -g -o reply_d.o ../src/reply.c
gcc -g -O2 -Wall -Wmissing-prototypes -Wwrite-strings -Wstrict-prototypes -Wcast-qual -Wpointer-arith -Wno-pointer-sign  -I./../src  -DADNS_REGRESS_TEST -I. -c -g -o general_d.o ../src/general.c
gcc -g -O2 -Wall -Wmissing-prototypes -Wwrite-strings -Wstrict-prototypes -Wcast-qual -Wpointer-arith -Wno-pointer-sign  -I./../src  -DADNS_REGRESS_TEST -I. -c -g -o setup_d.o ../src/setup.c
../src/setup.c: In function 'ccf_sortlist':
../src/setup.c:204: warning: suggest parentheses around operand of '!' or change '&' to '&&' or '!' to '~'
gcc -g -O2 -Wall -Wmissing-prototypes -Wwrite-strings -Wstrict-prototypes -Wcast-qual -Wpointer-arith -Wno-pointer-sign  -I./../src  -DADNS_REGRESS_TEST -I. -c -g -o transmit_d.o ../src/transmit.c
gcc -g -O2 -Wall -Wmissing-prototypes -Wwrite-strings -Wstrict-prototypes -Wcast-qual -Wpointer-arith -Wno-pointer-sign  -I./../src  -DADNS_REGRESS_TEST -I. -c -g -o parse_d.o ../src/parse.c
gcc -g -O2 -Wall -Wmissing-prototypes -Wwrite-strings -Wstrict-prototypes -Wcast-qual -Wpointer-arith -Wno-pointer-sign  -I./../src  -DADNS_REGRESS_TEST -I. -c -g -o poll_d.o ../src/poll.c
gcc -g -O2 -Wall -Wmissing-prototypes -Wwrite-strings -Wstrict-prototypes -Wcast-qual -Wpointer-arith -Wno-pointer-sign  -I./../src  -DADNS_REGRESS_TEST -I. -c -g -o check_d.o ../src/check.c
gcc -g -O2 -Wall -Wmissing-prototypes -Wwrite-strings -Wstrict-prototypes -Wcast-qual -Wpointer-arith -Wno-pointer-sign  -I./../src  -DADNS_REGRESS_TEST -I. -I ./../src -c -g -o adnstest_c.o ../client/adnstest.c
gcc -Wl,-Bsymbolic-functions   adnstest_c.o hrecord.o hcommon.o types_d.o event_d.o query_d.o reply_d.o general_d.o setup_d.o transmit_d.o parse_d.o poll_d.o check_d.o  -o adnstest_record
gcc -g -O2 -Wall -Wmissing-prototypes -Wwrite-strings -Wstrict-prototypes -Wcast-qual -Wpointer-arith -Wno-pointer-sign  -I./../src  -DADNS_REGRESS_TEST -I. -I ./../src -c -g -o adh-main_c.o ../client/adh-main.c
gcc -g -O2 -Wall -Wmissing-prototypes -Wwrite-strings -Wstrict-prototypes -Wcast-qual -Wpointer-arith -Wno-pointer-sign  -I./../src  -DADNS_REGRESS_TEST -I. -I ./../src -c -g -o adh-opts_c.o ../client/adh-opts.c
gcc -g -O2 -Wall -Wmissing-prototypes -Wwrite-strings -Wstrict-prototypes -Wcast-qual -Wpointer-arith -Wno-pointer-sign  -I./../src  -DADNS_REGRESS_TEST -I. -I ./../src -c -g -o adh-query_c.o ../client/adh-query.c
gcc -Wl,-Bsymbolic-functions   adh-main_c.o adh-opts_c.o adh-query_c.o hrecord.o hcommon.o types_d.o event_d.o query_d.o reply_d.o general_d.o setup_d.o transmit_d.o parse_d.o poll_d.o check_d.o  -o adnshost_record
gcc -g -O2 -Wall -Wmissing-prototypes -Wwrite-strings -Wstrict-prototypes -Wcast-qual -Wpointer-arith -Wno-pointer-sign  -I./../src  -DADNS_REGRESS_TEST -I. -I ./../src -c -g -o adnslogres_c.o ../client/adnslogres.c
gcc -Wl,-Bsymbolic-functions   adnslogres_c.o hrecord.o hcommon.o types_d.o event_d.o query_d.o reply_d.o general_d.o setup_d.o transmit_d.o parse_d.o poll_d.o check_d.o  -o adnslogres_record
gcc -g -O2 -Wall -Wmissing-prototypes -Wwrite-strings -Wstrict-prototypes -Wcast-qual -Wpointer-arith -Wno-pointer-sign  -I./../src  -DADNS_REGRESS_TEST -I. -I ./../src -c -g -o adnsresfilter_c.o ../client/adnsresfilter.c
gcc -Wl,-Bsymbolic-functions   adnsresfilter_c.o hrecord.o hcommon.o types_d.o event_d.o query_d.o reply_d.o general_d.o setup_d.o transmit_d.o parse_d.o poll_d.o check_d.o  -o adnsresfilter_record
gcc -g -O2 -Wall -Wmissing-prototypes -Wwrite-strings -Wstrict-prototypes -Wcast-qual -Wpointer-arith -Wno-pointer-sign  -I./../src    -c -o hplayback.o hplayback.c
hplayback.c: In function 'Tensurerecordfile':
hplayback.c:49: warning: ignoring return value of 'fgets', declared with attribute warn_unused_result
hplayback.c: In function 'P_updatetime':
hplayback.c:90: warning: ignoring return value of 'fgets', declared with attribute warn_unused_result
hplayback.c: In function 'Hselect':
hplayback.c:226: warning: ignoring return value of 'fgets', declared with attribute warn_unused_result
hplayback.c: In function 'Hpoll':
hplayback.c:258: warning: ignoring return value of 'fgets', declared with attribute warn_unused_result
hplayback.c: In function 'Hsocket':
hplayback.c:290: warning: ignoring return value of 'fgets', declared with attribute warn_unused_result
hplayback.c: In function 'Hfcntl':
hplayback.c:324: warning: ignoring return value of 'fgets', declared with attribute warn_unused_result
hplayback.c: In function 'Hconnect':
hplayback.c:365: warning: ignoring return value of 'fgets', declared with attribute warn_unused_result
hplayback.c: In function 'Hbind':
hplayback.c:392: warning: ignoring return value of 'fgets', declared with attribute warn_unused_result
hplayback.c: In function 'Hlisten':
hplayback.c:419: warning: ignoring return value of 'fgets', declared with attribute warn_unused_result
hplayback.c: In function 'Hclose':
hplayback.c:446: warning: ignoring return value of 'fgets', declared with attribute warn_unused_result
hplayback.c: In function 'Hsendto':
hplayback.c:475: warning: ignoring return value of 'fgets', declared with attribute warn_unused_result
hplayback.c: In function 'Hrecvfrom':
hplayback.c:504: warning: ignoring return value of 'fgets', declared with attribute warn_unused_result
hplayback.c: In function 'Hread':
hplayback.c:533: warning: ignoring return value of 'fgets', declared with attribute warn_unused_result
hplayback.c: In function 'Hwrite':
hplayback.c:562: warning: ignoring return value of 'fgets', declared with attribute warn_unused_result
gcc -Wl,-Bsymbolic-functions   adnstest_c.o hplayback.o hcommon.o types_d.o event_d.o query_d.o reply_d.o general_d.o setup_d.o transmit_d.o parse_d.o poll_d.o check_d.o  -o adnstest_playback
gcc -Wl,-Bsymbolic-functions   adh-main_c.o adh-opts_c.o adh-query_c.o hplayback.o hcommon.o types_d.o event_d.o query_d.o reply_d.o general_d.o setup_d.o transmit_d.o parse_d.o poll_d.o check_d.o  -o adnshost_playback
gcc -Wl,-Bsymbolic-functions   adnslogres_c.o hplayback.o hcommon.o types_d.o event_d.o query_d.o reply_d.o general_d.o setup_d.o transmit_d.o parse_d.o poll_d.o check_d.o  -o adnslogres_playback
gcc -Wl,-Bsymbolic-functions   adnsresfilter_c.o hplayback.o hcommon.o types_d.o event_d.o query_d.o reply_d.o general_d.o setup_d.o transmit_d.o parse_d.o poll_d.o check_d.o  -o adnsresfilter_playback
rm adnstest_c.o adnsresfilter_c.o adnslogres_c.o
make[2]: Leaving directory `/build/buildd/adns-1.4/regress'
make all-here
make[2]: Entering directory `/build/buildd/adns-1.4'
make[2]: Nothing to be done for `all-here'.
make[2]: Leaving directory `/build/buildd/adns-1.4'
make[1]: Leaving directory `/build/buildd/adns-1.4'
make -C regress check
make[1]: Entering directory `/build/buildd/adns-1.4/regress'
./checkall
1stservbroken 1stservtotcp 2ndservok 2ndservtcp abbrev abbrevto adh-cancel adh-cancel2 adh-cancel3 adh-norm adh-pipe alr-norm alr-slow arf-norm arf-text brokenmail child cnametocname comprinf connfail datapluscname datapluscnamewait flags10 flags9 formerr lockup longdom0 longdom1 longdomsrch0 longdomsrch1 longdomsrch1b longdomsrch2 longlab0 longlab1 mailboxes manya manyptrwrong manyptrwrongrem manyptrwrongrst manyptrwrongrty ndots-as ndots ndotsbad noinfto norecurse norecurse2 norecurse3 norm owner poll polltimeout ptrbaddom quote rootquery rootqueryall-as rootqueryall search-as search searchabs sillyrp srvbaddom srvha srvok srvqudom srvsort tcpallfail tcpblock tcpblockbrk tcpblockwr tcpbreakin tcpmultipart tcpptr timeout trunc unknown2 unknown33 unknown5 unknownq 

all tests passed.

make[1]: Leaving directory `/build/buildd/adns-1.4/regress'
dh build --after test
touch build-stamp
 /usr/bin/fakeroot debian/rules binary-arch
dh install --before dh_auto_install
   dh_testroot
   dh_prep
   dh_installdirs
/usr/bin/make install prefix=`pwd`/debian/tmp/usr
make[1]: Entering directory `/build/buildd/adns-1.4'
set -e; for d in src dynamic client regress; do /usr/bin/make -C $d install; done
make[2]: Entering directory `/build/buildd/adns-1.4/src'
mkdir -p /build/buildd/adns-1.4/debian/tmp/usr/lib /build/buildd/adns-1.4/debian/tmp/usr/include
set -xe; for f in libadns.a; \
			do /usr/bin/install -c -m 644 $f /build/buildd/adns-1.4/debian/tmp/usr/lib/$f; done
+ /usr/bin/install -c -m 644 libadns.a /build/buildd/adns-1.4/debian/tmp/usr/lib/libadns.a
/usr/bin/install -c -m 644 ./../src/adns.h /build/buildd/adns-1.4/debian/tmp/usr/include/adns.h
make[2]: Leaving directory `/build/buildd/adns-1.4/src'
make[2]: Entering directory `/build/buildd/adns-1.4/dynamic'
mkdir -p /build/buildd/adns-1.4/debian/tmp/usr/lib
/usr/bin/install -c -m 755  libadns.so.1.3 /build/buildd/adns-1.4/debian/tmp/usr/lib/libadns.so.1.3
ln -sf libadns.so.1.3 /build/buildd/adns-1.4/debian/tmp/usr/lib/libadns.so.1
ln -sf libadns.so.1 /build/buildd/adns-1.4/debian/tmp/usr/lib/libadns.so
make[2]: Leaving directory `/build/buildd/adns-1.4/dynamic'
make[2]: Entering directory `/build/buildd/adns-1.4/client'
mkdir -p /build/buildd/adns-1.4/debian/tmp/usr/bin
set -xe; for f in adnslogres adnsheloex adnshost adnsresfilter; \
			do /usr/bin/install -c -m 755  $f /build/buildd/adns-1.4/debian/tmp/usr/bin/$f; done
+ /usr/bin/install -c -m 755 adnslogres /build/buildd/adns-1.4/debian/tmp/usr/bin/adnslogres
+ /usr/bin/install -c -m 755 adnsheloex /build/buildd/adns-1.4/debian/tmp/usr/bin/adnsheloex
+ /usr/bin/install -c -m 755 adnshost /build/buildd/adns-1.4/debian/tmp/usr/bin/adnshost
+ /usr/bin/install -c -m 755 adnsresfilter /build/buildd/adns-1.4/debian/tmp/usr/bin/adnsresfilter
make[2]: Leaving directory `/build/buildd/adns-1.4/client'
make[2]: Entering directory `/build/buildd/adns-1.4/regress'
make[2]: Nothing to be done for `install'.
make[2]: Leaving directory `/build/buildd/adns-1.4/regress'
/usr/bin/make install-here
make[2]: Entering directory `/build/buildd/adns-1.4'
make[2]: Nothing to be done for `install-here'.
make[2]: Leaving directory `/build/buildd/adns-1.4'
make[1]: Leaving directory `/build/buildd/adns-1.4'
dh install --after dh_auto_install
   dh_install
   dh_installdocs
   dh_installchangelogs
   dh_installexamples
   dh_installman
   dh_installcatalogs
   dh_installcron
   dh_installdebconf
   dh_installcatalogs
   dh_installemacsen
   dh_installifupdown
   dh_installinfo
   dh_installinit
   dh_installmenu
   dh_installmime
   dh_installmodules
   dh_installlogcheck
   dh_installlogrotate
   dh_installpam
   dh_installppp
   dh_installudev
   dh_installwm
   dh_installxfonts
   dh_bugfiles
   dh_lintian
   dh_gconf
   dh_icons
   dh_perl
   dh_pysupport
Traceback (most recent call last):
  File "/usr/share/python-support/private/movemodules", line 9, in <module>
    from hashlib import md5
  File "/usr/lib/python2.6/hashlib.py", line 136, in <module>
    md5 = __get_builtin_constructor('md5')
  File "/usr/lib/python2.6/hashlib.py", line 63, in __get_builtin_constructor
    import _md5
ImportError: No module named _md5
dh_pysupport: /usr/share/python-support/private/movemodules returned exit code 1
make: *** [install] Error 1
dpkg-buildpackage: error: /usr/bin/fakeroot debian/rules binary-arch gave error exit status 2
******************************************************************************
Build finished at 20091003-2014
FAILED [dpkg-buildpackage died]
Purging chroot-karmic-autotest/build/buildd/adns-1.4
------------------------------------------------------------------------------
  /usr/bin/sudo dpkg --root=/srv/weddell.ubuntu.com/home/buildd/build-karmic-autotest/chroot-karmic-autotest --purge intltool-debian groff-base libglib2.0-0 m4 gettext file html2text gettext-base debhelper po-debconf libcroco3 libmagic1 libxml2 bsdmainutils libpcre3 man-db
(Reading database ... 11729 files and directories currently installed.)
Removing m4 ...
install-info: warning: maintainer scripts should not call install-info anymore,
install-info: warning: this is handled now by a dpkg trigger provided by the
install-info: warning: install-info package; package m4 should be updated.
Removing debhelper ...
dpkg - warning: while removing debhelper, directory `/usr/share/perl5/Debian/Debhelper/Sequence' not empty so not removed.
dpkg - warning: while removing debhelper, directory `/usr/share/perl5/Debian/Debhelper' not empty so not removed.
dpkg - warning: while removing debhelper, directory `/usr/share/debhelper/autoscripts' not empty so not removed.
dpkg - warning: while removing debhelper, directory `/usr/share/debhelper' not empty so not removed.
Removing po-debconf ...
Removing man-db ...
Purging configuration files for man-db ...
  Removing catpages as well as /var/cache/man hierarchy.
debconf: unable to initialize frontend: Dialog
debconf: (Dialog frontend will not work on a dumb terminal, an emacs shell buffer, or without a controlling terminal.)
debconf: falling back to frontend: Readline
debconf: unable to initialize frontend: Readline
debconf: (This frontend requires a controlling tty.)
debconf: falling back to frontend: Teletype
dpkg - warning: while removing man-db, directory `/usr/lib/man-db' not empty so not removed.
dpkg - warning: while removing man-db, directory `/usr/share/bug/man-db' not empty so not removed.
dpkg - warning: while removing man-db, directory `/usr/share/doc/man-db/examples' not empty so not removed.
dpkg - warning: while removing man-db, directory `/usr/share/doc/man-db' not empty so not removed.
dpkg - warning: while removing man-db, directory `/usr/share/man/id/man5' not empty so not removed.
dpkg - warning: while removing man-db, directory `/usr/share/man-db' not empty so not removed.
Removing intltool-debian ...
Removing groff-base ...
Purging configuration files for groff-base ...
Removing gettext ...
install-info: warning: maintainer scripts should not call install-info anymore,
install-info: warning: this is handled now by a dpkg trigger provided by the
install-info: warning: install-info package; package gettext should be updated.
Removing file ...
Purging configuration files for file ...
Removing html2text ...
Purging configuration files for html2text ...
Removing gettext-base ...
Removing libcroco3 ...
Purging configuration files for libcroco3 ...
Removing libmagic1 ...
Purging configuration files for libmagic1 ...
Removing libxml2 ...
Purging configuration files for libxml2 ...
Removing bsdmainutils ...
Purging configuration files for bsdmainutils ...
Removing libglib2.0-0 ...
Purging configuration files for libglib2.0-0 ...
Removing libpcre3 ...
Purging configuration files for libpcre3 ...
Processing triggers for libc-bin ...
ldconfig deferred processing now taking place
******************************************************************************
Finished at 20091003-2014
Build needed 00:01:01, 15016k disk space




More information about the ubuntu-autotest mailing list