Log for failed build of ed_1.4-1 (dist=karmic-autotest)

Build Daemon user noreply at buildd.ubuntu.com
Sat Oct 3 18:52:08 BST 2009


Automatic build of ed_1.4-1 on weddell by sbuild/ia64 1.170.5
Build started at 20091003-1851
******************************************************************************
Checking available source versions...
Fetching source files...
Reading package lists...
Building dependency tree...
Reading state information...
Need to get 97.8kB of source archives.
Get:1 http://ftpmaster.internal karmic/main ed 1.4-1 (dsc) [945B]
Get:2 http://ftpmaster.internal karmic/main ed 1.4-1 (tar) [90.8kB]
Get:3 http://ftpmaster.internal karmic/main ed 1.4-1 (diff) [6099B]
Fetched 97.8kB in 0s (2251kB/s)
Download complete and in download only mode
** Using build dependencies supplied by package:
Build-Depends: dpatch, debhelper (>= 7.0.50)
Checking for already installed source dependencies...
dpatch: missing
debhelper: missing
Checking for source dependency conflicts...
  /usr/bin/sudo /usr/bin/apt-get --purge $CHROOT_OPTIONS -q -y install dpatch debhelper
Reading package lists...
Building dependency tree...
Reading state information...
The following extra packages will be installed:
  bsdmainutils file gettext gettext-base groff-base html2text intltool-debian
  libcroco3 libglib2.0-0 libmagic1 libpcre3 libxml2 man-db po-debconf
Suggested packages:
  wamerican wordlist whois vacation dh-make curl cvs gettext-doc groff less
  www-browser libmail-box-perl
Recommended packages:
  patchutils libglib2.0-data shared-mime-info xml-core libmail-sendmail-perl
The following NEW packages will be installed:
  bsdmainutils debhelper dpatch file gettext gettext-base groff-base html2text
  intltool-debian libcroco3 libglib2.0-0 libmagic1 libpcre3 libxml2 man-db
  po-debconf
0 upgraded, 16 newly installed, 0 to remove and 1 not upgraded.
Need to get 0B/10.1MB of archives.
After this operation, 36.1MB of additional disk space will be used.
WARNING: The following packages cannot be authenticated!
  libmagic1 file libpcre3 libglib2.0-0 libxml2 bsdmainutils gettext-base
  groff-base man-db html2text libcroco3 gettext intltool-debian po-debconf
  debhelper dpatch
debconf: unable to initialize frontend: Dialog
debconf: (Dialog frontend will not work on a dumb terminal, an emacs shell buffer, or without a controlling terminal.)
debconf: falling back to frontend: Readline
debconf: unable to initialize frontend: Readline
debconf: (This frontend requires a controlling tty.)
debconf: falling back to frontend: Teletype
dpkg-preconfigure: unable to re-open stdin: 
Authentication warning overridden.
Selecting previously deselected package libmagic1.
(Reading database ... 10575 files and directories currently installed.)
Unpacking libmagic1 (from .../libmagic1_5.03-1ubuntu1_ia64.deb) ...
Selecting previously deselected package file.
Unpacking file (from .../file_5.03-1ubuntu1_ia64.deb) ...
Selecting previously deselected package libpcre3.
Unpacking libpcre3 (from .../libpcre3_7.8-2ubuntu1_ia64.deb) ...
Selecting previously deselected package libglib2.0-0.
Unpacking libglib2.0-0 (from .../libglib2.0-0_2.22.0-1ubuntu1_ia64.deb) ...
Selecting previously deselected package libxml2.
Unpacking libxml2 (from .../libxml2_2.7.3.dfsg-1ubuntu2_ia64.deb) ...
Selecting previously deselected package bsdmainutils.
Unpacking bsdmainutils (from .../bsdmainutils_6.1.10ubuntu4_ia64.deb) ...
Selecting previously deselected package gettext-base.
Unpacking gettext-base (from .../gettext-base_0.17-6ubuntu2_ia64.deb) ...
Selecting previously deselected package groff-base.
Unpacking groff-base (from .../groff-base_1.20.1-5_ia64.deb) ...
Selecting previously deselected package man-db.
Unpacking man-db (from .../man-db_2.5.6-2_ia64.deb) ...
Selecting previously deselected package html2text.
Unpacking html2text (from .../html2text_1.3.2a-14_ia64.deb) ...
Selecting previously deselected package libcroco3.
Unpacking libcroco3 (from .../libcroco3_0.6.1-2_ia64.deb) ...
Selecting previously deselected package gettext.
Unpacking gettext (from .../gettext_0.17-6ubuntu2_ia64.deb) ...
Selecting previously deselected package intltool-debian.
Unpacking intltool-debian (from .../intltool-debian_0.35.0+20060710.1_all.deb) ...
Selecting previously deselected package po-debconf.
Unpacking po-debconf (from .../po-debconf_1.0.16_all.deb) ...
Selecting previously deselected package debhelper.
Unpacking debhelper (from .../debhelper_7.3.15ubuntu3_all.deb) ...
Selecting previously deselected package dpatch.
Unpacking dpatch (from .../archives/dpatch_2.0.31_all.deb) ...
Setting up libmagic1 (5.03-1ubuntu1) ...

Setting up file (5.03-1ubuntu1) ...
Setting up libpcre3 (7.8-2ubuntu1) ...

Setting up libglib2.0-0 (2.22.0-1ubuntu1) ...

Setting up libxml2 (2.7.3.dfsg-1ubuntu2) ...

Setting up bsdmainutils (6.1.10ubuntu4) ...
update-alternatives: using /usr/bin/bsd-write to provide /usr/bin/write (write) in auto mode.

Setting up gettext-base (0.17-6ubuntu2) ...

Setting up groff-base (1.20.1-5) ...

Setting up man-db (2.5.6-2) ...
debconf: unable to initialize frontend: Dialog
debconf: (Dialog frontend will not work on a dumb terminal, an emacs shell buffer, or without a controlling terminal.)
debconf: falling back to frontend: Readline
Building database of manual pages ...
... skipping, since this is a buildd

Setting up html2text (1.3.2a-14) ...

Setting up libcroco3 (0.6.1-2) ...

Setting up gettext (0.17-6ubuntu2) ...
install-info: warning: maintainer scripts should not call install-info anymore,
install-info: warning: this is handled now by a dpkg trigger provided by the
install-info: warning: install-info package; package gettext should be updated.

Setting up intltool-debian (0.35.0+20060710.1) ...
Setting up po-debconf (1.0.16) ...
Setting up debhelper (7.3.15ubuntu3) ...
Setting up dpatch (2.0.31) ...
Processing triggers for libc-bin ...
ldconfig deferred processing now taking place
Checking correctness of source dependencies...
Toolchain package versions: libc6.1-dev_2.10.1-0ubuntu13 make_3.81-6 dpkg-dev_1.15.4ubuntu2 linux-libc-dev_2.6.31-11.38 g++-4.4_4.4.1-4ubuntu5 gcc-4.4_4.4.1-4ubuntu5 binutils_2.19.91.20091001-0ubuntu2 libstdc++6_4.4.1-4ubuntu5 libstdc++6-4.4-dev_4.4.1-4ubuntu5
------------------------------------------------------------------------------
sh: gcc: not found
dpkg-source: warning: Couldn't determine gcc system type, falling back to default (native compilation)
gpg: Signature made Wed Jul 15 14:14:00 2009 BST using DSA key ID 5D64F870
gpg: Can't check signature: public key not found
dpkg-source: extracting ed in ed-1.4
dpkg-source: unpacking ed_1.4.orig.tar.gz
dpkg-source: applying /srv/weddell.ubuntu.com/home/buildd/build-karmic-autotest/ed_1.4-1.diff.gz
dpkg-buildpackage: set CFLAGS to default value: -g -O2
dpkg-buildpackage: set CPPFLAGS to default value: 
dpkg-buildpackage: set LDFLAGS to default value: -Wl,-Bsymbolic-functions
dpkg-buildpackage: set FFLAGS to default value: -g -O2
dpkg-buildpackage: set CXXFLAGS to default value: -g -O2
dpkg-buildpackage: source package ed
dpkg-buildpackage: source version 1.4-1
dpkg-buildpackage: host architecture ia64
 /usr/bin/fakeroot debian/rules clean
dpatch  deapply-all  
02_fix-install-info not applied to ./ .
rm -rf patch-stamp patch-stampT debian/patched
dh clean
   dh_testdir
   dh_auto_clean
   dh_clean
	rm -f debian/ed.substvars
	rm -f debian/ed.*.debhelper
	rm -f debian/ed.debhelper.log
	rm -rf debian/ed/
	rm -f debian/files
	find .  \( \( -type f -a \
	        \( -name '#*#' -o -name '.*~' -o -name '*~' -o -name DEADJOE \
		 -o -name '*.orig' -o -name '*.rej' -o -name '*.bak' \
		 -o -name '.*.orig' -o -name .*.rej -o -name '.SUMS' \
		 -o -name TAGS -o \( -path '*/.deps/*' -a -name '*.P' \) \
		\) -exec rm -f {} \; \) -o \
		\( -type d -a -name autom4te.cache -prune -exec rm -rf {} \; \) \)
	rm -f *-stamp
 debian/rules build
test -d debian/patched || install -d debian/patched
dpatch  apply-all  
applying patch 02_fix-install-info to ./ ... ok.
dpatch  cat-all  >>patch-stampT
mv -f patch-stampT patch-stamp
dh build
   dh_testdir
   dh_auto_configure
	./configure --build=ia64-linux-gnu --prefix=/usr --includedir=\${prefix}/include --mandir=\${prefix}/share/man --infodir=\${prefix}/share/info --sysconfdir=/etc --localstatedir=/var --libexecdir=\${prefix}/lib/ed --disable-maintainer-mode --disable-dependency-tracking

creating config.status
creating Makefile
VPATH = .
prefix = /usr
exec_prefix = $(prefix)
bindir = $(exec_prefix)/bin
datadir = $(prefix)/share
infodir = ${prefix}/share/info
mandir = ${prefix}/share/man
sysconfdir = /etc
program_prefix = 
CC = gcc
CXX = g++
CPPFLAGS = 
CFLAGS = -Wall -W -O2
CXXFLAGS = -Wall -W -O2
LDFLAGS = 
OK. Now you can run make.
   debian/rules override_dh_auto_build
make[1]: Entering directory `/build/buildd/ed-1.4'
/usr/bin/make 
make[2]: Entering directory `/build/buildd/ed-1.4'
gcc  -Wall -W -O2 -c -o buffer.o buffer.c
gcc  -Wall -W -O2 -c -o carg_parser.o carg_parser.c
gcc  -Wall -W -O2 -c -o global.o global.c
gcc  -Wall -W -O2 -c -o io.o io.c
gcc  -Wall -W -O2 -DPROGVERSION=\"1.4\" -c -o main.o main.c
gcc  -Wall -W -O2 -c -o main_loop.o main_loop.c
main_loop.c: In function 'exec_command':
main_loop.c:585: warning: ignoring return value of 'system', declared with attribute warn_unused_result
gcc  -Wall -W -O2 -c -o regex.o regex.c
gcc  -Wall -W -O2 -c -o signal.o signal.c
gcc  -o ed buffer.o carg_parser.o global.o io.o main.o main_loop.o regex.o signal.o
make[2]: Leaving directory `/build/buildd/ed-1.4'
make[1]: Leaving directory `/build/buildd/ed-1.4'
   dh_auto_test
	make check
make[1]: Entering directory `/build/buildd/ed-1.4'
building test scripts for ed...
testing ed...
tests completed successfully.
make[1]: Leaving directory `/build/buildd/ed-1.4'
 /usr/bin/fakeroot debian/rules binary-arch
dh --until dh_install binary-arch
   dh_testroot -a
   dh_prep -a
	rm -f debian/ed.substvars
	rm -f debian/ed.*.debhelper
	rm -rf debian/ed/
   dh_installdirs -a
	install -d debian/ed
   dh_auto_install -a
	make install DESTDIR=/build/buildd/ed-1.4/debian/ed
make[1]: Entering directory `/build/buildd/ed-1.4'
if test ! -d /build/buildd/ed-1.4/debian/ed/usr/share/man/man1 ; then install -d -m 755 /build/buildd/ed-1.4/debian/ed/usr/share/man/man1 ; fi
install -p -m 644 ./doc/ed.1 /build/buildd/ed-1.4/debian/ed/usr/share/man/man1/ed.1
rm -f /build/buildd/ed-1.4/debian/ed/usr/share/man/man1/red.1
cd /build/buildd/ed-1.4/debian/ed/usr/share/man/man1 && ln -s ed.1 red.1
if test ! -d /build/buildd/ed-1.4/debian/ed/usr/bin ; then install -d -m 755 /build/buildd/ed-1.4/debian/ed/usr/bin ; fi
install -p -m 755 ./ed /build/buildd/ed-1.4/debian/ed/usr/bin/ed
rm -f /build/buildd/ed-1.4/debian/ed/usr/bin/red
cd /build/buildd/ed-1.4/debian/ed/usr/bin && ln -s ed red
make[1]: Leaving directory `/build/buildd/ed-1.4'
   dh_install -a
# Move it around:
mkdir -p debian/ed/bin
mv debian/ed/usr/bin/ed debian/ed/bin
# Trash it, will be symlinked:
rm debian/ed/usr/bin/red
dh --remaining binary-arch
   dh_testdir -a
   dh_testroot -a
   dh_installdocs -a
	install -g 0 -o 0 -d debian/ed/usr/share/doc/ed
	cp -a NEWS debian/ed/usr/share/doc/ed
	cp -a README debian/ed/usr/share/doc/ed
	cp -a TODO debian/ed/usr/share/doc/ed
	cp -a AUTHORS debian/ed/usr/share/doc/ed
	chown -R 0:0 debian/ed/usr/share/doc
	chmod -R go=rX debian/ed/usr/share/doc
	chmod -R u\+rw debian/ed/usr/share/doc
	install -g 0 -o 0 -m 644 -p debian/copyright debian/ed/usr/share/doc/ed/copyright
   dh_installchangelogs -a
	install -o 0 -g 0 -p -m644 debian/changelog debian/ed/usr/share/doc/ed/changelog.Debian
	install -o 0 -g 0 -p -m644 ChangeLog debian/ed/usr/share/doc/ed/changelog
   dh_installexamples -a
   dh_installman -a
	man --recode UTF-8 ./ed\.1 > ed\.1\.new
	chmod 644 ed.1.new
	mv -f ed.1.new ed.1
   dh_installcatalogs -a
   dh_installcron -a
   dh_installdebconf -a
	install -o 0 -g 0 -d debian/ed/DEBIAN
   dh_installcatalogs -a
   dh_installemacsen -a
   dh_installifupdown -a
   dh_installinfo -a
	install -d debian/ed/usr/share/info
	cp doc/ed.info debian/ed/usr/share/info
	chmod -R go=rX debian/ed/usr/share/info/
	chmod -R u\+rw debian/ed/usr/share/info/
	(grep -s -v misc:Depends debian/ed.substvars; echo "misc:Depends=dpkg (>= 1.15.4) | install-info") > debian/ed.substvars.new
	mv debian/ed.substvars.new debian/ed.substvars
   dh_installinit -a
   dh_installmenu -a
   dh_installmime -a
   dh_installmodules -a
   dh_installlogcheck -a
   dh_installlogrotate -a
   dh_installpam -a
   dh_installppp -a
   dh_installudev -a
   dh_installwm -a
   dh_installxfonts -a
	(grep -s -v misc:Depends debian/ed.substvars; echo "misc:Depends=dpkg (>= 1.15.4) | install-info") > debian/ed.substvars.new
	mv debian/ed.substvars.new debian/ed.substvars
   dh_bugfiles -a
   dh_lintian -a
   dh_gconf -a
   dh_icons -a
   dh_perl -a
	grep -s -v '^perl:Depends=' debian/ed.substvars > debian/ed.substvars.new || true
	mv debian/ed.substvars.new debian/ed.substvars
   dh_pysupport -a
	/usr/share/python-support/private/movemodules debian/ed
Traceback (most recent call last):
  File "/usr/share/python-support/private/movemodules", line 9, in <module>
    from hashlib import md5
  File "/usr/lib/python2.6/hashlib.py", line 136, in <module>
    md5 = __get_builtin_constructor('md5')
  File "/usr/lib/python2.6/hashlib.py", line 63, in __get_builtin_constructor
    import _md5
ImportError: No module named _md5
dh_pysupport: /usr/share/python-support/private/movemodules returned exit code 1
make: *** [binary-arch] Error 1
dpkg-buildpackage: error: /usr/bin/fakeroot debian/rules binary-arch gave error exit status 2
******************************************************************************
Build finished at 20091003-1852
FAILED [dpkg-buildpackage died]
Purging chroot-karmic-autotest/build/buildd/ed-1.4
------------------------------------------------------------------------------
  /usr/bin/sudo dpkg --root=/srv/weddell.ubuntu.com/home/buildd/build-karmic-autotest/chroot-karmic-autotest --purge intltool-debian groff-base libglib2.0-0 gettext file dpatch html2text gettext-base debhelper po-debconf libcroco3 libmagic1 libxml2 bsdmainutils libpcre3 man-db
(Reading database ... 11715 files and directories currently installed.)
Removing dpatch ...
Purging configuration files for dpatch ...
Removing debhelper ...
dpkg - warning: while removing debhelper, directory `/usr/share/perl5/Debian/Debhelper/Sequence' not empty so not removed.
dpkg - warning: while removing debhelper, directory `/usr/share/perl5/Debian/Debhelper' not empty so not removed.
dpkg - warning: while removing debhelper, directory `/usr/share/debhelper/autoscripts' not empty so not removed.
dpkg - warning: while removing debhelper, directory `/usr/share/debhelper' not empty so not removed.
Removing po-debconf ...
Removing man-db ...
Purging configuration files for man-db ...
  Removing catpages as well as /var/cache/man hierarchy.
debconf: unable to initialize frontend: Dialog
debconf: (Dialog frontend will not work on a dumb terminal, an emacs shell buffer, or without a controlling terminal.)
debconf: falling back to frontend: Readline
debconf: unable to initialize frontend: Readline
debconf: (This frontend requires a controlling tty.)
debconf: falling back to frontend: Teletype
dpkg - warning: while removing man-db, directory `/usr/lib/man-db' not empty so not removed.
dpkg - warning: while removing man-db, directory `/usr/share/bug/man-db' not empty so not removed.
dpkg - warning: while removing man-db, directory `/usr/share/doc/man-db/examples' not empty so not removed.
dpkg - warning: while removing man-db, directory `/usr/share/doc/man-db' not empty so not removed.
dpkg - warning: while removing man-db, directory `/usr/share/man/id/man5' not empty so not removed.
dpkg - warning: while removing man-db, directory `/usr/share/man-db' not empty so not removed.
Removing intltool-debian ...
Removing groff-base ...
Purging configuration files for groff-base ...
Removing gettext ...
install-info: warning: maintainer scripts should not call install-info anymore,
install-info: warning: this is handled now by a dpkg trigger provided by the
install-info: warning: install-info package; package gettext should be updated.
Removing file ...
Purging configuration files for file ...
Removing html2text ...
Purging configuration files for html2text ...
Removing gettext-base ...
Removing libcroco3 ...
Purging configuration files for libcroco3 ...
Removing libmagic1 ...
Purging configuration files for libmagic1 ...
Removing libxml2 ...
Purging configuration files for libxml2 ...
Removing bsdmainutils ...
Purging configuration files for bsdmainutils ...
Removing libglib2.0-0 ...
Purging configuration files for libglib2.0-0 ...
Removing libpcre3 ...
Purging configuration files for libpcre3 ...
Processing triggers for libc-bin ...
ldconfig deferred processing now taking place
******************************************************************************
Finished at 20091003-1852
Build needed 00:00:20, 1788k disk space




More information about the ubuntu-autotest mailing list