Log for failed build of libhtml-parser-perl_3.61-1 (dist=karmic-autotest)
Build Daemon user
noreply at buildd.ubuntu.com
Sat Oct 3 02:22:35 BST 2009
Automatic build of libhtml-parser-perl_3.61-1 on terranova by sbuild/i386 1.170.5
Build started at 20091003-0222
******************************************************************************
Checking available source versions...
Fetching source files...
Reading package lists...
Building dependency tree...
Reading state information...
NOTICE: 'libhtml-parser-perl' packaging is maintained in the 'Svn' version control system at:
svn://svn.debian.org/pkg-perl/trunk/libhtml-parser-perl/
Need to get 95.6kB of source archives.
Get:1 http://ftpmaster.internal karmic/main libhtml-parser-perl 3.61-1 (dsc) [1605B]
Get:2 http://ftpmaster.internal karmic/main libhtml-parser-perl 3.61-1 (tar) [88.3kB]
Get:3 http://ftpmaster.internal karmic/main libhtml-parser-perl 3.61-1 (diff) [5716B]
Fetched 95.6kB in 0s (3538kB/s)
Download complete and in download only mode
** Using build dependencies supplied by package:
Build-Depends: debhelper (>= 7.0.8), perl (>= 5.8.1), libhtml-tagset-perl, libtest-pod-perl, liburi-perl, quilt (>= 0.46-7)
Checking for already installed source dependencies...
debhelper: missing
perl: already installed (5.10.0-24ubuntu4 >= 5.8.1 is satisfied)
libhtml-tagset-perl: missing
libtest-pod-perl: missing
liburi-perl: missing
quilt: missing
Checking for source dependency conflicts...
/usr/bin/sudo /usr/bin/apt-get --purge $CHROOT_OPTIONS -q -y install debhelper libhtml-tagset-perl libtest-pod-perl liburi-perl quilt
Reading package lists...
Building dependency tree...
Reading state information...
The following extra packages will be installed:
bsdmainutils diffstat file gettext gettext-base groff-base html2text
intltool-debian libcroco3 libglib2.0-0 libio-stringy-perl libmagic1 libpcre3
libxml2 man-db po-debconf
Suggested packages:
wamerican wordlist whois vacation dh-make cvs gettext-doc groff libwww-perl
less www-browser libmail-box-perl procmail graphviz
Recommended packages:
curl wget lynx libglib2.0-data shared-mime-info xml-core
libmail-sendmail-perl
The following NEW packages will be installed:
bsdmainutils debhelper diffstat file gettext gettext-base groff-base
html2text intltool-debian libcroco3 libglib2.0-0 libhtml-tagset-perl
libio-stringy-perl libmagic1 libpcre3 libtest-pod-perl liburi-perl libxml2
man-db po-debconf quilt
0 upgraded, 21 newly installed, 0 to remove and 0 not upgraded.
Need to get 0B/8245kB of archives.
After this operation, 27.5MB of additional disk space will be used.
WARNING: The following packages cannot be authenticated!
libmagic1 file libpcre3 libglib2.0-0 libxml2 bsdmainutils gettext-base
groff-base libhtml-tagset-perl liburi-perl man-db html2text libcroco3
gettext intltool-debian po-debconf debhelper diffstat libio-stringy-perl
libtest-pod-perl quilt
debconf: unable to initialize frontend: Dialog
debconf: (Dialog frontend will not work on a dumb terminal, an emacs shell buffer, or without a controlling terminal.)
debconf: falling back to frontend: Readline
debconf: unable to initialize frontend: Readline
debconf: (This frontend requires a controlling tty.)
debconf: falling back to frontend: Teletype
dpkg-preconfigure: unable to re-open stdin:
Authentication warning overridden.
Selecting previously deselected package libmagic1.
(Reading database ... 10668 files and directories currently installed.)
Unpacking libmagic1 (from .../libmagic1_5.03-1ubuntu1_i386.deb) ...
Selecting previously deselected package file.
Unpacking file (from .../file_5.03-1ubuntu1_i386.deb) ...
Selecting previously deselected package libpcre3.
Unpacking libpcre3 (from .../libpcre3_7.8-2ubuntu1_i386.deb) ...
Selecting previously deselected package libglib2.0-0.
Unpacking libglib2.0-0 (from .../libglib2.0-0_2.22.1-0ubuntu1_i386.deb) ...
Selecting previously deselected package libxml2.
Unpacking libxml2 (from .../libxml2_2.7.3.dfsg-1ubuntu2_i386.deb) ...
Selecting previously deselected package bsdmainutils.
Unpacking bsdmainutils (from .../bsdmainutils_6.1.10ubuntu4_i386.deb) ...
Selecting previously deselected package gettext-base.
Unpacking gettext-base (from .../gettext-base_0.17-6ubuntu2_i386.deb) ...
Selecting previously deselected package groff-base.
Unpacking groff-base (from .../groff-base_1.20.1-5_i386.deb) ...
Selecting previously deselected package libhtml-tagset-perl.
Unpacking libhtml-tagset-perl (from .../libhtml-tagset-perl_3.20-2_all.deb) ...
Selecting previously deselected package liburi-perl.
Unpacking liburi-perl (from .../liburi-perl_1.37+dfsg-1ubuntu1_all.deb) ...
Selecting previously deselected package man-db.
Unpacking man-db (from .../man-db_2.5.6-2_i386.deb) ...
Selecting previously deselected package html2text.
Unpacking html2text (from .../html2text_1.3.2a-14_i386.deb) ...
Selecting previously deselected package libcroco3.
Unpacking libcroco3 (from .../libcroco3_0.6.1-2_i386.deb) ...
Selecting previously deselected package gettext.
Unpacking gettext (from .../gettext_0.17-6ubuntu2_i386.deb) ...
Selecting previously deselected package intltool-debian.
Unpacking intltool-debian (from .../intltool-debian_0.35.0+20060710.1_all.deb) ...
Selecting previously deselected package po-debconf.
Unpacking po-debconf (from .../po-debconf_1.0.16_all.deb) ...
Selecting previously deselected package debhelper.
Unpacking debhelper (from .../debhelper_7.3.15ubuntu3_all.deb) ...
Selecting previously deselected package diffstat.
Unpacking diffstat (from .../diffstat_1.47-1_i386.deb) ...
Selecting previously deselected package libio-stringy-perl.
Unpacking libio-stringy-perl (from .../libio-stringy-perl_2.110-4_all.deb) ...
Selecting previously deselected package libtest-pod-perl.
Unpacking libtest-pod-perl (from .../libtest-pod-perl_1.26-2_all.deb) ...
Selecting previously deselected package quilt.
Unpacking quilt (from .../quilt_0.46-8ubuntu1_all.deb) ...
Setting up libmagic1 (5.03-1ubuntu1) ...
Setting up file (5.03-1ubuntu1) ...
Setting up libpcre3 (7.8-2ubuntu1) ...
Setting up libglib2.0-0 (2.22.1-0ubuntu1) ...
Setting up libxml2 (2.7.3.dfsg-1ubuntu2) ...
Setting up bsdmainutils (6.1.10ubuntu4) ...
update-alternatives: using /usr/bin/bsd-write to provide /usr/bin/write (write) in auto mode.
Setting up gettext-base (0.17-6ubuntu2) ...
Setting up groff-base (1.20.1-5) ...
Setting up libhtml-tagset-perl (3.20-2) ...
Setting up liburi-perl (1.37+dfsg-1ubuntu1) ...
Setting up man-db (2.5.6-2) ...
debconf: unable to initialize frontend: Dialog
debconf: (Dialog frontend will not work on a dumb terminal, an emacs shell buffer, or without a controlling terminal.)
debconf: falling back to frontend: Readline
Building database of manual pages ...
... skipping, since this is a buildd
Setting up html2text (1.3.2a-14) ...
Setting up libcroco3 (0.6.1-2) ...
Setting up gettext (0.17-6ubuntu2) ...
install-info: warning: maintainer scripts should not call install-info anymore,
install-info: warning: this is handled now by a dpkg trigger provided by the
install-info: warning: install-info package; package gettext should be updated.
Setting up intltool-debian (0.35.0+20060710.1) ...
Setting up po-debconf (1.0.16) ...
Setting up debhelper (7.3.15ubuntu3) ...
Setting up diffstat (1.47-1) ...
Setting up libio-stringy-perl (2.110-4) ...
Setting up libtest-pod-perl (1.26-2) ...
Setting up quilt (0.46-8ubuntu1) ...
Processing triggers for libc-bin ...
ldconfig deferred processing now taking place
modified:
fstab
Checking correctness of source dependencies...
Toolchain package versions: libc6-dev_2.10.1-0ubuntu13 make_3.81-6 dpkg-dev_1.15.4ubuntu2 linux-libc-dev_2.6.31-11.38 g++-4.4_4.4.1-4ubuntu5 gcc-4.4_4.4.1-4ubuntu5 binutils_2.19.91.20091001-0ubuntu2 libstdc++6_4.4.1-4ubuntu5 libstdc++6-4.4-dev_4.4.1-4ubuntu5
------------------------------------------------------------------------------
sh: gcc: not found
dpkg-source: warning: Couldn't determine gcc system type, falling back to default (native compilation)
gpg: Signature made Mon Jun 22 07:39:45 2009 BST using DSA key ID 9725F63B
gpg: Can't check signature: public key not found
dpkg-source: extracting libhtml-parser-perl in libhtml-parser-perl-3.61
dpkg-source: unpacking libhtml-parser-perl_3.61.orig.tar.gz
dpkg-source: applying /home/buildd/build-karmic-autotest/libhtml-parser-perl_3.61-1.diff.gz
dpkg-buildpackage: set CFLAGS to default value: -g -O2
dpkg-buildpackage: set CPPFLAGS to default value:
dpkg-buildpackage: set LDFLAGS to default value: -Wl,-Bsymbolic-functions
dpkg-buildpackage: set FFLAGS to default value: -g -O2
dpkg-buildpackage: set CXXFLAGS to default value: -g -O2
dpkg-buildpackage: source package libhtml-parser-perl
dpkg-buildpackage: source version 3.61-1
dpkg-buildpackage: host architecture i386
/usr/bin/fakeroot debian/rules clean
dh --with quilt clean
dh_testdir
dh_auto_clean
dh_quilt_unpatch
No patch removed
dh_clean
debian/rules build
dh --with quilt build
dh_testdir
dh_quilt_patch
Applying patch debian_examples_location.patch
patching file Parser.pm
Now at patch debian_examples_location.patch
dh_auto_configure
Checking if your kit is complete...
Looks good
'CREATE_PACKLIST' is not a known MakeMaker parameter name.
Writing Makefile for HTML::Parser
dh_auto_build
make[1]: Entering directory `/build/buildd/libhtml-parser-perl-3.61'
cp lib/HTML/PullParser.pm blib/lib/HTML/PullParser.pm
cp Parser.pm blib/lib/HTML/Parser.pm
cp lib/HTML/Entities.pm blib/lib/HTML/Entities.pm
cp lib/HTML/LinkExtor.pm blib/lib/HTML/LinkExtor.pm
cp lib/HTML/TokeParser.pm blib/lib/HTML/TokeParser.pm
cp lib/HTML/Filter.pm blib/lib/HTML/Filter.pm
cp lib/HTML/HeadParser.pm blib/lib/HTML/HeadParser.pm
/usr/bin/perl /usr/share/perl/5.10/ExtUtils/xsubpp -typemap /usr/share/perl/5.10/ExtUtils/typemap -typemap typemap Parser.xs > Parser.xsc && mv Parser.xsc Parser.c
/usr/bin/perl mkhctype >hctype.h
/usr/bin/perl mkpfunc >pfunc.h
cc -c -D_REENTRANT -D_GNU_SOURCE -DDEBIAN -fno-strict-aliasing -pipe -I/usr/local/include -D_LARGEFILE_SOURCE -D_FILE_OFFSET_BITS=64 -O2 -g -DVERSION=\"3.61\" -DXS_VERSION=\"3.61\" -fPIC "-I/usr/lib/perl/5.10/CORE" -DMARKED_SECTION Parser.c
In file included from Parser.xs:117:
util.c: In function 'grow_gap':
util.c:59: warning: format not a string literal and no format arguments
In file included from hparser.c:14,
from Parser.xs:118:
tokenpos.h: In function 'tokens_grow':
tokenpos.h:38: warning: format not a string literal and no format arguments
tokenpos.h:43: warning: format not a string literal and no format arguments
Parser.xs: In function 'dup_pstate':
Parser.xs:229: warning: format not a string literal and no format arguments
Parser.xs: In function 'XS_HTML__Parser__alloc_pstate':
Parser.xs:351: warning: format not a string literal and no format arguments
Parser.xs: In function 'XS_HTML__Parser_strict_comment':
Parser.xs:482: warning: format '%d' expects type 'int', but argument 2 has type 'I32'
Parser.xs: In function 'XS_HTML__Parser_ignore_tags':
Parser.xs:519: warning: format '%d' expects type 'int', but argument 2 has type 'I32'
Running Mkbootstrap for HTML::Parser ()
chmod 644 Parser.bs
rm -f blib/arch/auto/HTML/Parser/Parser.so
cc -shared -O2 -g -L/usr/local/lib Parser.o -o blib/arch/auto/HTML/Parser/Parser.so \
\
chmod 755 blib/arch/auto/HTML/Parser/Parser.so
cp Parser.bs blib/arch/auto/HTML/Parser/Parser.bs
chmod 644 blib/arch/auto/HTML/Parser/Parser.bs
Manifying blib/man3/HTML::PullParser.3pm
Manifying blib/man3/HTML::Entities.3pm
Manifying blib/man3/HTML::Parser.3pm
Manifying blib/man3/HTML::TokeParser.3pm
Manifying blib/man3/HTML::LinkExtor.3pm
Manifying blib/man3/HTML::HeadParser.3pm
Manifying blib/man3/HTML::Filter.3pm
make[1]: Leaving directory `/build/buildd/libhtml-parser-perl-3.61'
dh_auto_test
make[1]: Entering directory `/build/buildd/libhtml-parser-perl-3.61'
PERL_DL_NONLAZY=1 /usr/bin/perl "-MExtUtils::Command::MM" "-e" "test_harness(0, 'blib/lib', 'blib/arch')" t/*.t
t/api_version........ok
t/argspec-bad........ok
t/argspec............ok
t/argspec2...........ok
t/attr-encoded.......ok
t/callback...........ok
t/case-sensitive.....ok
t/cases..............ok
t/comment............ok
t/crashme............ok
t/declaration........ok
t/default............ok
t/document...........ok
t/dtext..............ok
t/entities...........ok
t/entities2..........ok
t/filter-methods.....ok
t/filter.............ok
t/handler-eof........ok
t/handler............ok
t/headparser-http....ok
1/1 skipped: various reasons
t/headparser.........ok
t/ignore.............ok
t/largetags..........ok
t/linkextor-base.....ok
t/linkextor-rel......ok
t/magic..............ok
t/marked-sect........ok
t/msie-compat........ok
t/offset.............ok
t/options............ok
t/parsefile..........ok
t/parser.............ok
t/plaintext..........ok
t/pod................ok
t/process............ok
t/pullparser.........ok
t/script.............ok
t/skipped-text.......ok
t/stack-realloc......ok
t/textarea...........ok
t/threads............ok
t/tokeparser.........ok
t/uentities..........ok
t/unbroken-text......ok
t/unicode-bom........ok
t/unicode............ok
t/xml-mode...........ok
All tests successful, 1 subtest skipped.
Files=48, Tests=447, 3 wallclock secs ( 2.33 cusr + 0.27 csys = 2.60 CPU)
make[1]: Leaving directory `/build/buildd/libhtml-parser-perl-3.61'
/usr/bin/fakeroot debian/rules binary
dh --with quilt binary
dh_testroot
dh_prep
dh_installdirs
dh_auto_install
make[1]: Entering directory `/build/buildd/libhtml-parser-perl-3.61'
Files found in blib/arch: installing files in blib/lib into architecture dependent library tree
Installing /build/buildd/libhtml-parser-perl-3.61/debian/libhtml-parser-perl/usr/lib/perl5/auto/HTML/Parser/Parser.so
Installing /build/buildd/libhtml-parser-perl-3.61/debian/libhtml-parser-perl/usr/lib/perl5/auto/HTML/Parser/Parser.bs
Installing /build/buildd/libhtml-parser-perl-3.61/debian/libhtml-parser-perl/usr/lib/perl5/HTML/PullParser.pm
Installing /build/buildd/libhtml-parser-perl-3.61/debian/libhtml-parser-perl/usr/lib/perl5/HTML/Parser.pm
Installing /build/buildd/libhtml-parser-perl-3.61/debian/libhtml-parser-perl/usr/lib/perl5/HTML/Entities.pm
Installing /build/buildd/libhtml-parser-perl-3.61/debian/libhtml-parser-perl/usr/lib/perl5/HTML/LinkExtor.pm
Installing /build/buildd/libhtml-parser-perl-3.61/debian/libhtml-parser-perl/usr/lib/perl5/HTML/TokeParser.pm
Installing /build/buildd/libhtml-parser-perl-3.61/debian/libhtml-parser-perl/usr/lib/perl5/HTML/Filter.pm
Installing /build/buildd/libhtml-parser-perl-3.61/debian/libhtml-parser-perl/usr/lib/perl5/HTML/HeadParser.pm
Installing /build/buildd/libhtml-parser-perl-3.61/debian/libhtml-parser-perl/usr/share/man/man3/HTML::PullParser.3pm
Installing /build/buildd/libhtml-parser-perl-3.61/debian/libhtml-parser-perl/usr/share/man/man3/HTML::Entities.3pm
Installing /build/buildd/libhtml-parser-perl-3.61/debian/libhtml-parser-perl/usr/share/man/man3/HTML::Parser.3pm
Installing /build/buildd/libhtml-parser-perl-3.61/debian/libhtml-parser-perl/usr/share/man/man3/HTML::TokeParser.3pm
Installing /build/buildd/libhtml-parser-perl-3.61/debian/libhtml-parser-perl/usr/share/man/man3/HTML::LinkExtor.3pm
Installing /build/buildd/libhtml-parser-perl-3.61/debian/libhtml-parser-perl/usr/share/man/man3/HTML::HeadParser.3pm
Installing /build/buildd/libhtml-parser-perl-3.61/debian/libhtml-parser-perl/usr/share/man/man3/HTML::Filter.3pm
make[1]: Leaving directory `/build/buildd/libhtml-parser-perl-3.61'
dh_install
dh_installdocs
dh_installchangelogs
dh_installexamples
dh_installman
dh_installcatalogs
dh_installcron
dh_installdebconf
dh_installcatalogs
dh_installemacsen
dh_installifupdown
dh_installinfo
dh_installinit
dh_installmenu
dh_installmime
dh_installmodules
dh_installlogcheck
dh_installlogrotate
dh_installpam
dh_installppp
dh_installudev
dh_installwm
dh_installxfonts
dh_bugfiles
dh_lintian
dh_gconf
dh_icons
dh_perl
dh_pysupport
Traceback (most recent call last):
File "/usr/share/python-support/private/movemodules", line 9, in <module>
from hashlib import md5
File "/usr/lib/python2.6/hashlib.py", line 136, in <module>
md5 = __get_builtin_constructor('md5')
File "/usr/lib/python2.6/hashlib.py", line 63, in __get_builtin_constructor
import _md5
ImportError: No module named _md5
dh_pysupport: /usr/share/python-support/private/movemodules returned exit code 1
make: *** [binary] Error 1
dpkg-buildpackage: error: /usr/bin/fakeroot debian/rules binary gave error exit status 2
******************************************************************************
Build finished at 20091003-0222
FAILED [dpkg-buildpackage died]
Purging chroot-karmic-autotest/build/buildd/libhtml-parser-perl-3.61
------------------------------------------------------------------------------
/usr/bin/sudo dpkg --root=/home/buildd/build-karmic-autotest/chroot-karmic-autotest --purge intltool-debian groff-base libtest-pod-perl libglib2.0-0 gettext file liburi-perl diffstat html2text gettext-base debhelper libio-stringy-perl po-debconf quilt libcroco3 libmagic1 libhtml-tagset-perl libxml2 bsdmainutils libpcre3 man-db
(Reading database ... 11962 files and directories currently installed.)
Removing libtest-pod-perl ...
Removing liburi-perl ...
Removing debhelper ...
dpkg - warning: while removing debhelper, directory `/usr/share/debhelper/autoscripts' not empty so not removed.
dpkg - warning: while removing debhelper, directory `/usr/share/debhelper' not empty so not removed.
Removing libio-stringy-perl ...
Removing po-debconf ...
Removing quilt ...
Purging configuration files for quilt ...
dpkg - warning: while removing quilt, directory `/usr/share/perl5/Debian/Debhelper/Sequence' not empty so not removed.
dpkg - warning: while removing quilt, directory `/usr/share/perl5/Debian/Debhelper' not empty so not removed.
Removing libhtml-tagset-perl ...
Removing man-db ...
Purging configuration files for man-db ...
Removing catpages as well as /var/cache/man hierarchy.
debconf: unable to initialize frontend: Dialog
debconf: (Dialog frontend will not work on a dumb terminal, an emacs shell buffer, or without a controlling terminal.)
debconf: falling back to frontend: Readline
debconf: unable to initialize frontend: Readline
debconf: (This frontend requires a controlling tty.)
debconf: falling back to frontend: Teletype
dpkg - warning: while removing man-db, directory `/usr/lib/man-db' not empty so not removed.
dpkg - warning: while removing man-db, directory `/usr/share/bug/man-db' not empty so not removed.
dpkg - warning: while removing man-db, directory `/usr/share/doc/man-db/examples' not empty so not removed.
dpkg - warning: while removing man-db, directory `/usr/share/doc/man-db' not empty so not removed.
dpkg - warning: while removing man-db, directory `/usr/share/man/id/man5' not empty so not removed.
dpkg - warning: while removing man-db, directory `/usr/share/man-db' not empty so not removed.
Removing intltool-debian ...
Removing groff-base ...
Purging configuration files for groff-base ...
Removing gettext ...
install-info: warning: maintainer scripts should not call install-info anymore,
install-info: warning: this is handled now by a dpkg trigger provided by the
install-info: warning: install-info package; package gettext should be updated.
Removing file ...
Purging configuration files for file ...
Removing diffstat ...
Removing html2text ...
Purging configuration files for html2text ...
Removing gettext-base ...
Removing libcroco3 ...
Purging configuration files for libcroco3 ...
Removing libmagic1 ...
Purging configuration files for libmagic1 ...
Removing libxml2 ...
Purging configuration files for libxml2 ...
Removing bsdmainutils ...
Purging configuration files for bsdmainutils ...
Removing libglib2.0-0 ...
Purging configuration files for libglib2.0-0 ...
Removing libpcre3 ...
Purging configuration files for libpcre3 ...
Processing triggers for libc-bin ...
ldconfig deferred processing now taking place
******************************************************************************
Finished at 20091003-0222
Build needed 00:00:12, 1772k disk space
More information about the ubuntu-autotest
mailing list