Log for failed build of libwibble_0.1.22 (dist=karmic-autotest)
Build Daemon user
noreply at buildd.ubuntu.com
Mon Jun 29 10:40:39 BST 2009
Automatic build of libwibble_0.1.22 on terranova by sbuild/i386 1.170.5
Build started at 20090629-1040
******************************************************************************
Checking available source versions...
Fetching source files...
Reading package lists...
Building dependency tree...
Reading state information...
NOTICE: 'libwibble' packaging is maintained in the 'Darcs' version control system at:
http://people.debian.org/~enrico/wibble/standalone
Need to get 124kB of source archives.
Get:1 http://archive.internal karmic-autotest/main libwibble 0.1.22 (dsc) [938B]
Get:2 http://archive.internal karmic-autotest/main libwibble 0.1.22 (tar) [123kB]
Fetched 124kB in 0s (4768kB/s)
Download complete and in download only mode
** Using build dependencies supplied by package:
Build-Depends: cdbs (>= 0.4.51), debhelper (>> 4.1), dh-buildinfo, doxygen, cmake
Checking for already installed source dependencies...
cdbs: missing
debhelper: missing
dh-buildinfo: missing
doxygen: missing
cmake: missing
Checking for source dependency conflicts...
/usr/bin/sudo /usr/bin/apt-get --purge $CHROOT_OPTIONS -q -y install cdbs debhelper dh-buildinfo doxygen cmake
Reading package lists...
Building dependency tree...
Reading state information...
The following packages were automatically installed and are no longer required:
libvolume-id1
Use 'apt-get autoremove' to remove them.
The following extra packages will be installed:
autoconf automake autotools-dev bsdmainutils ca-certificates cmake-data
emacsen-common fdupes file gettext gettext-base groff-base html2text
intltool intltool-debian libcroco3 libcurl3 libcurl3-gnutls libexpat1
libgcrypt11 libglib2.0-0 libgnutls26 libgpg-error0 libgssapi-krb5-2
libhtml-parser-perl libhtml-tagset-perl libhtml-tree-perl libidn11
libk5crypto3 libkeyutils1 libkrb5-3 libkrb5support0 libldap-2.4-2 libmagic1
libpng12-0 libsasl2-2 libsasl2-modules libtasn1-3 liburi-perl libwww-perl
libxml-parser-perl libxml2 libxmlrpc-core-c3 m4 man-db netbase openssl
po-debconf
Suggested packages:
autoconf2.13 autobook autoconf-archive gnu-standards autoconf-doc libtool
wamerican wordlist whois vacation devscripts doc-base dh-make doxygen-doc
doxygen-gui graphviz cvs gettext-doc groff rng-tools gnutls-bin krb5-doc
krb5-user libdata-dump-perl libsasl2-modules-otp libsasl2-modules-ldap
libsasl2-modules-sql libsasl2-modules-gssapi-mit
libsasl2-modules-gssapi-heimdal libcrypt-ssleay-perl libio-socket-ssl-perl
less www-browser openssl-doc libmail-box-perl
Recommended packages:
texlive-extra-utils curl wget lynx libglib2.0-data shared-mime-info
libmailtools-perl libhtml-format-perl xml-core ifupdown
libmail-sendmail-perl
The following NEW packages will be installed:
autoconf automake autotools-dev bsdmainutils ca-certificates cdbs cmake
cmake-data debhelper dh-buildinfo doxygen emacsen-common fdupes file gettext
gettext-base groff-base html2text intltool intltool-debian libcroco3
libcurl3 libcurl3-gnutls libexpat1 libgcrypt11 libglib2.0-0 libgnutls26
libgpg-error0 libgssapi-krb5-2 libhtml-parser-perl libhtml-tagset-perl
libhtml-tree-perl libidn11 libk5crypto3 libkeyutils1 libkrb5-3
libkrb5support0 libldap-2.4-2 libmagic1 libpng12-0 libsasl2-2
libsasl2-modules libtasn1-3 liburi-perl libwww-perl libxml-parser-perl
libxml2 libxmlrpc-core-c3 m4 man-db netbase openssl po-debconf
0 upgraded, 53 newly installed, 0 to remove and 0 not upgraded.
Need to get 0B/20.9MB of archives.
After this operation, 61.4MB of additional disk space will be used.
WARNING: The following packages cannot be authenticated!
openssl ca-certificates libmagic1 file libgpg-error0 libgcrypt11 libtasn1-3
libgnutls26 libkeyutils1 libkrb5support0 libk5crypto3 libkrb5-3
libgssapi-krb5-2 libidn11 libsasl2-modules libsasl2-2 libldap-2.4-2
libcurl3-gnutls netbase bsdmainutils gettext-base groff-base libexpat1
libhtml-tagset-perl liburi-perl libhtml-parser-perl libhtml-tree-perl
libwww-perl libxml-parser-perl libxml2 man-db m4 autoconf autotools-dev
automake html2text libglib2.0-0 libcroco3 gettext intltool-debian po-debconf
debhelper fdupes intltool cdbs libcurl3 libxmlrpc-core-c3 emacsen-common
cmake-data cmake dh-buildinfo libpng12-0 doxygen
debconf: unable to initialize frontend: Dialog
debconf: (Dialog frontend will not work on a dumb terminal, an emacs shell buffer, or without a controlling terminal.)
debconf: falling back to frontend: Readline
debconf: unable to initialize frontend: Readline
debconf: (This frontend requires a controlling tty.)
debconf: falling back to frontend: Teletype
dpkg-preconfigure: unable to re-open stdin:
Authentication warning overridden.
Selecting previously deselected package openssl.
(Reading database ... 10008 files and directories currently installed.)
Unpacking openssl (from .../openssl_0.9.8g-16ubuntu1_i386.deb) ...
Selecting previously deselected package ca-certificates.
Unpacking ca-certificates (from .../ca-certificates_20081127_all.deb) ...
Selecting previously deselected package libmagic1.
Unpacking libmagic1 (from .../libmagic1_5.03-1ubuntu1_i386.deb) ...
Selecting previously deselected package file.
Unpacking file (from .../file_5.03-1ubuntu1_i386.deb) ...
Selecting previously deselected package libgpg-error0.
Unpacking libgpg-error0 (from .../libgpg-error0_1.6-1ubuntu1_i386.deb) ...
Selecting previously deselected package libgcrypt11.
Unpacking libgcrypt11 (from .../libgcrypt11_1.4.4-2ubuntu1_i386.deb) ...
Selecting previously deselected package libtasn1-3.
Unpacking libtasn1-3 (from .../libtasn1-3_2.2-1_i386.deb) ...
Selecting previously deselected package libgnutls26.
Unpacking libgnutls26 (from .../libgnutls26_2.6.6-1_i386.deb) ...
Selecting previously deselected package libkeyutils1.
Unpacking libkeyutils1 (from .../libkeyutils1_1.2-10_i386.deb) ...
Selecting previously deselected package libkrb5support0.
Unpacking libkrb5support0 (from .../libkrb5support0_1.7dfsg~beta3-1_i386.deb) ...
Selecting previously deselected package libk5crypto3.
Unpacking libk5crypto3 (from .../libk5crypto3_1.7dfsg~beta3-1_i386.deb) ...
Selecting previously deselected package libkrb5-3.
Unpacking libkrb5-3 (from .../libkrb5-3_1.7dfsg~beta3-1_i386.deb) ...
Selecting previously deselected package libgssapi-krb5-2.
Unpacking libgssapi-krb5-2 (from .../libgssapi-krb5-2_1.7dfsg~beta3-1_i386.deb) ...
Selecting previously deselected package libidn11.
Unpacking libidn11 (from .../libidn11_1.14-3_i386.deb) ...
Selecting previously deselected package libsasl2-modules.
Unpacking libsasl2-modules (from .../libsasl2-modules_2.1.23.dfsg1-1ubuntu1_i386.deb) ...
Selecting previously deselected package libsasl2-2.
Unpacking libsasl2-2 (from .../libsasl2-2_2.1.23.dfsg1-1ubuntu1_i386.deb) ...
Selecting previously deselected package libldap-2.4-2.
Unpacking libldap-2.4-2 (from .../libldap-2.4-2_2.4.15-1ubuntu3_i386.deb) ...
Selecting previously deselected package libcurl3-gnutls.
Unpacking libcurl3-gnutls (from .../libcurl3-gnutls_7.19.5-1ubuntu1_i386.deb) ...
Selecting previously deselected package netbase.
Unpacking netbase (from .../netbase_4.34ubuntu2_all.deb) ...
Selecting previously deselected package bsdmainutils.
Unpacking bsdmainutils (from .../bsdmainutils_6.1.10ubuntu4_i386.deb) ...
Selecting previously deselected package gettext-base.
Unpacking gettext-base (from .../gettext-base_0.17-6ubuntu2_i386.deb) ...
Selecting previously deselected package groff-base.
Unpacking groff-base (from .../groff-base_1.18.1.1-22build1_i386.deb) ...
Selecting previously deselected package libexpat1.
Unpacking libexpat1 (from .../libexpat1_2.0.1-4_i386.deb) ...
Selecting previously deselected package libhtml-tagset-perl.
Unpacking libhtml-tagset-perl (from .../libhtml-tagset-perl_3.20-2_all.deb) ...
Selecting previously deselected package liburi-perl.
Unpacking liburi-perl (from .../liburi-perl_1.37+dfsg-1ubuntu1_all.deb) ...
Selecting previously deselected package libhtml-parser-perl.
Unpacking libhtml-parser-perl (from .../libhtml-parser-perl_3.60-1_i386.deb) ...
Selecting previously deselected package libhtml-tree-perl.
Unpacking libhtml-tree-perl (from .../libhtml-tree-perl_3.23-1_all.deb) ...
Selecting previously deselected package libwww-perl.
Unpacking libwww-perl (from .../libwww-perl_5.826-1_all.deb) ...
Selecting previously deselected package libxml-parser-perl.
Unpacking libxml-parser-perl (from .../libxml-parser-perl_2.36-1.1build2_i386.deb) ...
Selecting previously deselected package libxml2.
Unpacking libxml2 (from .../libxml2_2.6.32.dfsg-5ubuntu4_i386.deb) ...
Selecting previously deselected package man-db.
Unpacking man-db (from .../man-db_2.5.5-2_i386.deb) ...
Selecting previously deselected package m4.
Unpacking m4 (from .../archives/m4_1.4.13-1_i386.deb) ...
Selecting previously deselected package autoconf.
Unpacking autoconf (from .../autoconf_2.63-3ubuntu1_all.deb) ...
Selecting previously deselected package autotools-dev.
Unpacking autotools-dev (from .../autotools-dev_20090427.1_all.deb) ...
Selecting previously deselected package automake.
Unpacking automake (from .../automake_1%3a1.10.2-1ubuntu2_all.deb) ...
Selecting previously deselected package html2text.
Unpacking html2text (from .../html2text_1.3.2a-14_i386.deb) ...
Selecting previously deselected package libglib2.0-0.
Unpacking libglib2.0-0 (from .../libglib2.0-0_2.21.1-0ubuntu1_i386.deb) ...
Selecting previously deselected package libcroco3.
Unpacking libcroco3 (from .../libcroco3_0.6.1-2_i386.deb) ...
Selecting previously deselected package gettext.
Unpacking gettext (from .../gettext_0.17-6ubuntu2_i386.deb) ...
Selecting previously deselected package intltool-debian.
Unpacking intltool-debian (from .../intltool-debian_0.35.0+20060710.1_all.deb) ...
Selecting previously deselected package po-debconf.
Unpacking po-debconf (from .../po-debconf_1.0.16_all.deb) ...
Selecting previously deselected package debhelper.
Unpacking debhelper (from .../debhelper_7.2.14ubuntu1_all.deb) ...
Selecting previously deselected package fdupes.
Unpacking fdupes (from .../fdupes_1.50-PR2-2_i386.deb) ...
Selecting previously deselected package intltool.
Unpacking intltool (from .../intltool_0.40.6-2_all.deb) ...
Selecting previously deselected package cdbs.
Unpacking cdbs (from .../cdbs_0.4.56ubuntu5_all.deb) ...
Selecting previously deselected package libcurl3.
Unpacking libcurl3 (from .../libcurl3_7.19.5-1ubuntu1_i386.deb) ...
Selecting previously deselected package libxmlrpc-core-c3.
Unpacking libxmlrpc-core-c3 (from .../libxmlrpc-core-c3_1.06.27-1ubuntu4_i386.deb) ...
Selecting previously deselected package emacsen-common.
Unpacking emacsen-common (from .../emacsen-common_1.4.19_all.deb) ...
Selecting previously deselected package cmake-data.
Unpacking cmake-data (from .../cmake-data_2.6.4-1ubuntu1_all.deb) ...
Selecting previously deselected package cmake.
Unpacking cmake (from .../cmake_2.6.4-1ubuntu1_i386.deb) ...
Selecting previously deselected package dh-buildinfo.
Unpacking dh-buildinfo (from .../dh-buildinfo_0.9_all.deb) ...
Selecting previously deselected package libpng12-0.
Unpacking libpng12-0 (from .../libpng12-0_1.2.37-1_i386.deb) ...
Selecting previously deselected package doxygen.
Unpacking doxygen (from .../doxygen_1.5.9-1_i386.deb) ...
Setting up openssl (0.9.8g-16ubuntu1) ...
Setting up ca-certificates (20081127) ...
Updating certificates in /etc/ssl/certs....done.
Running hooks in /etc/ca-certificates/update.d....done.
Setting up libmagic1 (5.03-1ubuntu1) ...
Setting up file (5.03-1ubuntu1) ...
Setting up libgpg-error0 (1.6-1ubuntu1) ...
Setting up libgcrypt11 (1.4.4-2ubuntu1) ...
Setting up libtasn1-3 (2.2-1) ...
Setting up libgnutls26 (2.6.6-1) ...
Setting up libkeyutils1 (1.2-10) ...
Setting up libkrb5support0 (1.7dfsg~beta3-1) ...
Setting up libk5crypto3 (1.7dfsg~beta3-1) ...
Setting up libkrb5-3 (1.7dfsg~beta3-1) ...
Setting up libgssapi-krb5-2 (1.7dfsg~beta3-1) ...
Setting up libidn11 (1.14-3) ...
Setting up netbase (4.34ubuntu2) ...
Setting up bsdmainutils (6.1.10ubuntu4) ...
Setting up gettext-base (0.17-6ubuntu2) ...
Setting up groff-base (1.18.1.1-22build1) ...
Setting up libexpat1 (2.0.1-4) ...
Setting up libhtml-tagset-perl (3.20-2) ...
Setting up liburi-perl (1.37+dfsg-1ubuntu1) ...
Setting up libhtml-parser-perl (3.60-1) ...
Setting up libhtml-tree-perl (3.23-1) ...
Setting up libwww-perl (5.826-1) ...
Setting up libxml-parser-perl (2.36-1.1build2) ...
Setting up libxml2 (2.6.32.dfsg-5ubuntu4) ...
Setting up man-db (2.5.5-2) ...
Building database of manual pages ...
... skipping, since this is a buildd
Setting up m4 (1.4.13-1) ...
Setting up autoconf (2.63-3ubuntu1) ...
Setting up autotools-dev (20090427.1) ...
Setting up automake (1:1.10.2-1ubuntu2) ...
Setting up html2text (1.3.2a-14) ...
Setting up libglib2.0-0 (2.21.1-0ubuntu1) ...
Setting up libcroco3 (0.6.1-2) ...
Setting up gettext (0.17-6ubuntu2) ...
Setting up intltool-debian (0.35.0+20060710.1) ...
Setting up po-debconf (1.0.16) ...
Setting up debhelper (7.2.14ubuntu1) ...
Setting up fdupes (1.50-PR2-2) ...
Setting up intltool (0.40.6-2) ...
Setting up cdbs (0.4.56ubuntu5) ...
Setting up emacsen-common (1.4.19) ...
emacsen-common: Handling install of emacsen flavor emacs
Setting up cmake-data (2.6.4-1ubuntu1) ...
emacsen-common: Handling install of emacsen flavor emacs
Setting up dh-buildinfo (0.9) ...
Setting up libpng12-0 (1.2.37-1) ...
Setting up doxygen (1.5.9-1) ...
Setting up libsasl2-modules (2.1.23.dfsg1-1ubuntu1) ...
Setting up libsasl2-2 (2.1.23.dfsg1-1ubuntu1) ...
Setting up libldap-2.4-2 (2.4.15-1ubuntu3) ...
Setting up libcurl3-gnutls (7.19.5-1ubuntu1) ...
Setting up libcurl3 (7.19.5-1ubuntu1) ...
Setting up libxmlrpc-core-c3 (1.06.27-1ubuntu4) ...
Setting up cmake (2.6.4-1ubuntu1) ...
Processing triggers for libc6 ...
ldconfig deferred processing now taking place
Checking correctness of source dependencies...
Toolchain package versions: libc6-dev_2.9-9ubuntu2 make_3.81-5 dpkg-dev_1.14.24ubuntu2 linux-libc-dev_2.6.30-8.9 g++-4.4_4.4.0-5ubuntu1 gcc-4.4_4.4.0-5ubuntu1 binutils_2.19.51.20090515-0ubuntu1 libstdc++6_4.4.0-5ubuntu1 libstdc++6-4.4-dev_4.4.0-5ubuntu1
------------------------------------------------------------------------------
sh: gcc: not found
dpkg-source: warning: Couldn't determine gcc system type, falling back to default (native compilation)
gpg: Signature made Wed Aug 20 08:31:19 2008 BST using DSA key ID 92DC02A9
gpg: Can't check signature: public key not found
dpkg-source: extracting libwibble in libwibble-0.1.22
dpkg-source: unpacking libwibble_0.1.22.tar.gz
dpkg-buildpackage: set CFLAGS to default value: -g -O2
dpkg-buildpackage: set CPPFLAGS to default value:
dpkg-buildpackage: set LDFLAGS to default value: -Wl,-Bsymbolic-functions
dpkg-buildpackage: set FFLAGS to default value: -g -O2
dpkg-buildpackage: set CXXFLAGS to default value: -g -O2
dpkg-buildpackage: source package libwibble
dpkg-buildpackage: source version 0.1.22
dpkg-buildpackage: host architecture i386
/usr/bin/fakeroot debian/rules clean
test -x debian/rules
rmdir obj-i486-linux-gnu
rmdir: failed to remove `obj-i486-linux-gnu': No such file or directory
make: [cleanbuilddir] Error 1 (ignored)
rm -rf obj-i486-linux-gnu
dh_clean
/usr/bin/make -C obj-i486-linux-gnu -k clean
make: *** obj-i486-linux-gnu: No such file or directory. Stop.
make: [makefile-clean] Error 2 (ignored)
rm -f debian/stamp-makefile-build
rm -f debian/stamp-makefile-check
debian/rules build
test -x debian/rules
mkdir -p "obj-i486-linux-gnu"
cd obj-i486-linux-gnu && cmake /build/buildd/libwibble-0.1.22/. -DCMAKE_INSTALL_PREFIX="/usr" -DCMAKE_C_COMPILER:FILEPATH="/usr/bin/gcc" -DCMAKE_CXX_COMPILER:FILEPATH="/usr/bin/g++" -DCMAKE_C_FLAGS="-g -O2 -g -Wall -O2" -DCMAKE_CXX_FLAGS="-g -O2 -g -Wall -O2" -DCMAKE_SKIP_RPATH=ON -DCMAKE_VERBOSE_MAKEFILE=ON
-- The C compiler identification is GNU
-- The CXX compiler identification is GNU
-- Check for working C compiler: /usr/bin/gcc
-- Check for working C compiler: /usr/bin/gcc -- works
-- Detecting C compiler ABI info
-- Detecting C compiler ABI info - done
-- Check for working CXX compiler: /usr/bin/g++
-- Check for working CXX compiler: /usr/bin/g++ -- works
-- Detecting CXX compiler ABI info
-- Detecting CXX compiler ABI info - done
-- Found Doxygen: /usr/bin/doxygen
-- Found Perl: /usr/bin/perl
CMake Warning (dev) in CMakeLists.txt:
No cmake_minimum_required command is present. A line of code such as
cmake_minimum_required(VERSION 2.6)
should be added at the top of the file. The version specified may be lower
if you wish to support older CMake versions for this project. For more
information run "cmake --help-policy CMP0000".
This warning is for project developers. Use -Wno-dev to suppress it.
-- Configuring done
CMake Warning (dev) at wibble/test.cmake:43 (add_executable):
Policy CMP0003 should be set before this line. Add code such as
if(COMMAND cmake_policy)
cmake_policy(SET CMP0003 NEW)
endif(COMMAND cmake_policy)
as early as possible but after the most recent call to
cmake_minimum_required or cmake_policy(VERSION). This warning appears
because target "wibble-test" links to some libraries for which the linker
must search:
pthread
and other libraries with known full path:
/build/buildd/libwibble-0.1.22/obj-i486-linux-gnu/wibble/libwibble.a
CMake is adding directories in the second list to the linker search path in
case they are needed to find libraries from the first list (for backwards
compatibility with CMake 2.4). Set policy CMP0003 to OLD or NEW to enable
or disable this behavior explicitly. Run "cmake --help-policy CMP0003" for
more information.
Call Stack (most recent call first):
wibble/CMakeLists.txt:34 (wibble_add_test)
This warning is for project developers. Use -Wno-dev to suppress it.
-- Generating done
-- Build files have been written to: /build/buildd/libwibble-0.1.22/obj-i486-linux-gnu
/usr/bin/make -C obj-i486-linux-gnu
make[1]: Entering directory `/build/buildd/libwibble-0.1.22/obj-i486-linux-gnu'
/usr/bin/cmake -H/build/buildd/libwibble-0.1.22 -B/build/buildd/libwibble-0.1.22/obj-i486-linux-gnu --check-build-system CMakeFiles/Makefile.cmake 0
/usr/bin/cmake -E cmake_progress_start /build/buildd/libwibble-0.1.22/obj-i486-linux-gnu/CMakeFiles /build/buildd/libwibble-0.1.22/obj-i486-linux-gnu/CMakeFiles/progress.make
/usr/bin/make -f CMakeFiles/Makefile2 all
make[2]: Entering directory `/build/buildd/libwibble-0.1.22/obj-i486-linux-gnu'
/usr/bin/make -f wibble/CMakeFiles/wibble.dir/build.make wibble/CMakeFiles/wibble.dir/depend
make[3]: Entering directory `/build/buildd/libwibble-0.1.22/obj-i486-linux-gnu'
cd /build/buildd/libwibble-0.1.22/obj-i486-linux-gnu && /usr/bin/cmake -E cmake_depends "Unix Makefiles" /build/buildd/libwibble-0.1.22 /build/buildd/libwibble-0.1.22/wibble /build/buildd/libwibble-0.1.22/obj-i486-linux-gnu /build/buildd/libwibble-0.1.22/obj-i486-linux-gnu/wibble /build/buildd/libwibble-0.1.22/obj-i486-linux-gnu/wibble/CMakeFiles/wibble.dir/DependInfo.cmake --color=
Scanning dependencies of target wibble
make[3]: Leaving directory `/build/buildd/libwibble-0.1.22/obj-i486-linux-gnu'
/usr/bin/make -f wibble/CMakeFiles/wibble.dir/build.make wibble/CMakeFiles/wibble.dir/build
make[3]: Entering directory `/build/buildd/libwibble-0.1.22/obj-i486-linux-gnu'
/usr/bin/cmake -E cmake_progress_report /build/buildd/libwibble-0.1.22/obj-i486-linux-gnu/CMakeFiles 1
[ 1%] Building CXX object wibble/CMakeFiles/wibble.dir/exception.o
cd /build/buildd/libwibble-0.1.22/obj-i486-linux-gnu/wibble && /usr/bin/g++ -g -O2 -g -Wall -O2 -I/build/buildd/libwibble-0.1.22/wibble/.. -I/build/buildd/libwibble-0.1.22/obj-i486-linux-gnu/wibble/.. -fPIC -o CMakeFiles/wibble.dir/exception.o -c /build/buildd/libwibble-0.1.22/wibble/exception.cpp
In file included from /build/buildd/libwibble-0.1.22/wibble/../wibble/test.h:3,
from /build/buildd/libwibble-0.1.22/wibble/../wibble/exception.h:25,
from /build/buildd/libwibble-0.1.22/wibble/exception.cpp:20:
/build/buildd/libwibble-0.1.22/wibble/../wibble/string.h: In function 'std::string wibble::str::fmt(std::string, ...)':
/build/buildd/libwibble-0.1.22/wibble/../wibble/string.h:63: error: 'vasprintf' was not declared in this scope
make[3]: *** [wibble/CMakeFiles/wibble.dir/exception.o] Error 1
make[3]: Leaving directory `/build/buildd/libwibble-0.1.22/obj-i486-linux-gnu'
make[2]: *** [wibble/CMakeFiles/wibble.dir/all] Error 2
make[2]: Leaving directory `/build/buildd/libwibble-0.1.22/obj-i486-linux-gnu'
make[1]: *** [all] Error 2
make[1]: Leaving directory `/build/buildd/libwibble-0.1.22/obj-i486-linux-gnu'
make: *** [debian/stamp-makefile-build] Error 2
dpkg-buildpackage: failure: debian/rules build gave error exit status 2
******************************************************************************
Build finished at 20090629-1040
FAILED [dpkg-buildpackage died]
Purging chroot-karmic-autotest/build/buildd/libwibble-0.1.22
------------------------------------------------------------------------------
/usr/bin/sudo dpkg --root=/home/buildd/build-karmic-autotest/chroot-karmic-autotest --purge groff-base libglib2.0-0 m4 libsasl2-2 gettext file libhtml-parser-perl intltool libxmlrpc-core-c3 libtasn1-3 openssl libwww-perl liburi-perl doxygen libhtml-tree-perl autotools-dev po-debconf libk5crypto3 emacsen-common libxml-parser-perl libcroco3 libhtml-tagset-perl libxml2 cmake-data netbase libcurl3-gnutls libkrb5support0 automake libpng12-0 man-db cmake intltool-debian libldap-2.4-2 libcurl3 cdbs libgpg-error0 ca-certificates html2text libgcrypt11 gettext-base debhelper libkeyutils1 libidn11 dh-buildinfo libgnutls26 libmagic1 libsasl2-modules libexpat1 bsdmainutils libkrb5-3 fdupes libgssapi-krb5-2 autoconf
(Reading database ... 12675 files and directories currently installed.)
Removing doxygen ...
Removing libpng12-0 ...
Purging configuration files for libpng12-0 ...
Removing cmake ...
Removing cdbs ...
Removing dh-buildinfo ...
Removing fdupes ...
Removing intltool ...
Removing libxmlrpc-core-c3 ...
Purging configuration files for libxmlrpc-core-c3 ...
Removing libxml-parser-perl ...
Removing cmake-data ...
Purging configuration files for cmake-data ...
Removing libcurl3-gnutls ...
Purging configuration files for libcurl3-gnutls ...
Removing automake ...
Removing libcurl3 ...
Purging configuration files for libcurl3 ...
Removing ca-certificates ...
Removing hash symlinks in /etc/ssl/certs ...done.
Purging configuration files for ca-certificates ...
Removing debhelper ...
Removing libidn11 ...
Purging configuration files for libidn11 ...
Removing libexpat1 ...
Purging configuration files for libexpat1 ...
Removing libgssapi-krb5-2 ...
Purging configuration files for libgssapi-krb5-2 ...
Removing autoconf ...
Purging configuration files for autoconf ...
Removing m4 ...
Removing file ...
Purging configuration files for file ...
Removing openssl ...
Purging configuration files for openssl ...
Removing libwww-perl ...
Removing libhtml-tree-perl ...
Removing autotools-dev ...
Removing po-debconf ...
Removing emacsen-common ...
emacsen-common: Handling removal of emacsen flavor emacs
Purging configuration files for emacsen-common ...
Removing netbase ...
Purging configuration files for netbase ...
Removing man-db ...
Purging configuration files for man-db ...
Removing catpages as well as /var/cache/man hierarchy.
dpkg - warning: while removing man-db, directory `/usr/share/doc/man-db/examples' not empty so not removed.
dpkg - warning: while removing man-db, directory `/usr/share/doc/man-db' not empty so not removed.
dpkg - warning: while removing man-db, directory `/usr/share/man/id/man5' not empty so not removed.
dpkg - warning: while removing man-db, directory `/usr/share/man-db' not empty so not removed.
dpkg - warning: while removing man-db, directory `/usr/share/bug/man-db' not empty so not removed.
dpkg - warning: while removing man-db, directory `/usr/lib/man-db' not empty so not removed.
Removing intltool-debian ...
Removing libldap-2.4-2 ...
Purging configuration files for libldap-2.4-2 ...
Removing html2text ...
Purging configuration files for html2text ...
Removing libgnutls26 ...
Purging configuration files for libgnutls26 ...
Removing libmagic1 ...
Purging configuration files for libmagic1 ...
Removing bsdmainutils ...
Purging configuration files for bsdmainutils ...
Removing libkrb5-3 ...
Purging configuration files for libkrb5-3 ...
Removing groff-base ...
Purging configuration files for groff-base ...
Removing gettext ...
Removing libhtml-parser-perl ...
Removing libtasn1-3 ...
Purging configuration files for libtasn1-3 ...
Removing liburi-perl ...
Removing libk5crypto3 ...
Purging configuration files for libk5crypto3 ...
Removing libcroco3 ...
Purging configuration files for libcroco3 ...
Removing libhtml-tagset-perl ...
Removing libxml2 ...
Purging configuration files for libxml2 ...
Removing libkrb5support0 ...
Purging configuration files for libkrb5support0 ...
Removing libgcrypt11 ...
Purging configuration files for libgcrypt11 ...
Removing gettext-base ...
Removing libkeyutils1 ...
Purging configuration files for libkeyutils1 ...
Removing libglib2.0-0 ...
Purging configuration files for libglib2.0-0 ...
Removing libgpg-error0 ...
Purging configuration files for libgpg-error0 ...
Removing libsasl2-2 ...
Purging configuration files for libsasl2-2 ...
Removing libsasl2-modules ...
Processing triggers for libc6 ...
ldconfig deferred processing now taking place
******************************************************************************
Finished at 20090629-1040
Build needed 00:00:04, 1560k disk space
More information about the ubuntu-autotest
mailing list