Log for failed build of libdc1394_1.1.0-5ubuntu3 (dist=karmic-autotest)
Build Daemon user
noreply at buildd.ubuntu.com
Wed Jul 29 08:56:39 BST 2009
Automatic build of libdc1394_1.1.0-5ubuntu3 on terranova by sbuild/i386 1.170.5
Build started at 20090729-0856
******************************************************************************
Checking available source versions...
Fetching source files...
Reading package lists...
Building dependency tree...
Reading state information...
Need to get 356kB of source archives.
Get:1 http://archive.internal karmic-autotest/main libdc1394 1.1.0-5ubuntu3 (dsc) [1265B]
Get:2 http://archive.internal karmic-autotest/main libdc1394 1.1.0-5ubuntu3 (tar) [350kB]
Get:3 http://archive.internal karmic-autotest/main libdc1394 1.1.0-5ubuntu3 (diff) [5176B]
Fetched 356kB in 0s (7206kB/s)
Download complete and in download only mode
** Using build dependencies supplied by package:
Build-Depends: debhelper (>> 3.0.0), libraw1394-dev, libx11-dev, libxv-dev, x-dev, gcc (>= 3.0.0)
Checking for already installed source dependencies...
debhelper: missing
libraw1394-dev: missing
libx11-dev: missing
libxv-dev: missing
x-dev: missing
gcc: already installed (4:4.4.0-3ubuntu1 >= 3.0.0 is satisfied)
Checking for source dependency conflicts...
/usr/bin/sudo /usr/bin/apt-get --purge $CHROOT_OPTIONS -q -y install debhelper libraw1394-dev libx11-dev libxv-dev x-dev
Reading package lists...
Building dependency tree...
Reading state information...
The following packages were automatically installed and are no longer required:
diffstat patchutils autoconf2.59 quilt m4 autoconf autotools-dev
libvolume-id1
Use 'apt-get autoremove' to remove them.
The following extra packages will be installed:
bsdmainutils file groff-base html2text intltool-debian libmagic1
libpthread-stubs0 libpthread-stubs0-dev libraw1394-11 libx11-6 libx11-data
libxau-dev libxau6 libxcb1 libxcb1-dev libxdmcp-dev libxdmcp6 libxext-dev
libxext6 libxv1 man-db po-debconf x11-common x11proto-core-dev
x11proto-input-dev x11proto-kb-dev x11proto-video-dev x11proto-xext-dev
xtrans-dev
Suggested packages:
wamerican wordlist whois vacation dh-make groff curl wget libraw1394-doc
less www-browser libmail-box-perl
Recommended packages:
libmail-sendmail-perl
The following NEW packages will be installed:
bsdmainutils debhelper file groff-base html2text intltool-debian libmagic1
libpthread-stubs0 libpthread-stubs0-dev libraw1394-11 libraw1394-dev
libx11-6 libx11-data libx11-dev libxau-dev libxau6 libxcb1 libxcb1-dev
libxdmcp-dev libxdmcp6 libxext-dev libxext6 libxv-dev libxv1 man-db
po-debconf x-dev x11-common x11proto-core-dev x11proto-input-dev
x11proto-kb-dev x11proto-video-dev x11proto-xext-dev xtrans-dev
0 upgraded, 34 newly installed, 0 to remove and 0 not upgraded.
Need to get 0B/7574kB of archives.
After this operation, 24.6MB of additional disk space will be used.
WARNING: The following packages cannot be authenticated!
x11-common libxau6 libxdmcp6 libxcb1 libx11-data libx11-6 x11proto-core-dev
libxau-dev libxdmcp-dev x11proto-input-dev x11proto-kb-dev xtrans-dev
libpthread-stubs0 libpthread-stubs0-dev libxcb1-dev libx11-dev libxext6
x11proto-xext-dev libxext-dev libxv1 x11proto-video-dev libxv-dev libmagic1
file bsdmainutils groff-base man-db html2text intltool-debian po-debconf
debhelper libraw1394-11 libraw1394-dev x-dev
debconf: unable to initialize frontend: Dialog
debconf: (Dialog frontend will not work on a dumb terminal, an emacs shell buffer, or without a controlling terminal.)
debconf: falling back to frontend: Readline
debconf: unable to initialize frontend: Readline
debconf: (This frontend requires a controlling tty.)
debconf: falling back to frontend: Teletype
dpkg-preconfigure: unable to re-open stdin:
Authentication warning overridden.
Selecting previously deselected package x11-common.
(Reading database ... 16677 files and directories currently installed.)
Unpacking x11-common (from .../x11-common_1%3a7.4~5ubuntu21_all.deb) ...
Selecting previously deselected package libxau6.
Unpacking libxau6 (from .../libxau6_1%3a1.0.4-2_i386.deb) ...
Selecting previously deselected package libxdmcp6.
Unpacking libxdmcp6 (from .../libxdmcp6_1%3a1.0.2-3_i386.deb) ...
Selecting previously deselected package libxcb1.
Unpacking libxcb1 (from .../libxcb1_1.3-2_i386.deb) ...
Selecting previously deselected package libx11-data.
Unpacking libx11-data (from .../libx11-data_2%3a1.2.1-1ubuntu1_all.deb) ...
Selecting previously deselected package libx11-6.
Unpacking libx11-6 (from .../libx11-6_2%3a1.2.1-1ubuntu1_i386.deb) ...
Setting up x11-common (1:7.4~5ubuntu21) ...
Selecting previously deselected package x11proto-core-dev.
(Reading database ... 17028 files and directories currently installed.)
Unpacking x11proto-core-dev (from .../x11proto-core-dev_7.0.15-1_all.deb) ...
Selecting previously deselected package libxau-dev.
Unpacking libxau-dev (from .../libxau-dev_1%3a1.0.4-2_i386.deb) ...
Selecting previously deselected package libxdmcp-dev.
Unpacking libxdmcp-dev (from .../libxdmcp-dev_1%3a1.0.2-3_i386.deb) ...
Selecting previously deselected package x11proto-input-dev.
Unpacking x11proto-input-dev (from .../x11proto-input-dev_1.5.0-2ubuntu1_all.deb) ...
Selecting previously deselected package x11proto-kb-dev.
Unpacking x11proto-kb-dev (from .../x11proto-kb-dev_1.0.3-3ubuntu1_all.deb) ...
Selecting previously deselected package xtrans-dev.
Unpacking xtrans-dev (from .../xtrans-dev_1.2.3-3_all.deb) ...
Selecting previously deselected package libpthread-stubs0.
Unpacking libpthread-stubs0 (from .../libpthread-stubs0_0.1-2_i386.deb) ...
Selecting previously deselected package libpthread-stubs0-dev.
Unpacking libpthread-stubs0-dev (from .../libpthread-stubs0-dev_0.1-2_i386.deb) ...
Selecting previously deselected package libxcb1-dev.
Unpacking libxcb1-dev (from .../libxcb1-dev_1.3-2_i386.deb) ...
Selecting previously deselected package libx11-dev.
Unpacking libx11-dev (from .../libx11-dev_2%3a1.2.1-1ubuntu1_i386.deb) ...
Selecting previously deselected package libxext6.
Unpacking libxext6 (from .../libxext6_2%3a1.0.99.1-0ubuntu3_i386.deb) ...
Selecting previously deselected package x11proto-xext-dev.
Unpacking x11proto-xext-dev (from .../x11proto-xext-dev_7.0.4-2_all.deb) ...
Selecting previously deselected package libxext-dev.
Unpacking libxext-dev (from .../libxext-dev_2%3a1.0.99.1-0ubuntu3_i386.deb) ...
Selecting previously deselected package libxv1.
Unpacking libxv1 (from .../libxv1_2%3a1.0.4-1_i386.deb) ...
Selecting previously deselected package x11proto-video-dev.
Unpacking x11proto-video-dev (from .../x11proto-video-dev_2.2.2-5ubuntu1_all.deb) ...
Selecting previously deselected package libxv-dev.
Unpacking libxv-dev (from .../libxv-dev_2%3a1.0.4-1_i386.deb) ...
Selecting previously deselected package libmagic1.
Unpacking libmagic1 (from .../libmagic1_5.03-1ubuntu1_i386.deb) ...
Selecting previously deselected package file.
Unpacking file (from .../file_5.03-1ubuntu1_i386.deb) ...
Selecting previously deselected package bsdmainutils.
Unpacking bsdmainutils (from .../bsdmainutils_6.1.10ubuntu4_i386.deb) ...
Selecting previously deselected package groff-base.
Unpacking groff-base (from .../groff-base_1.18.1.1-22build1_i386.deb) ...
Selecting previously deselected package man-db.
Unpacking man-db (from .../man-db_2.5.5-2_i386.deb) ...
Selecting previously deselected package html2text.
Unpacking html2text (from .../html2text_1.3.2a-14_i386.deb) ...
Selecting previously deselected package intltool-debian.
Unpacking intltool-debian (from .../intltool-debian_0.35.0+20060710.1_all.deb) ...
Selecting previously deselected package po-debconf.
Unpacking po-debconf (from .../po-debconf_1.0.16_all.deb) ...
Selecting previously deselected package debhelper.
Unpacking debhelper (from .../debhelper_7.2.14ubuntu1_all.deb) ...
Selecting previously deselected package libraw1394-11.
Unpacking libraw1394-11 (from .../libraw1394-11_2.0.2-2ubuntu1_i386.deb) ...
Selecting previously deselected package libraw1394-dev.
Unpacking libraw1394-dev (from .../libraw1394-dev_2.0.2-2ubuntu1_i386.deb) ...
Selecting previously deselected package x-dev.
Unpacking x-dev (from .../x-dev_7.0.15-1_all.deb) ...
Setting up libxau6 (1:1.0.4-2) ...
Setting up libxdmcp6 (1:1.0.2-3) ...
Setting up libxcb1 (1.3-2) ...
Setting up libx11-data (2:1.2.1-1ubuntu1) ...
Setting up libx11-6 (2:1.2.1-1ubuntu1) ...
Setting up x11proto-core-dev (7.0.15-1) ...
Setting up libxau-dev (1:1.0.4-2) ...
Setting up libxdmcp-dev (1:1.0.2-3) ...
Setting up x11proto-input-dev (1.5.0-2ubuntu1) ...
Setting up x11proto-kb-dev (1.0.3-3ubuntu1) ...
Setting up xtrans-dev (1.2.3-3) ...
Setting up libpthread-stubs0 (0.1-2) ...
Setting up libpthread-stubs0-dev (0.1-2) ...
Setting up libxcb1-dev (1.3-2) ...
Setting up libx11-dev (2:1.2.1-1ubuntu1) ...
Setting up libxext6 (2:1.0.99.1-0ubuntu3) ...
Setting up x11proto-xext-dev (7.0.4-2) ...
Setting up libxext-dev (2:1.0.99.1-0ubuntu3) ...
Setting up libxv1 (2:1.0.4-1) ...
Setting up x11proto-video-dev (2.2.2-5ubuntu1) ...
Setting up libxv-dev (2:1.0.4-1) ...
Setting up libmagic1 (5.03-1ubuntu1) ...
Setting up file (5.03-1ubuntu1) ...
Setting up bsdmainutils (6.1.10ubuntu4) ...
Setting up groff-base (1.18.1.1-22build1) ...
Setting up man-db (2.5.5-2) ...
Building database of manual pages ...
... skipping, since this is a buildd
Setting up html2text (1.3.2a-14) ...
Setting up intltool-debian (0.35.0+20060710.1) ...
Setting up po-debconf (1.0.16) ...
Setting up debhelper (7.2.14ubuntu1) ...
Setting up libraw1394-11 (2.0.2-2ubuntu1) ...
Creating device node /dev/raw1394... done.
Setting up libraw1394-dev (2.0.2-2ubuntu1) ...
Setting up x-dev (7.0.15-1) ...
Processing triggers for libc6 ...
ldconfig deferred processing now taking place
Checking correctness of source dependencies...
Toolchain package versions: libc6-dev_2.9-9ubuntu2 make_3.81-5 dpkg-dev_1.14.24ubuntu2 linux-libc-dev_2.6.30-8.9 g++-4.4_4.4.0-11ubuntu1core2 gcc-4.4_4.4.0-11ubuntu1core2 binutils_2.19.51.20090515-0ubuntu1 libstdc++6_4.4.0-11ubuntu1core2 libstdc++6-4.4-dev_4.4.0-11ubuntu1core2
------------------------------------------------------------------------------
sh: gcc: not found
dpkg-source: warning: Couldn't determine gcc system type, falling back to default (native compilation)
gpg: Signature made Thu Feb 19 13:06:48 2009 GMT using DSA key ID DD4D5088
gpg: Can't check signature: public key not found
dpkg-source: extracting libdc1394 in libdc1394-1.1.0
dpkg-source: unpacking libdc1394_1.1.0.orig.tar.gz
dpkg-source: applying /home/buildd/build-karmic-autotest/libdc1394_1.1.0-5ubuntu3.diff.gz
dpkg-buildpackage: set CFLAGS to default value: -g -O2
dpkg-buildpackage: set CPPFLAGS to default value:
dpkg-buildpackage: set LDFLAGS to default value: -Wl,-Bsymbolic-functions
dpkg-buildpackage: set FFLAGS to default value: -g -O2
dpkg-buildpackage: set CXXFLAGS to default value: -g -O2
dpkg-buildpackage: source package libdc1394
dpkg-buildpackage: source version 1.1.0-5ubuntu3
dpkg-buildpackage: host architecture i386
/usr/bin/fakeroot debian/rules clean
dh_testdir
dh_testroot
rm -f build-stamp configure-stamp
# Add here commands to clean up after the build process.
/usr/bin/make distclean
make[1]: Entering directory `/build/buildd/libdc1394-1.1.0'
make[1]: *** No rule to make target `distclean'. Stop.
make[1]: Leaving directory `/build/buildd/libdc1394-1.1.0'
make: [clean] Error 2 (ignored)
dh_clean
dh_clean: Compatibility levels before 5 are deprecated.
debian/rules build
dh_testdir
# Add here commands to configure the package.
./configure --prefix=/usr --mandir=\${prefix}/share/man --infodir=\${prefix}/share/info --with-x --x-includes=/usr/X11R6/include --x-libraries=/usr/X11R6/lib
checking for a BSD-compatible install... /usr/bin/install -c
checking whether build environment is sane... yes
checking whether make sets $(MAKE)... yes
checking for working aclocal-1.4... missing
checking for working autoconf... found
checking for working automake-1.4... missing
checking for working autoheader... found
checking for working makeinfo... missing
checking for gcc... gcc
checking for C compiler default output file name... a.out
checking whether the C compiler works... yes
checking whether we are cross compiling... no
checking for suffix of executables...
checking for suffix of object files... o
checking whether we are using the GNU C compiler... yes
checking whether gcc accepts -g... yes
checking for gcc option to accept ANSI C... none needed
checking build system type... i686-pc-linux-gnu
checking host system type... i686-pc-linux-gnu
checking for a sed that does not truncate output... /bin/sed
checking for egrep... grep -E
checking for ld used by gcc... /usr/bin/ld
checking if the linker (/usr/bin/ld) is GNU ld... yes
checking for /usr/bin/ld option to reload object files... -r
checking for BSD-compatible nm... /usr/bin/nm -B
checking whether ln -s works... yes
checking how to recognise dependent libraries... pass_all
checking how to run the C preprocessor... gcc -E
checking for ANSI C header files... yes
checking for sys/types.h... yes
checking for sys/stat.h... yes
checking for stdlib.h... yes
checking for string.h... yes
checking for memory.h... yes
checking for strings.h... yes
checking for inttypes.h... yes
checking for stdint.h... yes
checking for unistd.h... yes
checking dlfcn.h usability... yes
checking dlfcn.h presence... yes
checking for dlfcn.h... yes
checking for g++... g++
checking whether we are using the GNU C++ compiler... yes
checking whether g++ accepts -g... yes
checking how to run the C++ preprocessor... g++ -E
checking for g77... no
checking for f77... no
checking for xlf... no
checking for frt... no
checking for pgf77... no
checking for fort77... no
checking for fl32... no
checking for af77... no
checking for f90... no
checking for xlf90... no
checking for pgf90... no
checking for epcf90... no
checking for f95... no
checking for fort... no
checking for xlf95... no
checking for ifc... no
checking for efc... no
checking for pgf95... no
checking for lf95... no
checking for gfortran... no
checking whether we are using the GNU Fortran 77 compiler... no
checking whether accepts -g... no
checking the maximum length of command line arguments... 32768
checking command to parse /usr/bin/nm -B output from gcc object... ok
checking for objdir... .libs
checking for ar... ar
checking for ranlib... ranlib
checking for strip... strip
checking if gcc static flag works... yes
checking if gcc supports -fno-rtti -fno-exceptions... no
checking for gcc option to produce PIC... -fPIC
checking if gcc PIC flag -fPIC works... yes
checking if gcc supports -c -o file.o... yes
checking whether the gcc linker (/usr/bin/ld) supports shared libraries... yes
checking whether -lc should be explicitly linked in... no
checking dynamic linker characteristics... GNU/Linux ld.so
checking how to hardcode library paths into programs... immediate
checking whether stripping libraries is possible... yes
checking if libtool supports shared libraries... yes
checking whether to build shared libraries... yes
checking whether to build static libraries... yes
configure: creating libtool
appending configuration tag "CXX" to libtool
checking for ld used by g++... /usr/bin/ld
checking if the linker (/usr/bin/ld) is GNU ld... yes
checking whether the g++ linker (/usr/bin/ld) supports shared libraries... yes
checking for g++ option to produce PIC... -fPIC
checking if g++ PIC flag -fPIC works... yes
checking if g++ supports -c -o file.o... yes
checking whether the g++ linker (/usr/bin/ld) supports shared libraries... yes
checking dynamic linker characteristics... GNU/Linux ld.so
checking how to hardcode library paths into programs... immediate
checking whether stripping libraries is possible... yes
appending configuration tag "F77" to libtool
checking for raw1394_new_handle in -lraw1394... yes
checking for ANSI C header files... (cached) yes
checking fcntl.h usability... yes
checking fcntl.h presence... yes
checking for fcntl.h... yes
checking sys/ioctl.h usability... yes
checking sys/ioctl.h presence... yes
checking for sys/ioctl.h... yes
checking for unistd.h... (cached) yes
checking for X... libraries /usr/X11R6/lib, headers /usr/X11R6/include
checking for gethostbyname... yes
checking for connect... yes
checking for remove... yes
checking for shmat... yes
checking for IceConnectionNumber in -lICE... no
checking for size_t... yes
checking for stdlib.h... (cached) yes
checking for unistd.h... (cached) yes
checking for getpagesize... yes
checking for working mmap... yes
configure: creating ./config.status
config.status: creating Makefile
config.status: creating libdc1394/Makefile
config.status: creating examples/Makefile
config.status: creating config.h
config.status: executing default-1 commands
touch configure-stamp
dh_testdir
# Add here commands to compile the package.
/usr/bin/make
make[1]: Entering directory `/build/buildd/libdc1394-1.1.0'
/usr/bin/make all-recursive
make[2]: Entering directory `/build/buildd/libdc1394-1.1.0'
Making all in libdc1394
make[3]: Entering directory `/build/buildd/libdc1394-1.1.0/libdc1394'
/bin/bash ../libtool --mode=compile gcc -DHAVE_CONFIG_H -I. -I. -I.. -g -O2 -Wall -Wunused -c dc1394_control.c
mkdir .libs
gcc -DHAVE_CONFIG_H -I. -I. -I.. -g -O2 -Wall -Wunused -c dc1394_control.c -fPIC -DPIC -o .libs/dc1394_control.o
dc1394_control.c: In function 'dc1394_get_camera_misc_info':
dc1394_control.c:1351: warning: pointer targets in passing argument 3 of 'dc1394_get_iso_channel_and_speed' differ in signedness
dc1394_control.h:578: note: expected 'unsigned int *' but argument is of type 'int *'
dc1394_control.c:1351: warning: pointer targets in passing argument 4 of 'dc1394_get_iso_channel_and_speed' differ in signedness
dc1394_control.h:578: note: expected 'unsigned int *' but argument is of type 'int *'
dc1394_control.c:1354: warning: pointer targets in passing argument 3 of 'dc1394_get_video_format' differ in signedness
dc1394_control.h:566: note: expected 'unsigned int *' but argument is of type 'int *'
dc1394_control.c:1357: warning: pointer targets in passing argument 3 of 'dc1394_get_video_mode' differ in signedness
dc1394_control.h:560: note: expected 'unsigned int *' but argument is of type 'int *'
dc1394_control.c:1360: warning: pointer targets in passing argument 3 of 'dc1394_get_video_framerate' differ in signedness
dc1394_control.h:554: note: expected 'unsigned int *' but argument is of type 'int *'
dc1394_control.c:1378: warning: pointer targets in passing argument 3 of 'dc1394_get_memory_load_ch' differ in signedness
dc1394_control.h:967: note: expected 'unsigned int *' but argument is of type 'int *'
dc1394_control.c:1382: warning: pointer targets in passing argument 3 of 'dc1394_get_memory_save_ch' differ in signedness
dc1394_control.h:971: note: expected 'unsigned int *' but argument is of type 'int *'
gcc -DHAVE_CONFIG_H -I. -I. -I.. -g -O2 -Wall -Wunused -c dc1394_control.c -o dc1394_control.o >/dev/null 2>&1
/bin/bash ../libtool --mode=compile gcc -DHAVE_CONFIG_H -I. -I. -I.. -g -O2 -Wall -Wunused -c dc1394_capture.c
gcc -DHAVE_CONFIG_H -I. -I. -I.. -g -O2 -Wall -Wunused -c dc1394_capture.c -fPIC -DPIC -o .libs/dc1394_capture.o
dc1394_capture.c: In function 'dc1394_multi_capture':
dc1394_capture.c:440: warning: implicit declaration of function 'raw1394_set_iso_handler'
dc1394_capture.c:449: warning: implicit declaration of function 'raw1394_stop_iso_rcv'
dc1394_capture.c:462: warning: implicit declaration of function 'raw1394_start_iso_rcv'
gcc -DHAVE_CONFIG_H -I. -I. -I.. -g -O2 -Wall -Wunused -c dc1394_capture.c -o dc1394_capture.o >/dev/null 2>&1
/bin/bash ../libtool --mode=compile gcc -DHAVE_CONFIG_H -I. -I. -I.. -g -O2 -Wall -Wunused -c dc1394_format7.c
gcc -DHAVE_CONFIG_H -I. -I. -I.. -g -O2 -Wall -Wunused -c dc1394_format7.c -fPIC -DPIC -o .libs/dc1394_format7.o
dc1394_format7.c: In function '_dc1394_v130_handshake':
dc1394_format7.c:229: warning: pointer targets in passing argument 4 of 'dc1394_query_format7_value_setting' differ in signedness
dc1394_control.h:1183: note: expected 'unsigned int *' but argument is of type 'int *'
dc1394_format7.c:229: warning: pointer targets in passing argument 5 of 'dc1394_query_format7_value_setting' differ in signedness
dc1394_control.h:1183: note: expected 'unsigned int *' but argument is of type 'int *'
dc1394_format7.c:229: warning: pointer targets in passing argument 6 of 'dc1394_query_format7_value_setting' differ in signedness
dc1394_control.h:1183: note: expected 'unsigned int *' but argument is of type 'int *'
dc1394_format7.c:229: warning: pointer targets in passing argument 7 of 'dc1394_query_format7_value_setting' differ in signedness
dc1394_control.h:1183: note: expected 'unsigned int *' but argument is of type 'int *'
dc1394_format7.c:251: warning: pointer targets in passing argument 4 of 'dc1394_query_format7_value_setting' differ in signedness
dc1394_control.h:1183: note: expected 'unsigned int *' but argument is of type 'int *'
dc1394_format7.c:251: warning: pointer targets in passing argument 5 of 'dc1394_query_format7_value_setting' differ in signedness
dc1394_control.h:1183: note: expected 'unsigned int *' but argument is of type 'int *'
dc1394_format7.c:251: warning: pointer targets in passing argument 6 of 'dc1394_query_format7_value_setting' differ in signedness
dc1394_control.h:1183: note: expected 'unsigned int *' but argument is of type 'int *'
dc1394_format7.c:251: warning: pointer targets in passing argument 7 of 'dc1394_query_format7_value_setting' differ in signedness
dc1394_control.h:1183: note: expected 'unsigned int *' but argument is of type 'int *'
dc1394_format7.c: In function '_dc1394_v130_errflag2':
dc1394_format7.c:282: warning: pointer targets in passing argument 4 of 'dc1394_query_format7_value_setting' differ in signedness
dc1394_control.h:1183: note: expected 'unsigned int *' but argument is of type 'int *'
dc1394_format7.c:282: warning: pointer targets in passing argument 5 of 'dc1394_query_format7_value_setting' differ in signedness
dc1394_control.h:1183: note: expected 'unsigned int *' but argument is of type 'int *'
dc1394_format7.c:282: warning: pointer targets in passing argument 6 of 'dc1394_query_format7_value_setting' differ in signedness
dc1394_control.h:1183: note: expected 'unsigned int *' but argument is of type 'int *'
dc1394_format7.c:282: warning: pointer targets in passing argument 7 of 'dc1394_query_format7_value_setting' differ in signedness
dc1394_control.h:1183: note: expected 'unsigned int *' but argument is of type 'int *'
dc1394_format7.c: In function '_dc1394_basic_format7_setup':
dc1394_format7.c:396: warning: pointer targets in passing argument 4 of 'dc1394_query_format7_byte_per_packet' differ in signedness
dc1394_control.h:1159: note: expected 'unsigned int *' but argument is of type 'int *'
dc1394_format7.c:558: warning: pointer targets in passing argument 4 of 'dc1394_query_format7_packet_per_frame' differ in signedness
dc1394_control.h:1204: note: expected 'unsigned int *' but argument is of type 'int *'
dc1394_format7.c:568: warning: pointer targets in passing argument 4 of 'dc1394_query_format7_color_coding_id' differ in signedness
dc1394_control.h:1138: note: expected 'unsigned int *' but argument is of type 'int *'
gcc -DHAVE_CONFIG_H -I. -I. -I.. -g -O2 -Wall -Wunused -c dc1394_format7.c -o dc1394_format7.o >/dev/null 2>&1
/bin/bash ../libtool --mode=compile gcc -DHAVE_CONFIG_H -I. -I. -I.. -g -O2 -Wall -Wunused -c dc1394_absolute.c
gcc -DHAVE_CONFIG_H -I. -I. -I.. -g -O2 -Wall -Wunused -c dc1394_absolute.c -fPIC -DPIC -o .libs/dc1394_absolute.o
dc1394_absolute.c: In function 'dc1394_set_absolute_feature_value':
dc1394_absolute.c:152: warning: dereferencing pointer 'value.41' does break strict-aliasing rules
dc1394_absolute.c:246: note: initialized from here
gcc -DHAVE_CONFIG_H -I. -I. -I.. -g -O2 -Wall -Wunused -c dc1394_absolute.c -o dc1394_absolute.o >/dev/null 2>&1
/bin/bash ../libtool --mode=link gcc -g -O2 -Wall -Wunused -Wl,-Bsymbolic-functions -o libdc1394_control.la -rpath /usr/lib -version-info 13:0:0 dc1394_control.lo dc1394_capture.lo dc1394_format7.lo dc1394_absolute.lo -lraw1394
gcc -shared .libs/dc1394_control.o .libs/dc1394_capture.o .libs/dc1394_format7.o .libs/dc1394_absolute.o /usr/lib/libraw1394.so -Wl,-Bsymbolic-functions -Wl,-soname -Wl,libdc1394_control.so.13 -o .libs/libdc1394_control.so.13.0.0
(cd .libs && rm -f libdc1394_control.so.13 && ln -s libdc1394_control.so.13.0.0 libdc1394_control.so.13)
(cd .libs && rm -f libdc1394_control.so && ln -s libdc1394_control.so.13.0.0 libdc1394_control.so)
ar cru .libs/libdc1394_control.a dc1394_control.o dc1394_capture.o dc1394_format7.o dc1394_absolute.o
ranlib .libs/libdc1394_control.a
creating libdc1394_control.la
(cd .libs && rm -f libdc1394_control.la && ln -s ../libdc1394_control.la libdc1394_control.la)
make[3]: Leaving directory `/build/buildd/libdc1394-1.1.0/libdc1394'
Making all in examples
make[3]: Entering directory `/build/buildd/libdc1394-1.1.0/examples'
gcc -DHAVE_CONFIG_H -I. -I. -I.. -g -O2 -Wall -Wunused -c dc1394_vloopback.c
dc1394_vloopback.c: In function 'v4l_open':
dc1394_vloopback.c:601: warning: ignoring return value of 'fgets', declared with attribute warn_unused_result
dc1394_vloopback.c:604: warning: ignoring return value of 'fgets', declared with attribute warn_unused_result
dc1394_vloopback.c: In function 'main':
dc1394_vloopback.c:1008: warning: pointer targets in passing argument 2 of 'capture_pipe' differ in signedness
dc1394_vloopback.c:322: note: expected 'const unsigned char *' but argument is of type 'char *'
gcc -DHAVE_CONFIG_H -I. -I. -I.. -g -O2 -Wall -Wunused -c affine.c
/bin/bash ../libtool --mode=link gcc -g -O2 -Wall -Wunused -Wl,-Bsymbolic-functions -o dc1394_vloopback dc1394_vloopback.o affine.o -lm ../libdc1394/libdc1394_control.la -lraw1394 -lraw1394
mkdir .libs
gcc -g -O2 -Wall -Wunused -Wl,-Bsymbolic-functions -o .libs/dc1394_vloopback dc1394_vloopback.o affine.o -lm ../libdc1394/.libs/libdc1394_control.so /usr/lib/libraw1394.so
../libdc1394/.libs/libdc1394_control.so: undefined reference to `raw1394_set_iso_handler'
../libdc1394/.libs/libdc1394_control.so: undefined reference to `raw1394_stop_iso_rcv'
../libdc1394/.libs/libdc1394_control.so: undefined reference to `raw1394_start_iso_rcv'
collect2: ld returned 1 exit status
make[3]: *** [dc1394_vloopback] Error 1
make[3]: Leaving directory `/build/buildd/libdc1394-1.1.0/examples'
make[2]: *** [all-recursive] Error 1
make[2]: Leaving directory `/build/buildd/libdc1394-1.1.0'
make[1]: *** [all-recursive-am] Error 2
make[1]: Leaving directory `/build/buildd/libdc1394-1.1.0'
make: *** [build-stamp] Error 2
dpkg-buildpackage: failure: debian/rules build gave error exit status 2
******************************************************************************
Build finished at 20090729-0856
FAILED [dpkg-buildpackage died]
Purging chroot-karmic-autotest/build/buildd/libdc1394-1.1.0
------------------------------------------------------------------------------
/usr/bin/sudo dpkg --root=/home/buildd/build-karmic-autotest/chroot-karmic-autotest --purge intltool-debian groff-base xtrans-dev libxv-dev libx11-data libxdmcp-dev libxcb1 x11proto-input-dev x11proto-core-dev file libxext-dev libpthread-stubs0-dev libxv1 libxcb1-dev libxau-dev html2text libxdmcp6 debhelper libpthread-stubs0 x11-common po-debconf libraw1394-11 libx11-dev libmagic1 libxext6 x11proto-video-dev x11proto-xext-dev bsdmainutils x-dev libxau6 man-db libx11-6 x11proto-kb-dev libraw1394-dev
(Reading database ... 18952 files and directories currently installed.)
Removing libxv-dev ...
Removing libxext-dev ...
Removing libxv1 ...
Purging configuration files for libxv1 ...
Removing debhelper ...
Removing po-debconf ...
Removing libx11-dev ...
Removing libxext6 ...
Purging configuration files for libxext6 ...
Removing x11proto-video-dev ...
Removing x11proto-xext-dev ...
Removing x-dev ...
Removing man-db ...
Purging configuration files for man-db ...
Removing catpages as well as /var/cache/man hierarchy.
dpkg - warning: while removing man-db, directory `/usr/share/doc/man-db/examples' not empty so not removed.
dpkg - warning: while removing man-db, directory `/usr/share/doc/man-db' not empty so not removed.
dpkg - warning: while removing man-db, directory `/usr/share/man/id/man5' not empty so not removed.
dpkg - warning: while removing man-db, directory `/usr/share/man-db' not empty so not removed.
dpkg - warning: while removing man-db, directory `/usr/share/bug/man-db' not empty so not removed.
dpkg - warning: while removing man-db, directory `/usr/lib/man-db' not empty so not removed.
Removing libx11-6 ...
Purging configuration files for libx11-6 ...
Removing x11proto-kb-dev ...
Removing libraw1394-dev ...
Removing intltool-debian ...
Removing groff-base ...
Purging configuration files for groff-base ...
Removing xtrans-dev ...
Removing libx11-data ...
Removing x11proto-input-dev ...
Removing file ...
Purging configuration files for file ...
Removing libxcb1-dev ...
Removing libxau-dev ...
Removing html2text ...
Purging configuration files for html2text ...
Removing libraw1394-11 ...
Purging configuration files for libraw1394-11 ...
Removing libmagic1 ...
Purging configuration files for libmagic1 ...
Removing bsdmainutils ...
Purging configuration files for bsdmainutils ...
Removing libxdmcp-dev ...
Removing libxcb1 ...
Purging configuration files for libxcb1 ...
Removing x11proto-core-dev ...
Removing libpthread-stubs0-dev ...
Removing libxdmcp6 ...
Purging configuration files for libxdmcp6 ...
Removing libpthread-stubs0 ...
Removing x11-common ...
Purging configuration files for x11-common ...
dpkg - warning: while removing x11-common, directory `/usr/X11R6' not empty so not removed.
dpkg - warning: while removing x11-common, directory `/etc/X11' not empty so not removed.
Removing libxau6 ...
Purging configuration files for libxau6 ...
Processing triggers for libc6 ...
ldconfig deferred processing now taking place
******************************************************************************
Finished at 20090729-0856
Build needed 00:00:15, 2932k disk space
More information about the ubuntu-autotest
mailing list