Log for failed build of python-qt3_3.17.6-2 (dist=karmic-autotest)
Build Daemon user
noreply at buildd.ubuntu.com
Mon Jul 27 20:09:18 BST 2009
Automatic build of python-qt3_3.17.6-2 on terranova by sbuild/i386 1.170.5
Build started at 20090727-2007
******************************************************************************
Checking available source versions...
Fetching source files...
Reading package lists...
Building dependency tree...
Reading state information...
NOTICE: 'python-qt3' packaging is maintained in the 'Svn' version control system at:
svn://svn.debian.org/python-modules/packages/python-qt3/trunk/
Need to get 827kB of source archives.
Get:1 http://archive.internal karmic-autotest/main python-qt3 3.17.6-2 (dsc) [1756B]
Get:2 http://archive.internal karmic-autotest/main python-qt3 3.17.6-2 (tar) [813kB]
Get:3 http://archive.internal karmic-autotest/main python-qt3 3.17.6-2 (diff) [12.0kB]
Fetched 827kB in 0s (10.9MB/s)
Download complete and in download only mode
** Using build dependencies supplied by package:
Build-Depends: debhelper (>= 5.0.38), python-all-dev (>= 2.3.5-10), libqt3-mt-dev (>= 3:3.3.4-4), qt3-dev-tools (>= 3:3.3.4-4), qt3-apps-dev (>= 3:3.3.4-4), sip4 (>= 4.7.9), python-sip4-dev (>= 4.7.9), libqscintilla-dev (>= 1.7), python-support (>= 0.7.1), dpatch, python-sip4-dbg, python-all-dbg
Checking for already installed source dependencies...
debhelper: missing
python-all-dev: missing
libqt3-mt-dev: missing
qt3-dev-tools: missing
qt3-apps-dev: missing
sip4: missing
python-sip4-dev: missing
libqscintilla-dev: missing
python-support: already installed (1.0.3ubuntu1 >= 0.7.1 is satisfied)
dpatch: missing
python-sip4-dbg: missing
python-all-dbg: missing
Checking for source dependency conflicts...
/usr/bin/sudo /usr/bin/apt-get --purge $CHROOT_OPTIONS -q -y install debhelper python-all-dev libqt3-mt-dev qt3-dev-tools qt3-apps-dev sip4 python-sip4-dev libqscintilla-dev dpatch python-sip4-dbg python-all-dbg
Reading package lists...
Building dependency tree...
Reading state information...
The following packages were automatically installed and are no longer required:
diffstat autoconf2.59 quilt m4 autoconf autotools-dev libvolume-id1
Use 'apt-get autoremove' to remove them.
The following extra packages will be installed:
bsdmainutils comerr-dev defoma file fontconfig fontconfig-config groff-base
html2text intltool-debian libaudio-dev libaudio2 libcups2 libcups2-dev
libcupsys2-dev libdrm2 libexpat1 libexpat1-dev libfontconfig1
libfontconfig1-dev libfreetype6 libfreetype6-dev libgcrypt11 libgcrypt11-dev
libgl1-mesa-dev libgl1-mesa-glx libglu1-mesa libglu1-mesa-dev libgnutls-dev
libgnutls26 libgpg-error-dev libgpg-error0 libgssapi-krb5-2 libgssrpc4
libice-dev libice6 libjpeg62 libjpeg62-dev libk5crypto3 libkadm5srv6
libkdb5-4 libkeyutils1 libkrb5-3 libkrb5-dev libkrb5support0 liblcms1
liblcms1-dev libmagic1 libmng-dev libmng1 libnewt0.52 libpng12-0
libpng12-dev libpopt0 libpthread-stubs0 libpthread-stubs0-dev libpython2.6
libqscintilla7 libqt3-headers libqt3-mt libsm-dev libsm6 libtasn1-3
libtasn1-3-dev libx11-6 libx11-data libx11-dev libxau-dev libxau6 libxcb1
libxcb1-dev libxcursor-dev libxcursor1 libxdamage1 libxdmcp-dev libxdmcp6
libxext-dev libxext6 libxfixes-dev libxfixes3 libxft-dev libxft2 libxi-dev
libxi6 libxinerama-dev libxinerama1 libxmu-dev libxmu-headers libxmu6
libxrandr-dev libxrandr2 libxrender-dev libxrender1 libxt-dev libxt6
libxxf86vm1 man-db mesa-common-dev pkg-config po-debconf python-all
python-dbg python-dev python-sip4 python2.5 python2.5-dbg python2.5-dev
python2.5-minimal python2.6-dbg python2.6-dev ttf-dejavu ttf-dejavu-core
ttf-dejavu-extra ucf whiptail x11-common x11proto-core-dev
x11proto-fixes-dev x11proto-input-dev x11proto-kb-dev x11proto-randr-dev
x11proto-render-dev x11proto-xext-dev x11proto-xinerama-dev xtrans-dev
zlib1g-dev
Suggested packages:
wamerican wordlist whois vacation doc-base dh-make defoma-doc psfontmgr
x-ttcidfont-conf dfontmgr libft-perl curl groff nas cups-common rng-tools
libgcrypt11-doc gnutls-doc gnutls-bin guile-gnutls krb5-doc krb5-user
liblcms-utils libqt3-mt-mysql libqt3-mt-odbc libqt3-mt-psql libqt3-i18n
qt3-doc less www-browser libmail-box-perl python2.5-doc python-profiler
python-gdbm-dbg python-tk-dbg binfmt-support
Recommended packages:
libgl1-mesa-dri libfribidi0 libqt3-compat-headers libmail-sendmail-perl
The following NEW packages will be installed:
bsdmainutils comerr-dev debhelper defoma dpatch file fontconfig
fontconfig-config groff-base html2text intltool-debian libaudio-dev
libaudio2 libcups2 libcups2-dev libcupsys2-dev libdrm2 libexpat1
libexpat1-dev libfontconfig1 libfontconfig1-dev libfreetype6
libfreetype6-dev libgcrypt11 libgcrypt11-dev libgl1-mesa-dev libgl1-mesa-glx
libglu1-mesa libglu1-mesa-dev libgnutls-dev libgnutls26 libgpg-error-dev
libgpg-error0 libgssapi-krb5-2 libgssrpc4 libice-dev libice6 libjpeg62
libjpeg62-dev libk5crypto3 libkadm5srv6 libkdb5-4 libkeyutils1 libkrb5-3
libkrb5-dev libkrb5support0 liblcms1 liblcms1-dev libmagic1 libmng-dev
libmng1 libnewt0.52 libpng12-0 libpng12-dev libpopt0 libpthread-stubs0
libpthread-stubs0-dev libpython2.6 libqscintilla-dev libqscintilla7
libqt3-headers libqt3-mt libqt3-mt-dev libsm-dev libsm6 libtasn1-3
libtasn1-3-dev libx11-6 libx11-data libx11-dev libxau-dev libxau6 libxcb1
libxcb1-dev libxcursor-dev libxcursor1 libxdamage1 libxdmcp-dev libxdmcp6
libxext-dev libxext6 libxfixes-dev libxfixes3 libxft-dev libxft2 libxi-dev
libxi6 libxinerama-dev libxinerama1 libxmu-dev libxmu-headers libxmu6
libxrandr-dev libxrandr2 libxrender-dev libxrender1 libxt-dev libxt6
libxxf86vm1 man-db mesa-common-dev pkg-config po-debconf python-all
python-all-dbg python-all-dev python-dbg python-dev python-sip4
python-sip4-dbg python-sip4-dev python2.5 python2.5-dbg python2.5-dev
python2.5-minimal python2.6-dbg python2.6-dev qt3-apps-dev qt3-dev-tools
sip4 ttf-dejavu ttf-dejavu-core ttf-dejavu-extra ucf whiptail x11-common
x11proto-core-dev x11proto-fixes-dev x11proto-input-dev x11proto-kb-dev
x11proto-randr-dev x11proto-render-dev x11proto-xext-dev
x11proto-xinerama-dev xtrans-dev zlib1g-dev
0 upgraded, 136 newly installed, 0 to remove and 0 not upgraded.
Need to get 0B/61.2MB of archives.
After this operation, 182MB of additional disk space will be used.
WARNING: The following packages cannot be authenticated!
x11-common libice6 x11proto-core-dev libice-dev libsm6 libsm-dev libxau6
libxdmcp6 libxcb1 libx11-data libx11-6 libxau-dev libxdmcp-dev
x11proto-input-dev x11proto-kb-dev xtrans-dev libpthread-stubs0
libpthread-stubs0-dev libxcb1-dev libx11-dev libxfixes3 libxrender1
libxcursor1 x11proto-render-dev libxrender-dev x11proto-xext-dev
x11proto-fixes-dev libxfixes-dev libxcursor-dev libxext6 libxext-dev
libexpat1 libfreetype6 ucf libnewt0.52 libpopt0 whiptail libmagic1 file
defoma ttf-dejavu-core ttf-dejavu-extra ttf-dejavu fontconfig-config
libfontconfig1 libxft2 libexpat1-dev zlib1g-dev libfreetype6-dev pkg-config
libfontconfig1-dev libxft-dev libxi6 libxi-dev libxinerama1
x11proto-xinerama-dev libxinerama-dev libxmu-headers libxrandr2
x11proto-randr-dev libxrandr-dev libxt6 libxt-dev libgpg-error0 libgcrypt11
libtasn1-3 libgnutls26 libkeyutils1 libkrb5support0 libk5crypto3 libkrb5-3
libgssapi-krb5-2 bsdmainutils groff-base man-db html2text intltool-debian
po-debconf debhelper dpatch fontconfig libaudio2 libcups2 libgpg-error-dev
libgcrypt11-dev libtasn1-3-dev libgnutls-dev libgssrpc4 libkdb5-4
libkadm5srv6 comerr-dev libkrb5-dev libcups2-dev libcupsys2-dev libdrm2
libxdamage1 libxxf86vm1 libgl1-mesa-glx libglu1-mesa mesa-common-dev
libgl1-mesa-dev libglu1-mesa-dev libjpeg62 libjpeg62-dev liblcms1
liblcms1-dev libmng1 libmng-dev libpng12-0 libpng12-dev libpython2.6
libqt3-mt libqscintilla7 libqscintilla-dev libqt3-headers libaudio-dev
libxmu6 libxmu-dev qt3-dev-tools libqt3-mt-dev python2.5-minimal python2.5
python-all python2.6-dev python-dev python2.5-dev python-all-dev python-sip4
python-sip4-dev qt3-apps-dev sip4 python2.6-dbg python-dbg python2.5-dbg
python-all-dbg python-sip4-dbg
debconf: unable to initialize frontend: Dialog
debconf: (Dialog frontend will not work on a dumb terminal, an emacs shell buffer, or without a controlling terminal.)
debconf: falling back to frontend: Readline
debconf: unable to initialize frontend: Readline
debconf: (This frontend requires a controlling tty.)
debconf: falling back to frontend: Teletype
dpkg-preconfigure: unable to re-open stdin:
Authentication warning overridden.
Selecting previously deselected package x11-common.
(Reading database ... 16677 files and directories currently installed.)
Unpacking x11-common (from .../x11-common_1%3a7.4~5ubuntu21_all.deb) ...
Selecting previously deselected package libice6.
Unpacking libice6 (from .../libice6_2%3a1.0.5-1_i386.deb) ...
Setting up x11-common (1:7.4~5ubuntu21) ...
Selecting previously deselected package x11proto-core-dev.
(Reading database ... 16759 files and directories currently installed.)
Unpacking x11proto-core-dev (from .../x11proto-core-dev_7.0.15-1_all.deb) ...
Selecting previously deselected package libice-dev.
Unpacking libice-dev (from .../libice-dev_2%3a1.0.5-1_i386.deb) ...
Selecting previously deselected package libsm6.
Unpacking libsm6 (from .../libsm6_2%3a1.1.0-2_i386.deb) ...
Selecting previously deselected package libsm-dev.
Unpacking libsm-dev (from .../libsm-dev_2%3a1.1.0-2_i386.deb) ...
Selecting previously deselected package libxau6.
Unpacking libxau6 (from .../libxau6_1%3a1.0.4-2_i386.deb) ...
Selecting previously deselected package libxdmcp6.
Unpacking libxdmcp6 (from .../libxdmcp6_1%3a1.0.2-3_i386.deb) ...
Selecting previously deselected package libxcb1.
Unpacking libxcb1 (from .../libxcb1_1.3-2_i386.deb) ...
Selecting previously deselected package libx11-data.
Unpacking libx11-data (from .../libx11-data_2%3a1.2.1-1ubuntu1_all.deb) ...
Selecting previously deselected package libx11-6.
Unpacking libx11-6 (from .../libx11-6_2%3a1.2.1-1ubuntu1_i386.deb) ...
Selecting previously deselected package libxau-dev.
Unpacking libxau-dev (from .../libxau-dev_1%3a1.0.4-2_i386.deb) ...
Selecting previously deselected package libxdmcp-dev.
Unpacking libxdmcp-dev (from .../libxdmcp-dev_1%3a1.0.2-3_i386.deb) ...
Selecting previously deselected package x11proto-input-dev.
Unpacking x11proto-input-dev (from .../x11proto-input-dev_1.5.0-2ubuntu1_all.deb) ...
Selecting previously deselected package x11proto-kb-dev.
Unpacking x11proto-kb-dev (from .../x11proto-kb-dev_1.0.3-3ubuntu1_all.deb) ...
Selecting previously deselected package xtrans-dev.
Unpacking xtrans-dev (from .../xtrans-dev_1.2.3-3_all.deb) ...
Selecting previously deselected package libpthread-stubs0.
Unpacking libpthread-stubs0 (from .../libpthread-stubs0_0.1-2_i386.deb) ...
Selecting previously deselected package libpthread-stubs0-dev.
Unpacking libpthread-stubs0-dev (from .../libpthread-stubs0-dev_0.1-2_i386.deb) ...
Selecting previously deselected package libxcb1-dev.
Unpacking libxcb1-dev (from .../libxcb1-dev_1.3-2_i386.deb) ...
Selecting previously deselected package libx11-dev.
Unpacking libx11-dev (from .../libx11-dev_2%3a1.2.1-1ubuntu1_i386.deb) ...
Selecting previously deselected package libxfixes3.
Unpacking libxfixes3 (from .../libxfixes3_1%3a4.0.3-2build1_i386.deb) ...
Selecting previously deselected package libxrender1.
Unpacking libxrender1 (from .../libxrender1_1%3a0.9.4-2_i386.deb) ...
Selecting previously deselected package libxcursor1.
Unpacking libxcursor1 (from .../libxcursor1_1%3a1.1.9-1build1_i386.deb) ...
Selecting previously deselected package x11proto-render-dev.
Unpacking x11proto-render-dev (from .../x11proto-render-dev_2%3a0.9.3-2_all.deb) ...
Selecting previously deselected package libxrender-dev.
Unpacking libxrender-dev (from .../libxrender-dev_1%3a0.9.4-2_i386.deb) ...
Selecting previously deselected package x11proto-xext-dev.
Unpacking x11proto-xext-dev (from .../x11proto-xext-dev_7.0.4-2_all.deb) ...
Selecting previously deselected package x11proto-fixes-dev.
Unpacking x11proto-fixes-dev (from .../x11proto-fixes-dev_1%3a4.0-3_all.deb) ...
Selecting previously deselected package libxfixes-dev.
Unpacking libxfixes-dev (from .../libxfixes-dev_1%3a4.0.3-2build1_i386.deb) ...
Selecting previously deselected package libxcursor-dev.
Unpacking libxcursor-dev (from .../libxcursor-dev_1%3a1.1.9-1build1_i386.deb) ...
Selecting previously deselected package libxext6.
Unpacking libxext6 (from .../libxext6_2%3a1.0.99.1-0ubuntu3_i386.deb) ...
Selecting previously deselected package libxext-dev.
Unpacking libxext-dev (from .../libxext-dev_2%3a1.0.99.1-0ubuntu3_i386.deb) ...
Selecting previously deselected package libexpat1.
Unpacking libexpat1 (from .../libexpat1_2.0.1-4_i386.deb) ...
Selecting previously deselected package libfreetype6.
Unpacking libfreetype6 (from .../libfreetype6_2.3.9-5_i386.deb) ...
Selecting previously deselected package ucf.
Unpacking ucf (from .../archives/ucf_3.0018_all.deb) ...
Moving old data out of the way
Selecting previously deselected package libnewt0.52.
Unpacking libnewt0.52 (from .../libnewt0.52_0.52.10-3ubuntu1_i386.deb) ...
Selecting previously deselected package libpopt0.
Unpacking libpopt0 (from .../libpopt0_1.14-4_i386.deb) ...
Selecting previously deselected package whiptail.
Unpacking whiptail (from .../whiptail_0.52.10-3ubuntu1_i386.deb) ...
Selecting previously deselected package libmagic1.
Unpacking libmagic1 (from .../libmagic1_5.03-1ubuntu1_i386.deb) ...
Selecting previously deselected package file.
Unpacking file (from .../file_5.03-1ubuntu1_i386.deb) ...
Selecting previously deselected package defoma.
Unpacking defoma (from .../defoma_0.11.10-0.2ubuntu1_all.deb) ...
Selecting previously deselected package ttf-dejavu-core.
Unpacking ttf-dejavu-core (from .../ttf-dejavu-core_2.29-2_all.deb) ...
Selecting previously deselected package ttf-dejavu-extra.
Unpacking ttf-dejavu-extra (from .../ttf-dejavu-extra_2.29-2_all.deb) ...
Selecting previously deselected package ttf-dejavu.
Unpacking ttf-dejavu (from .../ttf-dejavu_2.29-2_all.deb) ...
Selecting previously deselected package fontconfig-config.
Unpacking fontconfig-config (from .../fontconfig-config_2.6.0-1ubuntu12_all.deb) ...
Selecting previously deselected package libfontconfig1.
Unpacking libfontconfig1 (from .../libfontconfig1_2.6.0-1ubuntu12_i386.deb) ...
Selecting previously deselected package libxft2.
Unpacking libxft2 (from .../libxft2_2.1.13-3ubuntu1_i386.deb) ...
Selecting previously deselected package libexpat1-dev.
Unpacking libexpat1-dev (from .../libexpat1-dev_2.0.1-4_i386.deb) ...
Selecting previously deselected package zlib1g-dev.
Unpacking zlib1g-dev (from .../zlib1g-dev_1%3a1.2.3.3.dfsg-13ubuntu1_i386.deb) ...
Selecting previously deselected package libfreetype6-dev.
Unpacking libfreetype6-dev (from .../libfreetype6-dev_2.3.9-5_i386.deb) ...
Selecting previously deselected package pkg-config.
Unpacking pkg-config (from .../pkg-config_0.22-1build1_i386.deb) ...
Selecting previously deselected package libfontconfig1-dev.
Unpacking libfontconfig1-dev (from .../libfontconfig1-dev_2.6.0-1ubuntu12_i386.deb) ...
Selecting previously deselected package libxft-dev.
Unpacking libxft-dev (from .../libxft-dev_2.1.13-3ubuntu1_i386.deb) ...
Selecting previously deselected package libxi6.
Unpacking libxi6 (from .../libxi6_2%3a1.2.1-2ubuntu1_i386.deb) ...
Selecting previously deselected package libxi-dev.
Unpacking libxi-dev (from .../libxi-dev_2%3a1.2.1-2ubuntu1_i386.deb) ...
Selecting previously deselected package libxinerama1.
Unpacking libxinerama1 (from .../libxinerama1_2%3a1.0.3-2_i386.deb) ...
Selecting previously deselected package x11proto-xinerama-dev.
Unpacking x11proto-xinerama-dev (from .../x11proto-xinerama-dev_1.1.2-5ubuntu1_all.deb) ...
Selecting previously deselected package libxinerama-dev.
Unpacking libxinerama-dev (from .../libxinerama-dev_2%3a1.0.3-2_i386.deb) ...
Selecting previously deselected package libxmu-headers.
Unpacking libxmu-headers (from .../libxmu-headers_2%3a1.0.4-1build1_all.deb) ...
Selecting previously deselected package libxrandr2.
Unpacking libxrandr2 (from .../libxrandr2_2%3a1.3.0-2_i386.deb) ...
Selecting previously deselected package x11proto-randr-dev.
Unpacking x11proto-randr-dev (from .../x11proto-randr-dev_1.3.0-1_all.deb) ...
Selecting previously deselected package libxrandr-dev.
Unpacking libxrandr-dev (from .../libxrandr-dev_2%3a1.3.0-2_i386.deb) ...
Selecting previously deselected package libxt6.
Unpacking libxt6 (from .../libxt6_1%3a1.0.5-3ubuntu1_i386.deb) ...
Selecting previously deselected package libxt-dev.
Unpacking libxt-dev (from .../libxt-dev_1%3a1.0.5-3ubuntu1_i386.deb) ...
Selecting previously deselected package libgpg-error0.
Unpacking libgpg-error0 (from .../libgpg-error0_1.6-1ubuntu1_i386.deb) ...
Selecting previously deselected package libgcrypt11.
Unpacking libgcrypt11 (from .../libgcrypt11_1.4.4-2ubuntu1_i386.deb) ...
Selecting previously deselected package libtasn1-3.
Unpacking libtasn1-3 (from .../libtasn1-3_2.2-1_i386.deb) ...
Selecting previously deselected package libgnutls26.
Unpacking libgnutls26 (from .../libgnutls26_2.6.6-1_i386.deb) ...
Selecting previously deselected package libkeyutils1.
Unpacking libkeyutils1 (from .../libkeyutils1_1.2-10_i386.deb) ...
Selecting previously deselected package libkrb5support0.
Unpacking libkrb5support0 (from .../libkrb5support0_1.7dfsg~beta3-1_i386.deb) ...
Selecting previously deselected package libk5crypto3.
Unpacking libk5crypto3 (from .../libk5crypto3_1.7dfsg~beta3-1_i386.deb) ...
Selecting previously deselected package libkrb5-3.
Unpacking libkrb5-3 (from .../libkrb5-3_1.7dfsg~beta3-1_i386.deb) ...
Selecting previously deselected package libgssapi-krb5-2.
Unpacking libgssapi-krb5-2 (from .../libgssapi-krb5-2_1.7dfsg~beta3-1_i386.deb) ...
Selecting previously deselected package bsdmainutils.
Unpacking bsdmainutils (from .../bsdmainutils_6.1.10ubuntu4_i386.deb) ...
Selecting previously deselected package groff-base.
Unpacking groff-base (from .../groff-base_1.18.1.1-22build1_i386.deb) ...
Selecting previously deselected package man-db.
Unpacking man-db (from .../man-db_2.5.5-2_i386.deb) ...
Selecting previously deselected package html2text.
Unpacking html2text (from .../html2text_1.3.2a-14_i386.deb) ...
Selecting previously deselected package intltool-debian.
Unpacking intltool-debian (from .../intltool-debian_0.35.0+20060710.1_all.deb) ...
Selecting previously deselected package po-debconf.
Unpacking po-debconf (from .../po-debconf_1.0.16_all.deb) ...
Selecting previously deselected package debhelper.
Unpacking debhelper (from .../debhelper_7.2.14ubuntu1_all.deb) ...
Selecting previously deselected package dpatch.
Unpacking dpatch (from .../archives/dpatch_2.0.31_all.deb) ...
Selecting previously deselected package fontconfig.
Unpacking fontconfig (from .../fontconfig_2.6.0-1ubuntu12_i386.deb) ...
Selecting previously deselected package libaudio2.
Unpacking libaudio2 (from .../libaudio2_1.9.2-1_i386.deb) ...
Selecting previously deselected package libcups2.
Unpacking libcups2 (from .../libcups2_1.3.10-3_i386.deb) ...
Selecting previously deselected package libgpg-error-dev.
Unpacking libgpg-error-dev (from .../libgpg-error-dev_1.6-1ubuntu1_i386.deb) ...
Selecting previously deselected package libgcrypt11-dev.
Unpacking libgcrypt11-dev (from .../libgcrypt11-dev_1.4.4-2ubuntu1_i386.deb) ...
Selecting previously deselected package libtasn1-3-dev.
Unpacking libtasn1-3-dev (from .../libtasn1-3-dev_2.2-1_i386.deb) ...
Selecting previously deselected package libgnutls-dev.
Unpacking libgnutls-dev (from .../libgnutls-dev_2.6.6-1_i386.deb) ...
Selecting previously deselected package libgssrpc4.
Unpacking libgssrpc4 (from .../libgssrpc4_1.7dfsg~beta3-1_i386.deb) ...
Selecting previously deselected package libkdb5-4.
Unpacking libkdb5-4 (from .../libkdb5-4_1.7dfsg~beta3-1_i386.deb) ...
Selecting previously deselected package libkadm5srv6.
Unpacking libkadm5srv6 (from .../libkadm5srv6_1.7dfsg~beta3-1_i386.deb) ...
Selecting previously deselected package comerr-dev.
Unpacking comerr-dev (from .../comerr-dev_2.1-1.41.5-1ubuntu3_i386.deb) ...
Selecting previously deselected package libkrb5-dev.
Unpacking libkrb5-dev (from .../libkrb5-dev_1.7dfsg~beta3-1_i386.deb) ...
Selecting previously deselected package libcups2-dev.
Unpacking libcups2-dev (from .../libcups2-dev_1.3.10-3_i386.deb) ...
Selecting previously deselected package libcupsys2-dev.
Unpacking libcupsys2-dev (from .../libcupsys2-dev_1.3.10-3_all.deb) ...
Selecting previously deselected package libdrm2.
Unpacking libdrm2 (from .../libdrm2_2.4.11-0ubuntu1_i386.deb) ...
Selecting previously deselected package libxdamage1.
Unpacking libxdamage1 (from .../libxdamage1_1%3a1.1.1-4_i386.deb) ...
Selecting previously deselected package libxxf86vm1.
Unpacking libxxf86vm1 (from .../libxxf86vm1_1%3a1.0.2-1_i386.deb) ...
Selecting previously deselected package libgl1-mesa-glx.
Unpacking libgl1-mesa-glx (from .../libgl1-mesa-glx_7.4.1-1ubuntu2_i386.deb) ...
Selecting previously deselected package libglu1-mesa.
Unpacking libglu1-mesa (from .../libglu1-mesa_7.4.1-1ubuntu2_i386.deb) ...
Selecting previously deselected package mesa-common-dev.
Unpacking mesa-common-dev (from .../mesa-common-dev_7.4.1-1ubuntu2_i386.deb) ...
Selecting previously deselected package libgl1-mesa-dev.
Unpacking libgl1-mesa-dev (from .../libgl1-mesa-dev_7.4.1-1ubuntu2_i386.deb) ...
Selecting previously deselected package libglu1-mesa-dev.
Unpacking libglu1-mesa-dev (from .../libglu1-mesa-dev_7.4.1-1ubuntu2_i386.deb) ...
Selecting previously deselected package libjpeg62.
Unpacking libjpeg62 (from .../libjpeg62_6b-14build1_i386.deb) ...
Selecting previously deselected package libjpeg62-dev.
Unpacking libjpeg62-dev (from .../libjpeg62-dev_6b-14build1_i386.deb) ...
Selecting previously deselected package liblcms1.
Unpacking liblcms1 (from .../liblcms1_1.18.dfsg-0ubuntu1_i386.deb) ...
Selecting previously deselected package liblcms1-dev.
Unpacking liblcms1-dev (from .../liblcms1-dev_1.18.dfsg-0ubuntu1_i386.deb) ...
Selecting previously deselected package libmng1.
Unpacking libmng1 (from .../libmng1_1.0.9-1build1_i386.deb) ...
Selecting previously deselected package libmng-dev.
Unpacking libmng-dev (from .../libmng-dev_1.0.9-1build1_i386.deb) ...
Selecting previously deselected package libpng12-0.
Unpacking libpng12-0 (from .../libpng12-0_1.2.37-1_i386.deb) ...
Selecting previously deselected package libpng12-dev.
Unpacking libpng12-dev (from .../libpng12-dev_1.2.37-1_i386.deb) ...
Selecting previously deselected package libpython2.6.
Unpacking libpython2.6 (from .../libpython2.6_2.6.2-0ubuntu1_i386.deb) ...
Selecting previously deselected package libqt3-mt.
Unpacking libqt3-mt (from .../libqt3-mt_3%3a3.3.8-b-5ubuntu1_i386.deb) ...
Selecting previously deselected package libqscintilla7.
Unpacking libqscintilla7 (from .../libqscintilla7_1.7.1-2_i386.deb) ...
Selecting previously deselected package libqscintilla-dev.
Unpacking libqscintilla-dev (from .../libqscintilla-dev_1.7.1-2_all.deb) ...
Selecting previously deselected package libqt3-headers.
Unpacking libqt3-headers (from .../libqt3-headers_3%3a3.3.8-b-5ubuntu1_i386.deb) ...
Selecting previously deselected package libaudio-dev.
Unpacking libaudio-dev (from .../libaudio-dev_1.9.2-1_i386.deb) ...
Selecting previously deselected package libxmu6.
Unpacking libxmu6 (from .../libxmu6_2%3a1.0.4-1build1_i386.deb) ...
Selecting previously deselected package libxmu-dev.
Unpacking libxmu-dev (from .../libxmu-dev_2%3a1.0.4-1build1_i386.deb) ...
Selecting previously deselected package qt3-dev-tools.
Unpacking qt3-dev-tools (from .../qt3-dev-tools_3%3a3.3.8-b-5ubuntu1_i386.deb) ...
Selecting previously deselected package libqt3-mt-dev.
Unpacking libqt3-mt-dev (from .../libqt3-mt-dev_3%3a3.3.8-b-5ubuntu1_i386.deb) ...
Selecting previously deselected package python2.5-minimal.
Unpacking python2.5-minimal (from .../python2.5-minimal_2.5.4-1ubuntu4_i386.deb) ...
Selecting previously deselected package python2.5.
Unpacking python2.5 (from .../python2.5_2.5.4-1ubuntu4_i386.deb) ...
Selecting previously deselected package python-all.
Unpacking python-all (from .../python-all_2.6.2-0ubuntu1_all.deb) ...
Selecting previously deselected package python2.6-dev.
Unpacking python2.6-dev (from .../python2.6-dev_2.6.2-0ubuntu1_i386.deb) ...
Selecting previously deselected package python-dev.
Unpacking python-dev (from .../python-dev_2.6.2-0ubuntu1_all.deb) ...
Selecting previously deselected package python2.5-dev.
Unpacking python2.5-dev (from .../python2.5-dev_2.5.4-1ubuntu4_i386.deb) ...
Selecting previously deselected package python-all-dev.
Unpacking python-all-dev (from .../python-all-dev_2.6.2-0ubuntu1_all.deb) ...
Selecting previously deselected package python-sip4.
Unpacking python-sip4 (from .../python-sip4_4.8-0ubuntu1_i386.deb) ...
Selecting previously deselected package python-sip4-dev.
Unpacking python-sip4-dev (from .../python-sip4-dev_4.8-0ubuntu1_all.deb) ...
Selecting previously deselected package qt3-apps-dev.
Unpacking qt3-apps-dev (from .../qt3-apps-dev_3%3a3.3.8-b-5ubuntu1_i386.deb) ...
Selecting previously deselected package sip4.
Unpacking sip4 (from .../sip4_4.8-0ubuntu1_i386.deb) ...
Selecting previously deselected package python2.6-dbg.
Unpacking python2.6-dbg (from .../python2.6-dbg_2.6.2-0ubuntu1_i386.deb) ...
Selecting previously deselected package python-dbg.
Unpacking python-dbg (from .../python-dbg_2.6.2-0ubuntu1_all.deb) ...
Selecting previously deselected package python2.5-dbg.
Unpacking python2.5-dbg (from .../python2.5-dbg_2.5.4-1ubuntu4_i386.deb) ...
Selecting previously deselected package python-all-dbg.
Unpacking python-all-dbg (from .../python-all-dbg_2.6.2-0ubuntu1_all.deb) ...
Selecting previously deselected package python-sip4-dbg.
Unpacking python-sip4-dbg (from .../python-sip4-dbg_4.8-0ubuntu1_i386.deb) ...
Setting up libice6 (2:1.0.5-1) ...
Setting up x11proto-core-dev (7.0.15-1) ...
Setting up libice-dev (2:1.0.5-1) ...
Setting up libsm6 (2:1.1.0-2) ...
Setting up libsm-dev (2:1.1.0-2) ...
Setting up libxau6 (1:1.0.4-2) ...
Setting up libxdmcp6 (1:1.0.2-3) ...
Setting up libxcb1 (1.3-2) ...
Setting up libx11-data (2:1.2.1-1ubuntu1) ...
Setting up libx11-6 (2:1.2.1-1ubuntu1) ...
Setting up libxau-dev (1:1.0.4-2) ...
Setting up libxdmcp-dev (1:1.0.2-3) ...
Setting up x11proto-input-dev (1.5.0-2ubuntu1) ...
Setting up x11proto-kb-dev (1.0.3-3ubuntu1) ...
Setting up xtrans-dev (1.2.3-3) ...
Setting up libpthread-stubs0 (0.1-2) ...
Setting up libpthread-stubs0-dev (0.1-2) ...
Setting up libxcb1-dev (1.3-2) ...
Setting up libx11-dev (2:1.2.1-1ubuntu1) ...
Setting up libxfixes3 (1:4.0.3-2build1) ...
Setting up libxrender1 (1:0.9.4-2) ...
Setting up libxcursor1 (1:1.1.9-1build1) ...
Setting up x11proto-render-dev (2:0.9.3-2) ...
Setting up libxrender-dev (1:0.9.4-2) ...
Setting up x11proto-xext-dev (7.0.4-2) ...
Setting up x11proto-fixes-dev (1:4.0-3) ...
Setting up libxfixes-dev (1:4.0.3-2build1) ...
Setting up libxcursor-dev (1:1.1.9-1build1) ...
Setting up libxext6 (2:1.0.99.1-0ubuntu3) ...
Setting up libxext-dev (2:1.0.99.1-0ubuntu3) ...
Setting up libexpat1 (2.0.1-4) ...
Setting up libfreetype6 (2.3.9-5) ...
Setting up ucf (3.0018) ...
Setting up libnewt0.52 (0.52.10-3ubuntu1) ...
Setting up libpopt0 (1.14-4) ...
Setting up whiptail (0.52.10-3ubuntu1) ...
Setting up libmagic1 (5.03-1ubuntu1) ...
Setting up file (5.03-1ubuntu1) ...
Setting up defoma (0.11.10-0.2ubuntu1) ...
Setting up ttf-dejavu-core (2.29-2) ...
Setting up ttf-dejavu-extra (2.29-2) ...
Setting up ttf-dejavu (2.29-2) ...
Setting up fontconfig-config (2.6.0-1ubuntu12) ...
Setting up libfontconfig1 (2.6.0-1ubuntu12) ...
Setting up libxft2 (2.1.13-3ubuntu1) ...
Setting up libexpat1-dev (2.0.1-4) ...
Setting up zlib1g-dev (1:1.2.3.3.dfsg-13ubuntu1) ...
Setting up libfreetype6-dev (2.3.9-5) ...
Setting up pkg-config (0.22-1build1) ...
Setting up libfontconfig1-dev (2.6.0-1ubuntu12) ...
Setting up libxft-dev (2.1.13-3ubuntu1) ...
Setting up libxi6 (2:1.2.1-2ubuntu1) ...
Setting up libxi-dev (2:1.2.1-2ubuntu1) ...
Setting up libxinerama1 (2:1.0.3-2) ...
Setting up x11proto-xinerama-dev (1.1.2-5ubuntu1) ...
Setting up libxinerama-dev (2:1.0.3-2) ...
Setting up libxmu-headers (2:1.0.4-1build1) ...
Setting up libxrandr2 (2:1.3.0-2) ...
Setting up x11proto-randr-dev (1.3.0-1) ...
Setting up libxrandr-dev (2:1.3.0-2) ...
Setting up libxt6 (1:1.0.5-3ubuntu1) ...
Setting up libxt-dev (1:1.0.5-3ubuntu1) ...
Setting up libgpg-error0 (1.6-1ubuntu1) ...
Setting up libgcrypt11 (1.4.4-2ubuntu1) ...
Setting up libtasn1-3 (2.2-1) ...
Setting up libgnutls26 (2.6.6-1) ...
Setting up libkeyutils1 (1.2-10) ...
Setting up libkrb5support0 (1.7dfsg~beta3-1) ...
Setting up libk5crypto3 (1.7dfsg~beta3-1) ...
Setting up libkrb5-3 (1.7dfsg~beta3-1) ...
Setting up libgssapi-krb5-2 (1.7dfsg~beta3-1) ...
Setting up bsdmainutils (6.1.10ubuntu4) ...
Setting up groff-base (1.18.1.1-22build1) ...
Setting up man-db (2.5.5-2) ...
Building database of manual pages ...
... skipping, since this is a buildd
Setting up html2text (1.3.2a-14) ...
Setting up intltool-debian (0.35.0+20060710.1) ...
Setting up po-debconf (1.0.16) ...
Setting up debhelper (7.2.14ubuntu1) ...
Setting up dpatch (2.0.31) ...
Setting up fontconfig (2.6.0-1ubuntu12) ...
Updating font configuration of fontconfig...
Cleaning up category cid..
Cleaning up category truetype..
Cleaning up category type1..
Updating category type1..
Updating category truetype..
Updating category cid..
Updating fontconfig cache for /usr/share/fonts/truetype/ttf-dejavu
Cleaning up old fontconfig caches... done.
Regenerating fonts cache... done.
Setting up libaudio2 (1.9.2-1) ...
Setting up libcups2 (1.3.10-3) ...
Setting up libgpg-error-dev (1.6-1ubuntu1) ...
Setting up libgcrypt11-dev (1.4.4-2ubuntu1) ...
Setting up libtasn1-3-dev (2.2-1) ...
Setting up libgnutls-dev (2.6.6-1) ...
Setting up libgssrpc4 (1.7dfsg~beta3-1) ...
Setting up libkdb5-4 (1.7dfsg~beta3-1) ...
Setting up libkadm5srv6 (1.7dfsg~beta3-1) ...
Setting up comerr-dev (2.1-1.41.5-1ubuntu3) ...
Setting up libkrb5-dev (1.7dfsg~beta3-1) ...
Setting up libcups2-dev (1.3.10-3) ...
Setting up libcupsys2-dev (1.3.10-3) ...
Setting up libdrm2 (2.4.11-0ubuntu1) ...
Setting up libxdamage1 (1:1.1.1-4) ...
Setting up libxxf86vm1 (1:1.0.2-1) ...
Setting up libgl1-mesa-glx (7.4.1-1ubuntu2) ...
Setting up libglu1-mesa (7.4.1-1ubuntu2) ...
Setting up mesa-common-dev (7.4.1-1ubuntu2) ...
Setting up libgl1-mesa-dev (7.4.1-1ubuntu2) ...
Setting up libglu1-mesa-dev (7.4.1-1ubuntu2) ...
Setting up libjpeg62 (6b-14build1) ...
Setting up libjpeg62-dev (6b-14build1) ...
Setting up liblcms1 (1.18.dfsg-0ubuntu1) ...
Setting up liblcms1-dev (1.18.dfsg-0ubuntu1) ...
Setting up libmng1 (1.0.9-1build1) ...
Setting up libmng-dev (1.0.9-1build1) ...
Setting up libpng12-0 (1.2.37-1) ...
Setting up libpng12-dev (1.2.37-1) ...
Setting up libpython2.6 (2.6.2-0ubuntu1) ...
Setting up libqt3-mt (3:3.3.8-b-5ubuntu1) ...
Setting up libqscintilla7 (1.7.1-2) ...
Setting up libqscintilla-dev (1.7.1-2) ...
Setting up libqt3-headers (3:3.3.8-b-5ubuntu1) ...
Setting up libaudio-dev (1.9.2-1) ...
Setting up libxmu6 (2:1.0.4-1build1) ...
Setting up libxmu-dev (2:1.0.4-1build1) ...
Setting up qt3-dev-tools (3:3.3.8-b-5ubuntu1) ...
Setting up libqt3-mt-dev (3:3.3.8-b-5ubuntu1) ...
Setting up python2.5-minimal (2.5.4-1ubuntu4) ...
Linking and byte-compiling packages for runtime python2.5...
Setting up python2.5 (2.5.4-1ubuntu4) ...
Setting up python-all (2.6.2-0ubuntu1) ...
Setting up python2.6-dev (2.6.2-0ubuntu1) ...
Setting up python-dev (2.6.2-0ubuntu1) ...
Setting up python2.5-dev (2.5.4-1ubuntu4) ...
Setting up python-all-dev (2.6.2-0ubuntu1) ...
Setting up python-sip4 (4.8-0ubuntu1) ...
Setting up python-sip4-dev (4.8-0ubuntu1) ...
Setting up qt3-apps-dev (3:3.3.8-b-5ubuntu1) ...
Setting up sip4 (4.8-0ubuntu1) ...
Setting up python2.6-dbg (2.6.2-0ubuntu1) ...
Setting up python-dbg (2.6.2-0ubuntu1) ...
Setting up python2.5-dbg (2.5.4-1ubuntu4) ...
Setting up python-all-dbg (2.6.2-0ubuntu1) ...
Setting up python-sip4-dbg (4.8-0ubuntu1) ...
Processing triggers for libc6 ...
ldconfig deferred processing now taking place
Processing triggers for python-support ...
modified:
issue
issue.net
lsb-release
Checking correctness of source dependencies...
Toolchain package versions: libc6-dev_2.9-9ubuntu2 make_3.81-5 dpkg-dev_1.14.24ubuntu2 linux-libc-dev_2.6.30-8.9 g++-4.4_4.4.0-11ubuntu1core2 gcc-4.4_4.4.0-11ubuntu1core2 binutils_2.19.51.20090515-0ubuntu1 libstdc++6_4.4.0-11ubuntu1core2 libstdc++6-4.4-dev_4.4.0-11ubuntu1core2
------------------------------------------------------------------------------
sh: gcc: not found
dpkg-source: warning: Couldn't determine gcc system type, falling back to default (native compilation)
gpg: Signature made Tue May 5 23:07:15 2009 BST using DSA key ID C93BFF79
gpg: Can't check signature: public key not found
dpkg-source: extracting python-qt3 in python-qt3-3.17.6
dpkg-source: unpacking python-qt3_3.17.6.orig.tar.gz
dpkg-source: applying /home/buildd/build-karmic-autotest/python-qt3_3.17.6-2.diff.gz
dpkg-buildpackage: set CFLAGS to default value: -g -O2
dpkg-buildpackage: set CPPFLAGS to default value:
dpkg-buildpackage: set LDFLAGS to default value: -Wl,-Bsymbolic-functions
dpkg-buildpackage: set FFLAGS to default value: -g -O2
dpkg-buildpackage: set CXXFLAGS to default value: -g -O2
dpkg-buildpackage: source package python-qt3
dpkg-buildpackage: source version 3.17.6-2
dpkg-buildpackage: host architecture i386
/usr/bin/fakeroot debian/rules clean
pyversions: missing XS-Python-Version in control file, fall back to debian/pyversions
pyversions: missing debian/pyversions file, fall back to supported versions
dpatch deapply-all
01_configure not applied to ./ .
rm -rf patch-stamp patch-stampT debian/patched
dh_testdir
dh_testroot
rm -rf build-2.5 build-2.6 dbg-build-2.5 dbg-build-2.6
rm -f *-stamp
dh_clean
debian/rules build
pyversions: missing XS-Python-Version in control file, fall back to debian/pyversions
pyversions: missing debian/pyversions file, fall back to supported versions
test -d debian/patched || install -d debian/patched
dpatch apply-all
applying patch 01_configure to ./ ... ok.
dpatch cat-all >>patch-stampT
mv -f patch-stampT patch-stamp
dh_testdir
mkdir -p build-2.5
cd build-2.5 && echo yes \
| python2.5 ../configure.py \
-c -n /usr/include/qscintilla \
-o /usr/lib -u -j 10 \
-d /usr/lib/python2.5/site-packages \
-l /usr/include/python2.5 \
-v /usr/share/sip/qt \
-m /usr/lib/python2.5/config \
CXXFLAGS_RELEASE="" CXXFLAGS="-g -O2 -O1" STRIP=""
This is the GPL version of PyQt 3.17.6 (licensed under the GNU General Public
License) for Python 2.5.4 on linux2.
Type 'L' to view the license.
Type 'yes' to accept the terms of the license.
Type 'no' to decline the terms of the license.
Do you accept the terms of the license? QScintilla 1.7.1 is being used.
Checking to see if the qtcanvas module should be built...
Checking to see if the qtnetwork module should be built...
Checking to see if the qttable module should be built...
Checking to see if the qtxml module should be built...
Checking to see if the qtgl module should be built...
Checking to see if the qtui module should be built...
Checking to see if the qtsql module should be built...
Checking to see if the qtext module should be built...
Checking to see if the QAssistantClient class is available...
Creating features file...
Checking to see if the QCDEStyle class is built in...
Checking to see if the QInterlaceStyle class is built in...
Checking to see if the QMotifStyle class is built in...
Checking to see if the QMotifPlusStyle class is built in...
Checking to see if the QPlatinumStyle class is built in...
Checking to see if the QSGIStyle class is built in...
Checking to see if the QWindowsXPStyle class is built in...
Checking to see if the QWindowsStyle class is built in...
Qt v3.3.8 free edition is being used.
SIP 4.8 is being used.
These PyQt modules will be built: qt qtcanvas qtnetwork qttable qtxml qtgl qtui
qtsql qtext.
Support for these Qt classes has been disabled: QInterlaceStyle
QWindowsXPStyle.
The PyQt modules will be installed in /usr/lib/python2.5/site-packages.
The PyQt .sip files will be installed in /usr/share/sip/qt.
The Qt header files are in /usr/share/qt3/include.
The qt-mt Qt library is in /usr/share/qt3/lib.
pyuic will be installed in /usr/bin.
pylupdate will be installed in /usr/bin.
Generating the C++ source for the qt module...
Creating the Makefile for the qt module...
Generating the C++ source for the qtext module...
Creating the Makefile for the qtext module...
Generating the C++ source for the qtgl module...
Creating the Makefile for the qtgl module...
Generating the C++ source for the qtui module...
Creating the Makefile for the qtui module...
Generating the C++ source for the qtcanvas module...
Creating the Makefile for the qtcanvas module...
Generating the C++ source for the qtnetwork module...
Creating the Makefile for the qtnetwork module...
Generating the C++ source for the qtsql module...
Creating the Makefile for the qtsql module...
Generating the C++ source for the qttable module...
Creating the Makefile for the qttable module...
Generating the C++ source for the qtxml module...
Creating the Makefile for the qtxml module...
Creating top level Makefile...
Creating pyuic Makefile...
Creating pylupdate Makefile...
Creating pyqtconfig.py...
touch build-2.5/configure-stamp
dh_testdir
/usr/bin/make -C build-2.5
make[1]: Entering directory `/build/buildd/python-qt3-3.17.6/build-2.5'
make[2]: Entering directory `/build/buildd/python-qt3-3.17.6/build-2.5/qt'
g++ -c -g -O2 -O1 -fPIC -O0 -Wall -W -D_REENTRANT -DQT_THREAD_SUPPORT -I. -I/usr/include/python2.5 -I/usr/share/qt3/mkspecs/default -I/usr/share/qt3/include -I/usr/X11R6/include -o sipqtpart0.o sipqtpart0.cpp
In file included from /build/buildd/python-qt3-3.17.6/sip/qt/qimage.sip:139:
/usr/share/qt3/include/qimage.h: In member function 'bool QImageTextKeyLang::operator<(const QImageTextKeyLang&) const':
/usr/share/qt3/include/qimage.h:61: warning: suggest parentheses around '&&' within '||'
/build/buildd/python-qt3-3.17.6/sip/qt/qobject.sip: At global scope:
/build/buildd/python-qt3-3.17.6/sip/qt/qobject.sip:963: error: 'sipSlotConnection' has not been declared
/build/buildd/python-qt3-3.17.6/sip/qt/qobject.sip:978: error: 'sipSlotConnection' does not name a type
/build/buildd/python-qt3-3.17.6/sip/qt/qobject.sip:987: error: 'sipSlotConnection' has not been declared
/build/buildd/python-qt3-3.17.6/sip/qt/qobject.sip: In constructor 'UniversalSlot::UniversalSlot(QObject*, int*, const char**)':
/build/buildd/python-qt3-3.17.6/sip/qt/qobject.sip:990: error: 'conn' was not declared in this scope
/build/buildd/python-qt3-3.17.6/sip/qt/qobject.sip: In destructor 'virtual UniversalSlot::~UniversalSlot()':
/build/buildd/python-qt3-3.17.6/sip/qt/qobject.sip:1014: error: 'conn' was not declared in this scope
/build/buildd/python-qt3-3.17.6/sip/qt/qobject.sip:1014: error: 'sipFreeConnection' was not declared in this scope
/build/buildd/python-qt3-3.17.6/sip/qt/qobject.sip: In member function 'virtual bool UniversalSlot::qt_invoke(int, QUObject*)':
/build/buildd/python-qt3-3.17.6/sip/qt/qobject.sip:1074: error: expected initializer before '*' token
/build/buildd/python-qt3-3.17.6/sip/qt/qobject.sip:1092: error: 'psig' was not declared in this scope
/build/buildd/python-qt3-3.17.6/sip/qt/qobject.sip:1106: error: 'char_sat' was not declared in this scope
/build/buildd/python-qt3-3.17.6/sip/qt/qobject.sip:1107: error: 'schar_sat' was not declared in this scope
/build/buildd/python-qt3-3.17.6/sip/qt/qobject.sip:1108: error: 'uchar_sat' was not declared in this scope
/build/buildd/python-qt3-3.17.6/sip/qt/qobject.sip:1112: error: 'string_sat' was not declared in this scope
/build/buildd/python-qt3-3.17.6/sip/qt/qobject.sip:1113: error: 'sstring_sat' was not declared in this scope
/build/buildd/python-qt3-3.17.6/sip/qt/qobject.sip:1114: error: 'ustring_sat' was not declared in this scope
/build/buildd/python-qt3-3.17.6/sip/qt/qobject.sip:1118: error: 'short_sat' was not declared in this scope
/build/buildd/python-qt3-3.17.6/sip/qt/qobject.sip:1122: error: 'ushort_sat' was not declared in this scope
/build/buildd/python-qt3-3.17.6/sip/qt/qobject.sip:1126: error: 'int_sat' was not declared in this scope
/build/buildd/python-qt3-3.17.6/sip/qt/qobject.sip:1133: error: 'uint_sat' was not declared in this scope
/build/buildd/python-qt3-3.17.6/sip/qt/qobject.sip:1137: error: 'long_sat' was not declared in this scope
/build/buildd/python-qt3-3.17.6/sip/qt/qobject.sip:1141: error: 'ulong_sat' was not declared in this scope
/build/buildd/python-qt3-3.17.6/sip/qt/qobject.sip:1145: error: 'longlong_sat' was not declared in this scope
/build/buildd/python-qt3-3.17.6/sip/qt/qobject.sip:1149: error: 'ulonglong_sat' was not declared in this scope
/build/buildd/python-qt3-3.17.6/sip/qt/qobject.sip:1153: error: 'float_sat' was not declared in this scope
/build/buildd/python-qt3-3.17.6/sip/qt/qobject.sip:1157: error: 'double_sat' was not declared in this scope
/build/buildd/python-qt3-3.17.6/sip/qt/qobject.sip:1161: error: 'enum_sat' was not declared in this scope
/build/buildd/python-qt3-3.17.6/sip/qt/qobject.sip:1165: error: 'bool_sat' was not declared in this scope
/build/buildd/python-qt3-3.17.6/sip/qt/qobject.sip:1169: error: 'void_sat' was not declared in this scope
/build/buildd/python-qt3-3.17.6/sip/qt/qobject.sip:1173: error: 'class_sat' was not declared in this scope
/build/buildd/python-qt3-3.17.6/sip/qt/qobject.sip:1174: error: 'classp_sat' was not declared in this scope
/build/buildd/python-qt3-3.17.6/sip/qt/qobject.sip:1178: error: 'mtype_sat' was not declared in this scope
/build/buildd/python-qt3-3.17.6/sip/qt/qobject.sip:1179: error: 'mtypep_sat' was not declared in this scope
/build/buildd/python-qt3-3.17.6/sip/qt/qobject.sip:1183: error: 'qvariant_sat' was not declared in this scope
/build/buildd/python-qt3-3.17.6/sip/qt/qobject.sip:1184: error: 'qvariantp_sat' was not declared in this scope
/build/buildd/python-qt3-3.17.6/sip/qt/qobject.sip:1188: error: 'pyobject_sat' was not declared in this scope
/build/buildd/python-qt3-3.17.6/sip/qt/qobject.sip:1201: error: 'conn' was not declared in this scope
/build/buildd/python-qt3-3.17.6/sip/qt/qobject.sip:1201: error: 'sipEmitToSlot' was not declared in this scope
/build/buildd/python-qt3-3.17.6/sip/qt/qobject.sip: At global scope:
/build/buildd/python-qt3-3.17.6/sip/qt/qobject.sip:1221: error: 'sipSlotConnection' has not been declared
/build/buildd/python-qt3-3.17.6/sip/qt/qobject.sip:1230: error: expected initializer before '*' token
/build/buildd/python-qt3-3.17.6/sip/qt/qobject.sip:1236: error: 'sipSlotConnection' has not been declared
/build/buildd/python-qt3-3.17.6/sip/qt/qobject.sip: In function 'void* sipQtCreateUniversalSlot(sipWrapper*, int*, const char**)':
/build/buildd/python-qt3-3.17.6/sip/qt/qobject.sip:1246: error: 'struct _sipWrapper' has no member named 'ob_type'
/build/buildd/python-qt3-3.17.6/sip/qt/qobject.sip:1246: error: 'struct _sipWrapper' has no member named 'ob_type'
/build/buildd/python-qt3-3.17.6/sip/qt/qobject.sip:1247: error: request for member 'sc_transmitter' in '* conn', which is of non-class type 'int'
/build/buildd/python-qt3-3.17.6/sip/qt/qobject.sip: In function 'void* sipQtFindSlot(void*, const char*, PyObject*, const char*, const char**)':
/build/buildd/python-qt3-3.17.6/sip/qt/qobject.sip:1269: error: 'class UniversalSlot' has no member named 'conn'
/build/buildd/python-qt3-3.17.6/sip/qt/qobject.sip:1269: error: 'sipSameConnection' was not declared in this scope
/build/buildd/python-qt3-3.17.6/sip/qt/qobject.sip: At global scope:
/build/buildd/python-qt3-3.17.6/sip/qt/qobject.sip:1344: error: expected initializer before '*' token
/build/buildd/python-qt3-3.17.6/sip/qt/qtmod.sip:33: warning: 'PYQT_VERSION' defined but not used
/build/buildd/python-qt3-3.17.6/sip/qt/qtmod.sip:34: warning: 'PYQT_VERSION_STR' defined but not used
/build/buildd/python-qt3-3.17.6/sip/qt/qapplication.sip:541: warning: 'void pyqtMsgHandler(QtMsgType, const char*)' defined but not used
/build/buildd/python-qt3-3.17.6/sip/qt/qobject.sip:1236: warning: 'void* sipQtCreateUniversalSlot(sipWrapper*, int*, const char**)' defined but not used
/build/buildd/python-qt3-3.17.6/sip/qt/qobject.sip:1254: warning: 'void sipQtDestroyUniversalSlot(void*)' defined but not used
/build/buildd/python-qt3-3.17.6/sip/qt/qobject.sip:1266: warning: 'void* sipQtFindSlot(void*, const char*, PyObject*, const char*, const char**)' defined but not used
/build/buildd/python-qt3-3.17.6/sip/qt/qobject.sip:1280: warning: 'int sipQtConnect(void*, const char*, void*, const char*, int)' defined but not used
/build/buildd/python-qt3-3.17.6/sip/qt/qobject.sip:1288: warning: 'int sipQtDisconnect(void*, const char*, void*, const char*)' defined but not used
/build/buildd/python-qt3-3.17.6/sip/qt/qobject.sip:1296: warning: 'int sipQtSignalsBlocked(void*)' defined but not used
/build/buildd/python-qt3-3.17.6/sip/qt/qobject.sip:1303: warning: 'const void* sipQtGetSender()' defined but not used
/build/buildd/python-qt3-3.17.6/sip/qt/qobject.sip:1310: warning: 'void sipQtForgetSender()' defined but not used
/build/buildd/python-qt3-3.17.6/sip/qt/qobject.sip:1317: warning: 'int sipQtSameSignalSlotName(const char*, const char*)' defined but not used
make[2]: *** [sipqtpart0.o] Error 1
make[2]: Leaving directory `/build/buildd/python-qt3-3.17.6/build-2.5/qt'
make[1]: *** [all] Error 2
make[1]: Leaving directory `/build/buildd/python-qt3-3.17.6/build-2.5'
make: *** [build-2.5/build-stamp] Error 2
dpkg-buildpackage: failure: debian/rules build gave error exit status 2
******************************************************************************
Build finished at 20090727-2009
FAILED [dpkg-buildpackage died]
Purging chroot-karmic-autotest/build/buildd/python-qt3-3.17.6
------------------------------------------------------------------------------
/usr/bin/sudo dpkg --root=/home/buildd/build-karmic-autotest/chroot-karmic-autotest --purge groff-base libxfixes-dev libx11-data fontconfig-config qt3-dev-tools file zlib1g-dev ttf-dejavu python-all-dbg libkadm5srv6 python2.5-minimal x11-common libx11-dev libxi6 libqscintilla7 libjpeg62 sip4 libxcursor1 x11proto-input-dev libexpat1-dev libjpeg62-dev libcupsys2-dev libfontconfig1 libgnutls26 libqt3-mt libx11-6 xtrans-dev x11proto-randr-dev libglu1-mesa libnewt0.52 libxinerama-dev libxdamage1 dpatch python2.6-dbg libxt6 libtasn1-3 libmng1 comerr-dev libk5crypto3 libgpg-error-dev libkrb5-dev qt3-apps-dev x11proto-xext-dev pkg-config python-all python-sip4-dev libice6 intltool-debian libxrender1 libfontconfig1-dev libcups2-dev libtasn1-3-dev mesa-common-dev libxrandr-dev libxext-dev libcups2 libxau-dev libgpg-error0 libxmu-headers libmng-dev libxrender-dev libqscintilla-dev ttf-dejavu-extra libpng12-dev libglu1-mesa-dev libxft2 x11proto-render-dev libxext6 python2.5-dev libxine
rama1 libgssapi-krb5-2 libkrb5-3 libsm-dev libaudio2 libxmu6 defoma libxdmcp-dev ttf-dejavu-core python2.5 fontconfig libdrm2 libgcrypt11-dev python2.5-dbg libkdb5-4 libpopt0 libxt-dev libfreetype6 libice-dev libqt3-mt-dev libgl1-mesa-dev libfreetype6-dev x11proto-fixes-dev libgl1-mesa-glx libxcb1 libgcrypt11 html2text debhelper libpthread-stubs0 libxrandr2 python2.6-dev libkeyutils1 python-sip4 libmagic1 libgnutls-dev libexpat1 bsdmainutils libxau6 liblcms1-dev libxcursor-dev x11proto-core-dev whiptail libaudio-dev libxcb1-dev libxi-dev libxdmcp6 libxfixes3 libxmu-dev po-debconf libxft-dev liblcms1 libpython2.6 libkrb5support0 libpng12-0 python-all-dev python-dbg libxxf86vm1 man-db python-dev x11proto-kb-dev x11proto-xinerama-dev libqt3-headers libpthread-stubs0-dev ucf libsm6 python-sip4-dbg libgssrpc4
(Reading database ... 23568 files and directories currently installed.)
Removing python-all-dbg ...
Removing sip4 ...
Removing libcupsys2-dev ...
Removing dpatch ...
Purging configuration files for dpatch ...
Removing qt3-apps-dev ...
Removing python-sip4-dev ...
Removing libqscintilla-dev ...
Removing python2.5-dbg ...
Removing libqt3-mt-dev ...
Removing debhelper ...
Removing libxcursor-dev ...
Removing libaudio-dev ...
Removing libxi-dev ...
Removing libxmu-dev ...
Removing po-debconf ...
Removing libxft-dev ...
Removing python-all-dev ...
Removing man-db ...
Purging configuration files for man-db ...
Removing catpages as well as /var/cache/man hierarchy.
dpkg - warning: while removing man-db, directory `/usr/share/doc/man-db/examples' not empty so not removed.
dpkg - warning: while removing man-db, directory `/usr/share/doc/man-db' not empty so not removed.
dpkg - warning: while removing man-db, directory `/usr/share/man/id/man5' not empty so not removed.
dpkg - warning: while removing man-db, directory `/usr/share/man-db' not empty so not removed.
dpkg - warning: while removing man-db, directory `/usr/share/bug/man-db' not empty so not removed.
dpkg - warning: while removing man-db, directory `/usr/lib/man-db' not empty so not removed.
Removing python-dev ...
Removing libqt3-headers ...
Removing python-sip4-dbg ...
Removing groff-base ...
Purging configuration files for groff-base ...
Removing libxfixes-dev ...
Removing qt3-dev-tools ...
Removing libqscintilla7 ...
Purging configuration files for libqscintilla7 ...
Removing libqt3-mt ...
Purging configuration files for libqt3-mt ...
Removing libxinerama-dev ...
Removing python-all ...
Removing intltool-debian ...
Removing libfontconfig1-dev ...
Removing libcups2-dev ...
Removing libxrandr-dev ...
Removing libxext-dev ...
Removing libcups2 ...
Purging configuration files for libcups2 ...
Removing libxmu-headers ...
Removing libmng-dev ...
Removing libxrender-dev ...
Removing libpng12-dev ...
Removing libglu1-mesa-dev ...
Removing libxft2 ...
Purging configuration files for libxft2 ...
Removing x11proto-render-dev ...
Removing python2.5-dev ...
Removing libxinerama1 ...
Purging configuration files for libxinerama1 ...
Removing libaudio2 ...
Removing libxmu6 ...
Purging configuration files for libxmu6 ...
Removing python2.5 ...
Purging configuration files for python2.5 ...
Removing fontconfig ...
Purging font configuration of fontconfig...
Purging category cid..
Purging category truetype..
Purging category type1..
Updating fontconfig cache for /usr/share/fonts/truetype/ttf-dejavu
Purging configuration files for fontconfig ...
Removing libxt-dev ...
Removing libgl1-mesa-dev ...
Removing libfreetype6-dev ...
Removing x11proto-fixes-dev ...
Removing html2text ...
Purging configuration files for html2text ...
Removing libxrandr2 ...
Purging configuration files for libxrandr2 ...
Removing python2.6-dev ...
Removing python-sip4 ...
Removing libgnutls-dev ...
Removing bsdmainutils ...
Purging configuration files for bsdmainutils ...
Removing liblcms1-dev ...
Removing libpython2.6 ...
Purging configuration files for libpython2.6 ...
Removing libpng12-0 ...
Purging configuration files for libpng12-0 ...
Removing python-dbg ...
Removing x11proto-xinerama-dev ...
Removing zlib1g-dev ...
Removing python2.5-minimal ...
Unlinking and removing bytecode for runtime python2.5
Purging configuration files for python2.5-minimal ...
Removing libxi6 ...
Purging configuration files for libxi6 ...
Removing libxcursor1 ...
Purging configuration files for libxcursor1 ...
Removing libexpat1-dev ...
Removing libjpeg62-dev ...
Removing libfontconfig1 ...
Purging configuration files for libfontconfig1 ...
Removing libgnutls26 ...
Purging configuration files for libgnutls26 ...
Removing x11proto-randr-dev ...
Removing libglu1-mesa ...
Purging configuration files for libglu1-mesa ...
Removing python2.6-dbg ...
Purging configuration files for python2.6-dbg ...
Removing libxt6 ...
Purging configuration files for libxt6 ...
Removing libmng1 ...
Purging configuration files for libmng1 ...
Removing libkrb5-dev ...
Removing x11proto-xext-dev ...
Removing pkg-config ...
Removing libxrender1 ...
Purging configuration files for libxrender1 ...
Removing libtasn1-3-dev ...
Removing mesa-common-dev ...
Removing libsm-dev ...
Removing libgcrypt11-dev ...
Removing libfreetype6 ...
Purging configuration files for libfreetype6 ...
Removing libice-dev ...
Removing libgl1-mesa-glx ...
Purging configuration files for libgl1-mesa-glx ...
Removing libgcrypt11 ...
Purging configuration files for libgcrypt11 ...
Removing libexpat1 ...
Purging configuration files for libexpat1 ...
Removing liblcms1 ...
Purging configuration files for liblcms1 ...
Removing libxxf86vm1 ...
Purging configuration files for libxxf86vm1 ...
Removing libsm6 ...
Purging configuration files for libsm6 ...
Removing fontconfig-config ...
Purging configuration files for fontconfig-config ...
Removing ttf-dejavu ...
Removing libkadm5srv6 ...
Purging configuration files for libkadm5srv6 ...
Removing libx11-dev ...
Removing libjpeg62 ...
Removing x11proto-input-dev ...
Removing xtrans-dev ...
Removing libxdamage1 ...
Purging configuration files for libxdamage1 ...
Removing libtasn1-3 ...
Purging configuration files for libtasn1-3 ...
Removing comerr-dev ...
Removing libgpg-error-dev ...
Removing libice6 ...
Purging configuration files for libice6 ...
Removing libgpg-error0 ...
Purging configuration files for libgpg-error0 ...
Removing ttf-dejavu-extra ...
Purging configuration files for ttf-dejavu-extra ...
Removing libxext6 ...
Purging configuration files for libxext6 ...
Removing ttf-dejavu-core ...
Purging configuration files for ttf-dejavu-core ...
Removing libdrm2 ...
Purging configuration files for libdrm2 ...
Removing libkdb5-4 ...
Purging configuration files for libkdb5-4 ...
Removing libxcb1-dev ...
Removing libxfixes3 ...
Purging configuration files for libxfixes3 ...
Removing x11proto-kb-dev ...
Removing libpthread-stubs0-dev ...
Removing ucf ...
Purging configuration files for ucf ...
Removing libgssrpc4 ...
Purging configuration files for libgssrpc4 ...
Removing libx11-6 ...
Purging configuration files for libx11-6 ...
Removing libxau-dev ...
Removing libgssapi-krb5-2 ...
Purging configuration files for libgssapi-krb5-2 ...
Removing libkrb5-3 ...
Purging configuration files for libkrb5-3 ...
Removing defoma ...
Purging configuration files for defoma ...
Removing libxdmcp-dev ...
Removing libxcb1 ...
Purging configuration files for libxcb1 ...
Removing libpthread-stubs0 ...
Removing libxau6 ...
Purging configuration files for libxau6 ...
Removing x11proto-core-dev ...
Removing whiptail ...
Removing libxdmcp6 ...
Purging configuration files for libxdmcp6 ...
Removing libx11-data ...
Removing file ...
Purging configuration files for file ...
Removing x11-common ...
Purging configuration files for x11-common ...
dpkg - warning: while removing x11-common, directory `/usr/X11R6' not empty so not removed.
dpkg - warning: while removing x11-common, directory `/etc/X11' not empty so not removed.
Removing libnewt0.52 ...
Purging configuration files for libnewt0.52 ...
Removing libk5crypto3 ...
Purging configuration files for libk5crypto3 ...
Removing libpopt0 ...
Purging configuration files for libpopt0 ...
Removing libmagic1 ...
Purging configuration files for libmagic1 ...
Removing libkrb5support0 ...
Purging configuration files for libkrb5support0 ...
Removing libkeyutils1 ...
Purging configuration files for libkeyutils1 ...
Processing triggers for python-support ...
Processing triggers for libc6 ...
ldconfig deferred processing now taking place
******************************************************************************
Finished at 20090727-2009
Build needed 00:00:32, 24312k disk space
More information about the ubuntu-autotest
mailing list