Log for failed build of upx-ucl_3.01-3 (dist=karmic-autotest)
Build Daemon user
noreply at buildd.ubuntu.com
Sat Jul 25 13:34:41 BST 2009
Automatic build of upx-ucl_3.01-3 on terranova by sbuild/i386 1.170.5
Build started at 20090725-1334
******************************************************************************
Checking available source versions...
Fetching source files...
Reading package lists...
Building dependency tree...
Reading state information...
Need to get 1035kB of source archives.
Get:1 http://archive.internal karmic-autotest/main upx-ucl 3.01-3 (dsc) [985B]
Get:2 http://archive.internal karmic-autotest/main upx-ucl 3.01-3 (tar) [1024kB]
Get:3 http://archive.internal karmic-autotest/main upx-ucl 3.01-3 (diff) [9697B]
Fetched 1035kB in 0s (12.3MB/s)
Download complete and in download only mode
** Using build dependencies supplied by package:
Build-Depends: debhelper (>= 6), libucl-dev (>= 1.03), zlib1g-dev (>= 1:1.1.4)
Checking for already installed source dependencies...
debhelper: missing
libucl-dev: missing
zlib1g-dev: missing
Checking for source dependency conflicts...
/usr/bin/sudo /usr/bin/apt-get --purge $CHROOT_OPTIONS -q -y install debhelper libucl-dev zlib1g-dev
Reading package lists...
Building dependency tree...
Reading state information...
The following packages were automatically installed and are no longer required:
diffstat patchutils autoconf2.59 quilt m4 autoconf autotools-dev
libvolume-id1
Use 'apt-get autoremove' to remove them.
The following extra packages will be installed:
bsdmainutils file groff-base html2text intltool-debian libmagic1 libucl1
man-db po-debconf
Suggested packages:
wamerican wordlist whois vacation dh-make groff curl wget less www-browser
libmail-box-perl
Recommended packages:
libmail-sendmail-perl
The following NEW packages will be installed:
bsdmainutils debhelper file groff-base html2text intltool-debian libmagic1
libucl-dev libucl1 man-db po-debconf zlib1g-dev
0 upgraded, 12 newly installed, 0 to remove and 0 not upgraded.
Need to get 0B/3708kB of archives.
After this operation, 12.3MB of additional disk space will be used.
WARNING: The following packages cannot be authenticated!
libmagic1 file bsdmainutils groff-base man-db html2text intltool-debian
po-debconf debhelper libucl1 libucl-dev zlib1g-dev
debconf: unable to initialize frontend: Dialog
debconf: (Dialog frontend will not work on a dumb terminal, an emacs shell buffer, or without a controlling terminal.)
debconf: falling back to frontend: Readline
debconf: unable to initialize frontend: Readline
debconf: (This frontend requires a controlling tty.)
debconf: falling back to frontend: Teletype
dpkg-preconfigure: unable to re-open stdin:
Authentication warning overridden.
Selecting previously deselected package libmagic1.
(Reading database ... 16677 files and directories currently installed.)
Unpacking libmagic1 (from .../libmagic1_5.03-1ubuntu1_i386.deb) ...
Selecting previously deselected package file.
Unpacking file (from .../file_5.03-1ubuntu1_i386.deb) ...
Selecting previously deselected package bsdmainutils.
Unpacking bsdmainutils (from .../bsdmainutils_6.1.10ubuntu4_i386.deb) ...
Selecting previously deselected package groff-base.
Unpacking groff-base (from .../groff-base_1.18.1.1-22build1_i386.deb) ...
Selecting previously deselected package man-db.
Unpacking man-db (from .../man-db_2.5.5-2_i386.deb) ...
Selecting previously deselected package html2text.
Unpacking html2text (from .../html2text_1.3.2a-14_i386.deb) ...
Selecting previously deselected package intltool-debian.
Unpacking intltool-debian (from .../intltool-debian_0.35.0+20060710.1_all.deb) ...
Selecting previously deselected package po-debconf.
Unpacking po-debconf (from .../po-debconf_1.0.16_all.deb) ...
Selecting previously deselected package debhelper.
Unpacking debhelper (from .../debhelper_7.2.14ubuntu1_all.deb) ...
Selecting previously deselected package libucl1.
Unpacking libucl1 (from .../libucl1_1.03-4_i386.deb) ...
Selecting previously deselected package libucl-dev.
Unpacking libucl-dev (from .../libucl-dev_1.03-4_i386.deb) ...
Selecting previously deselected package zlib1g-dev.
Unpacking zlib1g-dev (from .../zlib1g-dev_1%3a1.2.3.3.dfsg-13ubuntu1_i386.deb) ...
Setting up libmagic1 (5.03-1ubuntu1) ...
Setting up file (5.03-1ubuntu1) ...
Setting up bsdmainutils (6.1.10ubuntu4) ...
Setting up groff-base (1.18.1.1-22build1) ...
Setting up man-db (2.5.5-2) ...
Building database of manual pages ...
... skipping, since this is a buildd
Setting up html2text (1.3.2a-14) ...
Setting up intltool-debian (0.35.0+20060710.1) ...
Setting up po-debconf (1.0.16) ...
Setting up debhelper (7.2.14ubuntu1) ...
Setting up libucl1 (1.03-4) ...
Setting up libucl-dev (1.03-4) ...
Setting up zlib1g-dev (1:1.2.3.3.dfsg-13ubuntu1) ...
Processing triggers for libc6 ...
ldconfig deferred processing now taking place
modified:
issue
issue.net
lsb-release
Checking correctness of source dependencies...
Toolchain package versions: libc6-dev_2.9-9ubuntu2 make_3.81-5 dpkg-dev_1.14.24ubuntu2 linux-libc-dev_2.6.30-8.9 g++-4.4_4.4.0-11ubuntu1core2 gcc-4.4_4.4.0-11ubuntu1core2 binutils_2.19.51.20090515-0ubuntu1 libstdc++6_4.4.0-11ubuntu1core2 libstdc++6-4.4-dev_4.4.0-11ubuntu1core2
------------------------------------------------------------------------------
sh: gcc: not found
dpkg-source: warning: Couldn't determine gcc system type, falling back to default (native compilation)
gpg: Signature made Sun Jul 27 12:13:36 2008 BST using DSA key ID 9D309C3B
gpg: Can't check signature: public key not found
dpkg-source: extracting upx-ucl in upx-ucl-3.01
dpkg-source: unpacking upx-ucl_3.01.orig.tar.gz
dpkg-source: applying /home/buildd/build-karmic-autotest/upx-ucl_3.01-3.diff.gz
dpkg-buildpackage: set CFLAGS to default value: -g -O2
dpkg-buildpackage: set CPPFLAGS to default value:
dpkg-buildpackage: set LDFLAGS to default value: -Wl,-Bsymbolic-functions
dpkg-buildpackage: set FFLAGS to default value: -g -O2
dpkg-buildpackage: set CXXFLAGS to default value: -g -O2
dpkg-buildpackage: source package upx-ucl
dpkg-buildpackage: source version 3.01-3
dpkg-buildpackage: host architecture i386
/usr/bin/fakeroot debian/rules clean
dh_testdir
dh_testroot
rm -f build-stamp
# Add here commands to clean up after the build process.
make UPX_UCLDIR=/none \
exeext="" \
distclean
make[1]: Entering directory `/build/buildd/upx-ucl-3.01'
make -C src distclean
make[2]: Entering directory `/build/buildd/upx-ucl-3.01/src'
rm -f *.d *.map *.o *.obj *.res .depend upx.exe upx.out upx.ttp upx
make[2]: Leaving directory `/build/buildd/upx-ucl-3.01/src'
make -C doc distclean
make[2]: Entering directory `/build/buildd/upx-ucl-3.01/doc'
rm -f upx.1 upx.doc upx.html pod2htm*
make[2]: Leaving directory `/build/buildd/upx-ucl-3.01/doc'
make[1]: Leaving directory `/build/buildd/upx-ucl-3.01'
rm -rf doc/*.1 doc/*.ps
dh_clean
debian/rules build
dh_testdir
# Add here commands to compile the package.
Starting build process (i386)
UPX_UCLDIR=/none CC=gcc CXX=g++ \
CXXFLAGS="-DWITH_UCL -g -O2" \
CPPFLAGS="" \
LDFLAGS="-s" \
make exeext="" target=linux all
make[1]: Entering directory `/build/buildd/upx-ucl-3.01'
make -C src all
make[2]: Entering directory `/build/buildd/upx-ucl-3.01/src'
Updating .depend
make[2]: Leaving directory `/build/buildd/upx-ucl-3.01/src'
make[2]: Entering directory `/build/buildd/upx-ucl-3.01/src'
g++ -DWITH_UCL -g -O2 -Wall -W -Wcast-align -Wcast-qual -Wpointer-arith -Wwrite-strings -Werror -o c_file.o -c c_file.cpp
g++ -DWITH_UCL -g -O2 -Wall -W -Wcast-align -Wcast-qual -Wpointer-arith -Wwrite-strings -Werror -o c_init.o -c c_init.cpp
g++ -DWITH_UCL -g -O2 -Wall -W -Wcast-align -Wcast-qual -Wpointer-arith -Wwrite-strings -Werror -o c_none.o -c c_none.cpp
g++ -DWITH_UCL -g -O2 -Wall -W -Wcast-align -Wcast-qual -Wpointer-arith -Wwrite-strings -Werror -o c_screen.o -c c_screen.cpp
g++ -DWITH_UCL -g -O2 -Wall -W -Wcast-align -Wcast-qual -Wpointer-arith -Wwrite-strings -Werror -o compress.o -c compress.cpp
g++ -DWITH_UCL -g -O2 -Wall -W -Wcast-align -Wcast-qual -Wpointer-arith -Wwrite-strings -Werror -Wno-cast-qual -Wno-shadow -Wno-error -o compress_lzma.o -c compress_lzma.cpp
g++ -DWITH_UCL -g -O2 -Wall -W -Wcast-align -Wcast-qual -Wpointer-arith -Wwrite-strings -Werror -o compress_ucl.o -c compress_ucl.cpp
g++ -DWITH_UCL -g -O2 -Wall -W -Wcast-align -Wcast-qual -Wpointer-arith -Wwrite-strings -Werror -o compress_zlib.o -c compress_zlib.cpp
g++ -DWITH_UCL -g -O2 -Wall -W -Wcast-align -Wcast-qual -Wpointer-arith -Wwrite-strings -Werror -o except.o -c except.cpp
g++ -DWITH_UCL -g -O2 -Wall -W -Wcast-align -Wcast-qual -Wpointer-arith -Wwrite-strings -Werror -o file.o -c file.cpp
g++ -DWITH_UCL -g -O2 -Wall -W -Wcast-align -Wcast-qual -Wpointer-arith -Wwrite-strings -Werror -o filter.o -c filter.cpp
g++ -DWITH_UCL -g -O2 -Wall -W -Wcast-align -Wcast-qual -Wpointer-arith -Wwrite-strings -Werror -o filteri.o -c filteri.cpp
g++ -DWITH_UCL -g -O2 -Wall -W -Wcast-align -Wcast-qual -Wpointer-arith -Wwrite-strings -Werror -o help.o -c help.cpp
g++ -DWITH_UCL -g -O2 -Wall -W -Wcast-align -Wcast-qual -Wpointer-arith -Wwrite-strings -Werror -o lefile.o -c lefile.cpp
g++ -DWITH_UCL -g -O2 -Wall -W -Wcast-align -Wcast-qual -Wpointer-arith -Wwrite-strings -Werror -o linker.o -c linker.cpp
g++ -DWITH_UCL -g -O2 -Wall -W -Wcast-align -Wcast-qual -Wpointer-arith -Wwrite-strings -Werror -o main.o -c main.cpp
cc1plus: warnings being treated as errors
bele.h: In static member function 'static bool TestBELE<T>::test() [with T = LE16]':
bele.h:121: error: dereferencing pointer 'p.22' does break strict-aliasing rules
bele.h:121: note: initialized from here
bele.h:121: error: dereferencing pointer 'p.22' does break strict-aliasing rules
bele.h:121: note: initialized from here
bele.h:121: error: dereferencing pointer 'p.22' does break strict-aliasing rules
bele.h:121: note: initialized from here
bele.h:121: error: dereferencing pointer 'p.22' does break strict-aliasing rules
bele.h:121: note: initialized from here
bele.h:121: error: dereferencing pointer 'p.22' does break strict-aliasing rules
bele.h:121: note: initialized from here
bele.h:121: error: dereferencing pointer 'p.22' does break strict-aliasing rules
bele.h:121: note: initialized from here
bele.h:121: error: dereferencing pointer 'p.22' does break strict-aliasing rules
bele.h:121: note: initialized from here
bele.h:121: error: dereferencing pointer 'p.22' does break strict-aliasing rules
bele.h:121: note: initialized from here
bele.h:121: error: dereferencing pointer 'p.22' does break strict-aliasing rules
bele.h:121: note: initialized from here
bele.h:121: error: dereferencing pointer 'p.22' does break strict-aliasing rules
bele.h:121: note: initialized from here
bele.h:121: error: dereferencing pointer 'p.22' does break strict-aliasing rules
bele.h:121: note: initialized from here
bele.h:121: error: dereferencing pointer 'p.22' does break strict-aliasing rules
bele.h:121: note: initialized from here
bele.h:121: error: dereferencing pointer 'p.22' does break strict-aliasing rules
bele.h:121: note: initialized from here
bele.h:121: error: dereferencing pointer 'p.22' does break strict-aliasing rules
bele.h:121: note: initialized from here
bele.h: In static member function 'static bool TestBELE<T>::test() [with T = LE32]':
bele.h:157: error: dereferencing pointer 'p.24' does break strict-aliasing rules
bele.h:157: note: initialized from here
bele.h:157: error: dereferencing pointer 'p.24' does break strict-aliasing rules
bele.h:157: note: initialized from here
bele.h:157: error: dereferencing pointer 'p.24' does break strict-aliasing rules
bele.h:157: note: initialized from here
bele.h:157: error: dereferencing pointer 'p.24' does break strict-aliasing rules
bele.h:157: note: initialized from here
bele.h:157: error: dereferencing pointer 'p.24' does break strict-aliasing rules
bele.h:157: note: initialized from here
bele.h:157: error: dereferencing pointer 'p.24' does break strict-aliasing rules
bele.h:157: note: initialized from here
bele.h:157: error: dereferencing pointer 'p.24' does break strict-aliasing rules
bele.h:157: note: initialized from here
bele.h:157: error: dereferencing pointer 'p.24' does break strict-aliasing rules
bele.h:157: note: initialized from here
bele.h:157: error: dereferencing pointer 'p.24' does break strict-aliasing rules
bele.h:157: note: initialized from here
bele.h:157: error: dereferencing pointer 'p.24' does break strict-aliasing rules
bele.h:157: note: initialized from here
bele.h:157: error: dereferencing pointer 'p.24' does break strict-aliasing rules
bele.h:157: note: initialized from here
bele.h:157: error: dereferencing pointer 'p.24' does break strict-aliasing rules
bele.h:157: note: initialized from here
bele.h:157: error: dereferencing pointer 'p.24' does break strict-aliasing rules
bele.h:157: note: initialized from here
bele.h:157: error: dereferencing pointer 'p.24' does break strict-aliasing rules
bele.h:157: note: initialized from here
make[2]: *** [main.o] Error 1
make[2]: Leaving directory `/build/buildd/upx-ucl-3.01/src'
make[1]: *** [all] Error 2
make[1]: Leaving directory `/build/buildd/upx-ucl-3.01'
make: *** [build-stamp] Error 2
dpkg-buildpackage: failure: debian/rules build gave error exit status 2
******************************************************************************
Build finished at 20090725-1334
FAILED [dpkg-buildpackage died]
Purging chroot-karmic-autotest/build/buildd/upx-ucl-3.01
------------------------------------------------------------------------------
/usr/bin/sudo dpkg --root=/home/buildd/build-karmic-autotest/chroot-karmic-autotest --purge po-debconf intltool-debian groff-base libucl1 libmagic1 file zlib1g-dev libucl-dev bsdmainutils html2text man-db debhelper
(Reading database ... 17515 files and directories currently installed.)
Removing zlib1g-dev ...
Removing libucl-dev ...
Removing debhelper ...
Removing po-debconf ...
Removing intltool-debian ...
Removing libucl1 ...
Purging configuration files for libucl1 ...
Removing file ...
Purging configuration files for file ...
Removing html2text ...
Purging configuration files for html2text ...
Removing man-db ...
Purging configuration files for man-db ...
Removing catpages as well as /var/cache/man hierarchy.
dpkg - warning: while removing man-db, directory `/usr/share/doc/man-db/examples' not empty so not removed.
dpkg - warning: while removing man-db, directory `/usr/share/doc/man-db' not empty so not removed.
dpkg - warning: while removing man-db, directory `/usr/share/man/id/man5' not empty so not removed.
dpkg - warning: while removing man-db, directory `/usr/share/man-db' not empty so not removed.
dpkg - warning: while removing man-db, directory `/usr/share/bug/man-db' not empty so not removed.
dpkg - warning: while removing man-db, directory `/usr/lib/man-db' not empty so not removed.
Removing groff-base ...
Purging configuration files for groff-base ...
Removing libmagic1 ...
Purging configuration files for libmagic1 ...
Removing bsdmainutils ...
Purging configuration files for bsdmainutils ...
Processing triggers for libc6 ...
ldconfig deferred processing now taking place
******************************************************************************
Finished at 20090725-1334
Build needed 00:00:11, 8152k disk space
More information about the ubuntu-autotest
mailing list