Log for failed build of pychecker_0.8.18-2 (dist=karmic-autotest)
Build Daemon user
noreply at buildd.ubuntu.com
Fri Jul 24 06:42:05 BST 2009
Automatic build of pychecker_0.8.18-2 on terranova by sbuild/i386 1.170.5
Build started at 20090724-0641
******************************************************************************
Checking available source versions...
Fetching source files...
Reading package lists...
Building dependency tree...
Reading state information...
Need to get 163kB of source archives.
Get:1 http://archive.internal karmic-autotest/main pychecker 0.8.18-2 (dsc) [1005B]
Get:2 http://archive.internal karmic-autotest/main pychecker 0.8.18-2 (tar) [146kB]
Get:3 http://archive.internal karmic-autotest/main pychecker 0.8.18-2 (diff) [16.1kB]
Fetched 163kB in 0s (4043kB/s)
Download complete and in download only mode
** Using build dependencies supplied by package:
Build-Depends: python-support (>= 0.3), debhelper (>= 7.0.1)
Checking for already installed source dependencies...
python-support: already installed (1.0.3ubuntu1 >= 0.3 is satisfied)
debhelper: missing
Checking for source dependency conflicts...
/usr/bin/sudo /usr/bin/apt-get --purge $CHROOT_OPTIONS -q -y install debhelper
Reading package lists...
Building dependency tree...
Reading state information...
The following packages were automatically installed and are no longer required:
diffstat patchutils autoconf2.59 quilt m4 autoconf autotools-dev
libvolume-id1
Use 'apt-get autoremove' to remove them.
The following extra packages will be installed:
bsdmainutils file groff-base html2text intltool-debian libmagic1 man-db
po-debconf
Suggested packages:
wamerican wordlist whois vacation dh-make groff curl wget less www-browser
libmail-box-perl
Recommended packages:
libmail-sendmail-perl
The following NEW packages will be installed:
bsdmainutils debhelper file groff-base html2text intltool-debian libmagic1
man-db po-debconf
0 upgraded, 9 newly installed, 0 to remove and 0 not upgraded.
Need to get 0B/3475kB of archives.
After this operation, 11.4MB of additional disk space will be used.
WARNING: The following packages cannot be authenticated!
libmagic1 file bsdmainutils groff-base man-db html2text intltool-debian
po-debconf debhelper
debconf: unable to initialize frontend: Dialog
debconf: (Dialog frontend will not work on a dumb terminal, an emacs shell buffer, or without a controlling terminal.)
debconf: falling back to frontend: Readline
debconf: unable to initialize frontend: Readline
debconf: (This frontend requires a controlling tty.)
debconf: falling back to frontend: Teletype
dpkg-preconfigure: unable to re-open stdin:
Authentication warning overridden.
Selecting previously deselected package libmagic1.
(Reading database ... 16677 files and directories currently installed.)
Unpacking libmagic1 (from .../libmagic1_5.03-1ubuntu1_i386.deb) ...
Selecting previously deselected package file.
Unpacking file (from .../file_5.03-1ubuntu1_i386.deb) ...
Selecting previously deselected package bsdmainutils.
Unpacking bsdmainutils (from .../bsdmainutils_6.1.10ubuntu4_i386.deb) ...
Selecting previously deselected package groff-base.
Unpacking groff-base (from .../groff-base_1.18.1.1-22build1_i386.deb) ...
Selecting previously deselected package man-db.
Unpacking man-db (from .../man-db_2.5.5-2_i386.deb) ...
Selecting previously deselected package html2text.
Unpacking html2text (from .../html2text_1.3.2a-14_i386.deb) ...
Selecting previously deselected package intltool-debian.
Unpacking intltool-debian (from .../intltool-debian_0.35.0+20060710.1_all.deb) ...
Selecting previously deselected package po-debconf.
Unpacking po-debconf (from .../po-debconf_1.0.16_all.deb) ...
Selecting previously deselected package debhelper.
Unpacking debhelper (from .../debhelper_7.2.14ubuntu1_all.deb) ...
Setting up libmagic1 (5.03-1ubuntu1) ...
Setting up file (5.03-1ubuntu1) ...
Setting up bsdmainutils (6.1.10ubuntu4) ...
Setting up groff-base (1.18.1.1-22build1) ...
Setting up man-db (2.5.5-2) ...
Building database of manual pages ...
... skipping, since this is a buildd
Setting up html2text (1.3.2a-14) ...
Setting up intltool-debian (0.35.0+20060710.1) ...
Setting up po-debconf (1.0.16) ...
Setting up debhelper (7.2.14ubuntu1) ...
Processing triggers for libc6 ...
ldconfig deferred processing now taking place
Checking correctness of source dependencies...
Toolchain package versions: libc6-dev_2.9-9ubuntu2 make_3.81-5 dpkg-dev_1.14.24ubuntu2 linux-libc-dev_2.6.30-8.9 g++-4.4_4.4.0-11ubuntu1core2 gcc-4.4_4.4.0-11ubuntu1core2 binutils_2.19.51.20090515-0ubuntu1 libstdc++6_4.4.0-11ubuntu1core2 libstdc++6-4.4-dev_4.4.0-11ubuntu1core2
------------------------------------------------------------------------------
sh: gcc: not found
dpkg-source: warning: Couldn't determine gcc system type, falling back to default (native compilation)
gpg: Signature made Mon Mar 30 00:20:30 2009 BST using DSA key ID 3CD95104
gpg: Can't check signature: public key not found
dpkg-source: extracting pychecker in pychecker-0.8.18
dpkg-source: unpacking pychecker_0.8.18.orig.tar.gz
dpkg-source: applying /home/buildd/build-karmic-autotest/pychecker_0.8.18-2.diff.gz
dpkg-buildpackage: set CFLAGS to default value: -g -O2
dpkg-buildpackage: set CPPFLAGS to default value:
dpkg-buildpackage: set LDFLAGS to default value: -Wl,-Bsymbolic-functions
dpkg-buildpackage: set FFLAGS to default value: -g -O2
dpkg-buildpackage: set CXXFLAGS to default value: -g -O2
dpkg-buildpackage: source package pychecker
dpkg-buildpackage: source version 0.8.18-2
dpkg-buildpackage: host architecture i386
/usr/bin/fakeroot debian/rules clean
dh_testdir
dh_testroot
rm -f build-stamp
/usr/bin/python ./setup.py --quiet clean
find . -name "*.pyc" | xargs rm -f
find . -name "*.pyo" | xargs rm -f
rm -rf build debian/tmp
dh_clean
debian/rules build
dh_testdir
/usr/bin/python ./setup.py --quiet build --build-base build install --no-compile --install-purelib debian/tmp/lib/pychecker
sh debian/regression.sh # note: build will fail if regression tests fail
Running test1...
Running test2...
Running test3...
5c5
< /usr/lib/python2.5/UserDict.py:4: No doc string for class UserDict
---
> /usr/lib/python2.6/UserDict.py:4: No doc string for class UserDict
test3 FAILED
Running test4...
Running test5...
Running test6...
Running test7...
Running test8...
Running test9...
Running test10...
Running test11...
Running test12...
Running test13...
Running test14...
Running test15...
Running test16...
Running test17...
Running test18...
Running test19...
Running test20...
Running test21...
Running test22...
24a25,26
> test_input/test22.py:54: Format string argument count (0) doesn't match arguments (1)
> test_input/test22.py:57: Format string argument count (2) doesn't match arguments (1)
test22 FAILED
Running test23...
Running test24...
Running test25...
Running test26...
5c5
< None
---
> test_input/test26.py:9: Base class (test26.Foo) __init__() not called
test26 FAILED
Running test27...
Running test28...
Running test29...
Running test30...
Running test31...
Running test32...
Running test33...
Running test34...
5c5
< /usr/lib/python2.5/getopt.py:42: No doc string for class GetoptError
---
> /usr/lib/python2.6/getopt.py:42: No doc string for class GetoptError
7,9c7,11
< /usr/lib/python2.5/locale.py:203: Local variable (digits) shadows global defined on line 4 in file test_input/test34.py
< /usr/lib/python2.5/locale.py:204: Local variable (digits) shadows global defined on line 4 in file test_input/test34.py
< /usr/lib/python2.5/locale.py:208: Local variable (digits) shadows global defined on line 4 in file test_input/test34.py
---
> /usr/lib/python2.6/locale.py:238: Local variable (digits) shadows global defined on line 4 in file test_input/test34.py
> /usr/lib/python2.6/locale.py:239: Local variable (digits) shadows global defined on line 4 in file test_input/test34.py
> /usr/lib/python2.6/locale.py:243: Local variable (digits) shadows global defined on line 4 in file test_input/test34.py
>
> /usr/lib/python2.6/string.py:592: No doc string for class Formatter
test34 FAILED
Running test35...
Running test36...
Running test37...
Running test38...
Running test39...
Running test40...
Running test41...
Running test42...
Running test43...
Running test45...
Running test46...
Running test47...
Running test48...
Running test49...
Running test50...
Running test51...
Running test52...
Running test53...
Running test54...
Running test55...
Running test56...
Running test57...
Running test58...
Running test59...
6d5
< test_input/test59.py:5: Modifying parameter (d) with a default value may have unexpected consequences
test59 FAILED
Running test60...
Running test61...
Running test62...
Running test63...
Running test64...
Running test65...
Running test66...
Running test67...
Running test68...
Running test69...
Running test70...
1a2,9
> test_input/test70.py:31: SyntaxWarning: assertion is always true, perhaps remove parentheses?
> assert(x, 'test')
> test_input/test70.py:32: SyntaxWarning: assertion is always true, perhaps remove parentheses?
> assert(5, 'test')
> test_input/test70.py:31: SyntaxWarning: assertion is always true, perhaps remove parentheses?
> assert(x, 'test')
> test_input/test70.py:32: SyntaxWarning: assertion is always true, perhaps remove parentheses?
> assert(5, 'test')
test70 FAILED
Running test71...
4a5
> test_input/test71.py:13: Code appears to be unreachable
5a7
> test_input/test71.py:25: Code appears to be unreachable
test71 FAILED
Running test72...
Running test73...
Running test74...
Running test75...
Running test76...
Running test77...
Running test78...
Running test79...
Running test80...
Running test81...
Running test82...
Running test83...
Running test84...
Running test85...
Running test86...
Running test87...
Running test88...
2,3c2
< test_input/test88.py:7: DeprecationWarning: the gopherlib module is deprecated
< import gopherlib
---
> ImportError: No module named gopherlib
7,11c6
< test_input/test88.py:7: gopherlib module is deprecated
< test_input/test88.py:11: whrandom module is deprecated, consider using random
< test_input/test88.py:20: os.tempnam() is a security problem
< test_input/test88.py:21: os.tmpnam() is a security problem
< test_input/test88.py:23: string.atof is deprecated
---
> test88:1: NOT PROCESSED UNABLE TO IMPORT
test88 FAILED
Running test89...
Running test90...
Running test92...
Running test93...
Running test94...
Running test95...
Running test96...
Running test97...
Running test98...
Running test99...
Running test1000...
Running test1001...
Running test1002...
Running test1003...
1a2,3
> test_input/test1003.py:4: DeprecationWarning: the sets module is deprecated
> import sets
test1003 FAILED
92/101 tests passed (9 failures).
Failed test(s): test3 test22 test26 test34 test59 test70 test71 test88 test1003
make: *** [build-stamp] Error 1
dpkg-buildpackage: failure: debian/rules build gave error exit status 2
******************************************************************************
Build finished at 20090724-0642
FAILED [dpkg-buildpackage died]
Purging chroot-karmic-autotest/build/buildd/pychecker-0.8.18
------------------------------------------------------------------------------
/usr/bin/sudo dpkg --root=/home/buildd/build-karmic-autotest/chroot-karmic-autotest --purge po-debconf intltool-debian groff-base libmagic1 file bsdmainutils html2text debhelper man-db
(Reading database ... 17463 files and directories currently installed.)
Removing debhelper ...
Removing man-db ...
Purging configuration files for man-db ...
Removing catpages as well as /var/cache/man hierarchy.
dpkg - warning: while removing man-db, directory `/usr/share/doc/man-db/examples' not empty so not removed.
dpkg - warning: while removing man-db, directory `/usr/share/doc/man-db' not empty so not removed.
dpkg - warning: while removing man-db, directory `/usr/share/man/id/man5' not empty so not removed.
dpkg - warning: while removing man-db, directory `/usr/share/man-db' not empty so not removed.
dpkg - warning: while removing man-db, directory `/usr/share/bug/man-db' not empty so not removed.
dpkg - warning: while removing man-db, directory `/usr/lib/man-db' not empty so not removed.
Removing po-debconf ...
Removing intltool-debian ...
Removing groff-base ...
Purging configuration files for groff-base ...
Removing file ...
Purging configuration files for file ...
Removing bsdmainutils ...
Purging configuration files for bsdmainutils ...
Removing html2text ...
Purging configuration files for html2text ...
Removing libmagic1 ...
Purging configuration files for libmagic1 ...
Processing triggers for libc6 ...
ldconfig deferred processing now taking place
******************************************************************************
Finished at 20090724-0642
Build needed 00:00:10, 3932k disk space
More information about the ubuntu-autotest
mailing list