Log for failed build of flex_2.5.35-7ubuntu1 (dist=karmic-autotest)

Build Daemon user noreply at buildd.ubuntu.com
Thu Jul 23 15:11:28 BST 2009


Automatic build of flex_2.5.35-7ubuntu1 on terranova by sbuild/i386 1.170.5
Build started at 20090723-1509
******************************************************************************
Checking available source versions...
Fetching source files...
Reading package lists...
Building dependency tree...
Reading state information...
NOTICE: 'flex' packaging is maintained in the 'Git' version control system at:
git://git.debian.org/~srivasta/debian/flex.git
Need to get 1499kB of source archives.
Get:1 http://archive.internal karmic-autotest/main flex 2.5.35-7ubuntu1 (dsc) [1286B]
Get:2 http://archive.internal karmic-autotest/main flex 2.5.35-7ubuntu1 (tar) [1457kB]
Get:3 http://archive.internal karmic-autotest/main flex 2.5.35-7ubuntu1 (diff) [40.9kB]
Fetched 1499kB in 0s (13.8MB/s)
Download complete and in download only mode
** Using build dependencies supplied by package:
Build-Depends: bison, gettext, texinfo, help2man, file, po-debconf, autoconf, automake | automaken, cvs
Checking for already installed source dependencies...
bison: missing
gettext: already installed (0.17-6ubuntu2)
texinfo: missing
help2man: missing
file: missing
po-debconf: missing
autoconf: already installed (2.63-3ubuntu1)
automake: missing
automaken: missing
cvs: missing
Checking for source dependency conflicts...
  /usr/bin/sudo /usr/bin/apt-get --purge $CHROOT_OPTIONS -q -y install bison texinfo help2man file po-debconf automake cvs
Reading package lists...
Building dependency tree...
Reading state information...
The following packages were automatically installed and are no longer required:
  diffstat patchutils autoconf2.59 quilt libvolume-id1
Use 'apt-get autoremove' to remove them.
The following extra packages will be installed:
  intltool-debian libmagic1 update-inetd
Suggested packages:
  bison-doc libmail-box-perl texlive-base texlive-latex-base
  texlive-generic-recommended texinfo-doc-nonfree
Recommended packages:
  netbase info info-browser liblocale-gettext-perl libmail-sendmail-perl
The following NEW packages will be installed:
  automake bison cvs file help2man intltool-debian libmagic1 po-debconf
  texinfo update-inetd
0 upgraded, 10 newly installed, 0 to remove and 0 not upgraded.
Need to get 0B/3777kB of archives.
After this operation, 13.6MB of additional disk space will be used.
WARNING: The following packages cannot be authenticated!
  libmagic1 file automake bison update-inetd cvs help2man intltool-debian
  po-debconf texinfo
debconf: unable to initialize frontend: Dialog
debconf: (Dialog frontend will not work on a dumb terminal, an emacs shell buffer, or without a controlling terminal.)
debconf: falling back to frontend: Readline
debconf: unable to initialize frontend: Readline
debconf: (This frontend requires a controlling tty.)
debconf: falling back to frontend: Teletype
dpkg-preconfigure: unable to re-open stdin: 
Authentication warning overridden.
Selecting previously deselected package libmagic1.
(Reading database ... 16677 files and directories currently installed.)
Unpacking libmagic1 (from .../libmagic1_5.03-1ubuntu1_i386.deb) ...
Selecting previously deselected package file.
Unpacking file (from .../file_5.03-1ubuntu1_i386.deb) ...
Selecting previously deselected package automake.
Unpacking automake (from .../automake_1%3a1.10.2-1ubuntu2_all.deb) ...
Selecting previously deselected package bison.
Unpacking bison (from .../bison_1%3a2.4.1.dfsg-1_i386.deb) ...
Selecting previously deselected package update-inetd.
Unpacking update-inetd (from .../update-inetd_4.31_all.deb) ...
Selecting previously deselected package cvs.
Unpacking cvs (from .../cvs_1%3a1.12.13-12ubuntu1_i386.deb) ...
Selecting previously deselected package help2man.
Unpacking help2man (from .../help2man_1.36.4+nmu1_i386.deb) ...
Selecting previously deselected package intltool-debian.
Unpacking intltool-debian (from .../intltool-debian_0.35.0+20060710.1_all.deb) ...
Selecting previously deselected package po-debconf.
Unpacking po-debconf (from .../po-debconf_1.0.16_all.deb) ...
Selecting previously deselected package texinfo.
Unpacking texinfo (from .../texinfo_4.13a.dfsg.1-1_i386.deb) ...
Setting up libmagic1 (5.03-1ubuntu1) ...

Setting up file (5.03-1ubuntu1) ...
Setting up automake (1:1.10.2-1ubuntu2) ...

Setting up bison (1:2.4.1.dfsg-1) ...

Setting up update-inetd (4.31) ...

Setting up cvs (1:1.12.13-12ubuntu1) ...

Setting up help2man (1.36.4+nmu1) ...
Setting up intltool-debian (0.35.0+20060710.1) ...
Setting up po-debconf (1.0.16) ...
Setting up texinfo (4.13a.dfsg.1-1) ...

Processing triggers for libc6 ...
ldconfig deferred processing now taking place
Checking correctness of source dependencies...
Toolchain package versions: libc6-dev_2.9-9ubuntu2 make_3.81-5 dpkg-dev_1.14.24ubuntu2 linux-libc-dev_2.6.30-8.9 g++-4.4_4.4.0-11ubuntu1core2 gcc-4.4_4.4.0-11ubuntu1core2 binutils_2.19.51.20090515-0ubuntu1 libstdc++6_4.4.0-11ubuntu1core2 libstdc++6-4.4-dev_4.4.0-11ubuntu1core2
------------------------------------------------------------------------------
sh: gcc: not found
dpkg-source: warning: Couldn't determine gcc system type, falling back to default (native compilation)
gpg: Signature made Thu May  7 09:52:40 2009 BST using DSA key ID 5662C734
gpg: Can't check signature: public key not found
dpkg-source: extracting flex in flex-2.5.35
dpkg-source: unpacking flex_2.5.35.orig.tar.gz
dpkg-source: applying /home/buildd/build-karmic-autotest/flex_2.5.35-7ubuntu1.diff.gz
dpkg-buildpackage: set CFLAGS to default value: -g -O2
dpkg-buildpackage: set CPPFLAGS to default value: 
dpkg-buildpackage: set LDFLAGS to default value: -Wl,-Bsymbolic-functions
dpkg-buildpackage: set FFLAGS to default value: -g -O2
dpkg-buildpackage: set CXXFLAGS to default value: -g -O2
dpkg-buildpackage: source package flex
dpkg-buildpackage: source version 2.5.35-7ubuntu1
dpkg-buildpackage: host architecture i386
 /usr/bin/fakeroot debian/rules clean
====== making target CLN-common [new prereqs: ]======
====== making target CLN-common [new prereqs: ]======
/usr/bin/make clean -C po || true
make[1]: Entering directory `/build/buildd/flex-2.5.35/po'
make[1]: *** No rule to make target `clean'.  Stop.
make[1]: Leaving directory `/build/buildd/flex-2.5.35/po'
rm -f doc/flex.info doc/flex.info-[0-9] doc/flex.info-[0-9][0-9]
====== making target CLN-indep [new prereqs: CLN-common]======
====== making target CLN-arch [new prereqs: CLN-common]======
====== making target CLEAN/flex-doc [new prereqs: CLN-indep]======
rm -rf /build/buildd/flex-2.5.35/debian/flex-doc
====== making target CLEAN/flex [new prereqs: CLN-arch]======
====== making target clean-indep [new prereqs: CLN-indep flex-doc]======
rm -rf /build/buildd/flex-2.5.35/debian/flex
echo Not modifying templates
Not modifying templates
====== making target clean-arch [new prereqs: CLN-arch flex]======
====== making target clean [new prereqs: clean-indep clean-arch]======
test -f Makefile && /usr/bin/make distclean
make: [clean] Error 1 (ignored)
rm -f	TAGS tags debian/files debian/substvars ChangeLog flex.spec INSTALL Makefile.in aclocal.m4 conf.in config.guess config.sub configure depcomp doc/Makefile.in doc/mdate-sh doc/texinfo.tex examples/Makefile.in examples/fastwc/Makefile.in examples/manual/Makefile.in install-sh m4/Makefile.in missing mkinstalldirs tests/Makefile.in tests/TEMPLATE/Makefile.in tests/test-alloc-extra/Makefile.in tests/test-array-nr/Makefile.in tests/test-array-r/Makefile.in tests/test-basic-nr/Makefile.in tests/test-basic-r/Makefile.in tests/test-bison-nr/Makefile.in tests/test-bison-yylloc/Makefile.in tests/test-bison-yylval/Makefile.in tests/test-c++-basic/Makefile.in tests/test-c++-multiple-scanners/Makefile.in tests/test-c++-yywrap/Makefile.in tests/test-c-cpp-nr/Makefile.in tests/test-c-cpp-r/Makefile.in tests/test-ccl/Makefile.in tests/test-concatenated-options/Makefile.in tests/test-debug-nr/Makefile.in tests/test-debug-r/Makefile.in tests/test-extended/Makefile.in tests/test-header-nr/M
 akefile.in tests/test-header-r/Makefile.in tests/test-include-by-buffer/Makefile.in tests/test-include-by-push/Makefile.in tests/test-include-by-reentrant/Makefile.in tests/test-linedir-r/Makefile.in tests/test-lineno-nr/Makefile.in tests/test-lineno-r/Makefile.in tests/test-mem-nr/Makefile.in tests/test-mem-r/Makefile.in tests/test-multiple-scanners-nr/Makefile.in tests/test-multiple-scanners-r/Makefile.in tests/test-noansi-nr/Makefile.in tests/test-noansi-r/Makefile.in tests/test-posix/Makefile.in tests/test-posixly-correct/Makefile.in tests/test-prefix-nr/Makefile.in tests/test-prefix-r/Makefile.in tests/test-pthread/Makefile.in tests/test-quotes/Makefile.in tests/test-reject/Makefile.in tests/test-rescan-nr/Makefile.in tests/test-rescan-r/Makefile.in tests/test-string-nr/Makefile.in tests/test-string-r/Makefile.in tests/test-table-opts/Makefile.in tests/test-top/Makefile.in tests/test-yyextra/Makefile.in tools/Makefile.in po/Makevars.template ylwrap 
rm -rf doc/flex.html debian/stamp autom4te.cache debian/stamp
rm -f core TAGS						     \
	       `find . ! -regex '.*/\.git/.*' ! -regex '.*/\{arch\}/.*'	     \
		       ! -regex '.*/CVS/.*'   ! -regex '.*/\.arch-ids/.*'    \
		       ! -regex '.*/\.svn/.*'				     \
		   \( -name '*.orig' -o -name '*.rej' -o -name '*~'	  -o \
		      -name '*.bak'  -o -name '#*#'   -o -name '.*.orig'  -o \
		      -name '.*.rej' -o -name '.SUMS' \)		     \
		-print`
 debian/rules build
====== making target debian/stamp/dummy-config-common [new prereqs: ]======
====== making target debian/stamp/do-pre-config-common [new prereqs: dummy-config-common]======
/usr/bin/make -f debian/rules debian/stamp/pre-config-common
make[1]: Entering directory `/build/buildd/flex-2.5.35'
make[1]: warning: -jN forced in submake: disabling jobserver mode.
====== making target debian/stamp/conf/flex [new prereqs: ]======
if ! which flex >/dev/null 2>&1; then                              \
           if [ -e debian/scan.l.md5sum ] &&                               \
              [ "`md5sum scan.l`" = "`cat debian/scan.l.md5sum`" ]; then   \
                if [ scan.l -nt scan.c ]; then                             \
                   echo "scan.l newer than scan.c";                        \
                fi;                                                        \
                touch scan.c;                                              \
           fi;                                                             \
        fi
WARNINGS=none autoreconf --warnings=none -f -i 
Can't exec "libtoolize": No such file or directory at /usr/bin/autoreconf line 188.
Use of uninitialized value $libtoolize in pattern match (m//) at /usr/bin/autoreconf line 188.
Copying file mkinstalldirs
Copying file po/Makevars.template
configure.in:36: installing `./config.guess'
configure.in:36: installing `./config.sub'
configure.in:31: installing `./install-sh'
configure.in:31: installing `./missing'
doc/Makefile.am:3: installing `doc/mdate-sh'
doc/Makefile.am:3: installing `doc/texinfo.tex'
tests/test-table-opts/Makefile.am:33: `:='-style assignments are not portable
tests/test-table-opts/Makefile.am:34: `:='-style assignments are not portable
tests/test-table-opts/Makefile.am:37: `:='-style assignments are not portable
tests/test-table-opts/Makefile.am:37: foreach opt,$(allopts: non-POSIX variable name
tests/test-table-opts/Makefile.am:37: (probably a GNU make extension)
tests/test-table-opts/Makefile.am:38: `:='-style assignments are not portable
tests/test-table-opts/Makefile.am:38: foreach opt,$(allopts: non-POSIX variable name
tests/test-table-opts/Makefile.am:38: (probably a GNU make extension)
tests/test-table-opts/Makefile.am:39: `:='-style assignments are not portable
tests/test-table-opts/Makefile.am:39: foreach opt,$(allopts: non-POSIX variable name
tests/test-table-opts/Makefile.am:39: (probably a GNU make extension)
tests/test-table-opts/Makefile.am:40: `:='-style assignments are not portable
tests/test-table-opts/Makefile.am:43: `:='-style assignments are not portable
tests/test-table-opts/Makefile.am:43: addsuffix $(EXEEXT: non-POSIX variable name
tests/test-table-opts/Makefile.am:43: (probably a GNU make extension)
tests/test-table-opts/Makefile.am:44: `:='-style assignments are not portable
tests/test-table-opts/Makefile.am:44: addsuffix $(EXEEXT: non-POSIX variable name
tests/test-table-opts/Makefile.am:44: (probably a GNU make extension)
tests/test-table-opts/Makefile.am:45: `:='-style assignments are not portable
tests/test-table-opts/Makefile.am:45: addsuffix $(EXEEXT: non-POSIX variable name
tests/test-table-opts/Makefile.am:45: (probably a GNU make extension)
tests/test-table-opts/Makefile.am:46: `:='-style assignments are not portable
tests/test-table-opts/Makefile.am:49: `:='-style assignments are not portable
tests/test-table-opts/Makefile.am:49: addsuffix .c,$(opttests: non-POSIX variable name
tests/test-table-opts/Makefile.am:49: (probably a GNU make extension)
tests/test-table-opts/Makefile.am:50: `:='-style assignments are not portable
tests/test-table-opts/Makefile.am:50: addsuffix .c,$(vertests: non-POSIX variable name
tests/test-table-opts/Makefile.am:50: (probably a GNU make extension)
tests/test-table-opts/Makefile.am:51: `:='-style assignments are not portable
tests/test-table-opts/Makefile.am:51: addsuffix .c,$(sertests: non-POSIX variable name
tests/test-table-opts/Makefile.am:51: (probably a GNU make extension)
tests/test-table-opts/Makefile.am:52: `:='-style assignments are not portable
tests/test-table-opts/Makefile.am:55: `:='-style assignments are not portable
tests/test-table-opts/Makefile.am:55: addsuffix .o,$(opttests: non-POSIX variable name
tests/test-table-opts/Makefile.am:55: (probably a GNU make extension)
tests/test-table-opts/Makefile.am:56: `:='-style assignments are not portable
tests/test-table-opts/Makefile.am:56: addsuffix .o,$(vertests: non-POSIX variable name
tests/test-table-opts/Makefile.am:56: (probably a GNU make extension)
tests/test-table-opts/Makefile.am:57: `:='-style assignments are not portable
tests/test-table-opts/Makefile.am:57: addsuffix .o,$(sertests: non-POSIX variable name
tests/test-table-opts/Makefile.am:57: (probably a GNU make extension)
tests/test-table-opts/Makefile.am:58: `:='-style assignments are not portable
tests/test-table-opts/Makefile.am:61: `:='-style assignments are not portable
tests/test-table-opts/Makefile.am:61: addsuffix .tables,$(sertests: non-POSIX variable name
tests/test-table-opts/Makefile.am:61: (probably a GNU make extension)
tests/test-table-opts/Makefile.am:62: `:='-style assignments are not portable
tests/test-table-opts/Makefile.am:62: addsuffix .tables,$(alltests: non-POSIX variable name
tests/test-table-opts/Makefile.am:62: (probably a GNU make extension)
tests/test-table-opts/Makefile.am:71: `%'-style pattern rules are a GNU make extension
tests/test-table-opts/Makefile.am:72: subst -,_,$(basename $(@F: non-POSIX variable name
tests/test-table-opts/Makefile.am:72: (probably a GNU make extension)
tests/test-table-opts/Makefile.am:74: `%'-style pattern rules are a GNU make extension
tests/test-table-opts/Makefile.am:75: subst -,_,$(basename $(@F: non-POSIX variable name
tests/test-table-opts/Makefile.am:75: (probably a GNU make extension)
tests/test-table-opts/Makefile.am:77: `%'-style pattern rules are a GNU make extension
tests/test-table-opts/Makefile.am:78: subst -,_,$(basename $(@F: non-POSIX variable name
tests/test-table-opts/Makefile.am:78: (probably a GNU make extension)
tests/test-table-opts/Makefile.am:80: `%'-style pattern rules are a GNU make extension
tests/test-table-opts/Makefile.am:81: subst -,_,$(basename $(@F: non-POSIX variable name
tests/test-table-opts/Makefile.am:81: (probably a GNU make extension)
tests/test-table-opts/Makefile.am:83: `%'-style pattern rules are a GNU make extension
tests/test-table-opts/Makefile.am:84: subst -,_,$(basename $(@F: non-POSIX variable name
tests/test-table-opts/Makefile.am:84: (probably a GNU make extension)
tests/test-table-opts/Makefile.am:86: `%'-style pattern rules are a GNU make extension
tests/test-table-opts/Makefile.am:87: subst -,_,$(basename $(@F: non-POSIX variable name
tests/test-table-opts/Makefile.am:87: (probably a GNU make extension)
tests/test-table-opts/Makefile.am:89: `%'-style pattern rules are a GNU make extension
tests/test-table-opts/Makefile.am:92: `%'-style pattern rules are a GNU make extension
tests/test-table-opts/Makefile.am:95: `%'-style pattern rules are a GNU make extension
tests/test-table-opts/Makefile.am:123: `%'-style pattern rules are a GNU make extension
tests/test-table-opts/Makefile.am:124: `%'-style pattern rules are a GNU make extension
tests/test-table-opts/Makefile.am:125: `%'-style pattern rules are a GNU make extension
tests/test-table-opts/Makefile.am:127: `%'-style pattern rules are a GNU make extension
tests/test-table-opts/Makefile.am:128: `%'-style pattern rules are a GNU make extension
tests/test-table-opts/Makefile.am:129: `%'-style pattern rules are a GNU make extension
Makefile.am: installing `./INSTALL'
Makefile.am:73: compiling `libmain.c' with per-target flags requires `AM_PROG_CC_C_O' in `configure.in'
Makefile.am: installing `./depcomp'
configure.in: installing `./ylwrap'
ac_cv_lib_util_getloadavg=no ./configure   --verbose           \
                --prefix=/usr --build i486-linux-gnu 
checking for a BSD-compatible install... /usr/bin/install -c
checking whether build environment is sane... yes
checking for a thread-safe mkdir -p... /bin/mkdir -p
checking for gawk... no
checking for mawk... mawk
checking whether make sets $(MAKE)... yes
checking whether NLS is requested... yes
checking for msgfmt... /usr/bin/msgfmt
checking for gmsgfmt... /usr/bin/msgfmt
checking for xgettext... /usr/bin/xgettext
checking for msgmerge... /usr/bin/msgmerge
checking for style of include used by make... GNU
checking for gcc... gcc
checking for C compiler default output file name... a.out
checking whether the C compiler works... yes
checking whether we are cross compiling... no
checking for suffix of executables... 
checking for suffix of object files... o
checking whether we are using the GNU C compiler... yes
checking whether gcc accepts -g... yes
checking for gcc option to accept ISO C89... none needed
checking dependency style of gcc... gcc3
checking build system type... i486-pc-linux-gnu
checking host system type... i486-pc-linux-gnu
checking for ld used by GCC... /usr/bin/ld
checking if the linker (/usr/bin/ld) is GNU ld... yes
checking for shared library run path origin... done
checking whether NLS is requested... yes
checking for GNU gettext in libc... yes
checking whether to use NLS... yes
checking where the gettext function comes from... libc
checking for bison... bison -y
checking for flex... no
checking for lex... no
checking for gcc... (cached) gcc
checking whether we are using the GNU C compiler... (cached) yes
checking whether gcc accepts -g... (cached) yes
checking for gcc option to accept ISO C89... (cached) none needed
checking dependency style of gcc... (cached) gcc3
checking for g++... g++
checking whether we are using the GNU C++ compiler... yes
checking whether g++ accepts -g... yes
checking dependency style of g++... gcc3
checking whether ln -s works... yes
checking for ranlib... ranlib
checking for gawk... (cached) mawk
checking for a BSD-compatible install... /usr/bin/install -c
checking for bison... /usr/bin/bison
checking for help2man... /usr/bin/help2man
checking for gm4... no
checking for gnum4... no
checking for m4... /usr/bin/m4
checking for GNU m4... yes
checking for indent... indent
configure: WARNING: no indent program found: make indent target will not function
checking how to run the C preprocessor... gcc -E
checking for grep that handles long lines and -e... /bin/grep
checking for egrep... /bin/grep -E
checking for ANSI C header files... yes
checking for sys/types.h... yes
checking for sys/stat.h... yes
checking for stdlib.h... yes
checking for string.h... yes
checking for memory.h... yes
checking for strings.h... yes
checking for inttypes.h... yes
checking for stdint.h... yes
checking for unistd.h... yes
checking for working alloca.h... yes
checking for alloca... yes
checking for ANSI C header files... (cached) yes
checking for sys/wait.h that is POSIX.1 compatible... yes
checking for inttypes.h... (cached) yes
checking libintl.h usability... yes
checking libintl.h presence... yes
checking for libintl.h... yes
checking limits.h usability... yes
checking limits.h presence... yes
checking for limits.h... yes
checking locale.h usability... yes
checking locale.h presence... yes
checking for locale.h... yes
checking malloc.h usability... yes
checking malloc.h presence... yes
checking for malloc.h... yes
checking netinet/in.h usability... yes
checking netinet/in.h presence... yes
checking for netinet/in.h... yes
checking stddef.h usability... yes
checking stddef.h presence... yes
checking for stddef.h... yes
checking for stdlib.h... (cached) yes
checking for string.h... (cached) yes
checking for strings.h... (cached) yes
checking for unistd.h... (cached) yes
checking for log10 in -lm... yes
checking for pthread_mutex_lock in -lpthread... yes
checking pthread.h usability... yes
checking pthread.h presence... yes
checking for pthread.h... yes
checking for stdbool.h that conforms to C99... yes
checking for _Bool... yes
checking for an ANSI C-conforming const... yes
checking for size_t... yes
checking for pid_t... yes
checking vfork.h usability... no
checking vfork.h presence... no
checking for vfork.h... no
checking for fork... yes
checking for vfork... yes
checking for working fork... yes
checking for working vfork... (cached) yes
checking for stdlib.h... (cached) yes
checking for GNU libc compatible malloc... yes
checking for stdlib.h... (cached) yes
checking for GNU libc compatible realloc... yes
checking for dup2... yes
checking for isascii... yes
checking for memset... yes
checking for pow... yes
checking for regcomp... yes
checking for setlocale... yes
checking for strchr... yes
checking for strtol... yes
configure: creating ./config.status
config.status: creating Makefile
config.status: creating doc/Makefile
config.status: creating examples/Makefile
config.status: creating examples/fastwc/Makefile
config.status: creating examples/manual/Makefile
config.status: creating m4/Makefile
config.status: creating po/Makefile.in
config.status: WARNING:  'po/Makefile.in.in' seems to ignore the --datarootdir setting
config.status: creating tools/Makefile
config.status: creating tests/Makefile
config.status: creating tests/TEMPLATE/Makefile
config.status: creating tests/test-array-nr/Makefile
config.status: creating tests/test-array-r/Makefile
config.status: creating tests/test-basic-nr/Makefile
config.status: creating tests/test-basic-r/Makefile
config.status: creating tests/test-bison-yylloc/Makefile
config.status: creating tests/test-bison-yylval/Makefile
config.status: creating tests/test-c-cpp-nr/Makefile
config.status: creating tests/test-c-cpp-r/Makefile
config.status: creating tests/test-header-nr/Makefile
config.status: creating tests/test-header-r/Makefile
config.status: creating tests/test-include-by-buffer/Makefile
config.status: creating tests/test-include-by-push/Makefile
config.status: creating tests/test-include-by-reentrant/Makefile
config.status: creating tests/test-multiple-scanners-nr/Makefile
config.status: creating tests/test-multiple-scanners-r/Makefile
config.status: creating tests/test-noansi-nr/Makefile
config.status: creating tests/test-noansi-r/Makefile
config.status: creating tests/test-prefix-nr/Makefile
config.status: creating tests/test-prefix-r/Makefile
config.status: creating tests/test-pthread/Makefile
config.status: creating tests/test-string-nr/Makefile
config.status: creating tests/test-string-r/Makefile
config.status: creating tests/test-yyextra/Makefile
config.status: creating tests/test-alloc-extra/Makefile
config.status: creating tests/test-lineno-nr/Makefile
config.status: creating tests/test-lineno-r/Makefile
config.status: creating tests/test-linedir-r/Makefile
config.status: creating tests/test-debug-r/Makefile
config.status: creating tests/test-debug-nr/Makefile
config.status: creating tests/test-mem-nr/Makefile
config.status: creating tests/test-mem-r/Makefile
config.status: creating tests/test-posix/Makefile
config.status: creating tests/test-posixly-correct/Makefile
config.status: creating tests/test-table-opts/Makefile
config.status: creating tests/test-c++-basic/Makefile
config.status: creating tests/test-bison-nr/Makefile
config.status: creating tests/test-reject/Makefile
config.status: creating tests/test-c++-multiple-scanners/Makefile
config.status: creating tests/test-top/Makefile
config.status: creating tests/test-rescan-nr/Makefile
config.status: creating tests/test-rescan-r/Makefile
config.status: creating tests/test-quotes/Makefile
config.status: creating tests/test-ccl/Makefile
config.status: creating tests/test-extended/Makefile
config.status: creating tests/test-c++-yywrap/Makefile
config.status: creating tests/test-concatenated-options/Makefile
config.status: creating config.h
config.status: executing default-1 commands
config.status: creating po/POTFILES
config.status: creating po/Makefile
config.status: executing depfiles commands
====== making target debian/stamp/pre-config-common [new prereqs: dummy-config-common flex]======
make[1]: Leaving directory `/build/buildd/flex-2.5.35'
====== making target debian/stamp/do-pre-config-arch [new prereqs: do-pre-config-common]======
====== making target debian/stamp/do-pre-config-indep [new prereqs: do-pre-config-common]======
/usr/bin/make -f debian/rules debian/stamp/pre-config-arch
/usr/bin/make -f debian/rules debian/stamp/pre-config-indep
make[1]: Entering directory `/build/buildd/flex-2.5.35'
make[1]: warning: -jN forced in submake: disabling jobserver mode.
make[1]: Entering directory `/build/buildd/flex-2.5.35'
make[1]: warning: -jN forced in submake: disabling jobserver mode.
====== making target debian/stamp/pre-config-arch [new prereqs: do-pre-config-common]======
make[1]: Leaving directory `/build/buildd/flex-2.5.35'
====== making target debian/stamp/do-configure-arch [new prereqs: do-pre-config-arch]======
====== making target debian/stamp/pre-config-indep [new prereqs: do-pre-config-common]======
/usr/bin/make -f debian/rules debian/stamp/dep-configure-arch
make[1]: Leaving directory `/build/buildd/flex-2.5.35'
====== making target debian/stamp/do-configure-indep [new prereqs: do-pre-config-indep]======
/usr/bin/make -f debian/rules debian/stamp/dep-configure-indep
make[1]: Entering directory `/build/buildd/flex-2.5.35'
make[1]: warning: -jN forced in submake: disabling jobserver mode.
====== making target debian/stamp/CONFIG/flex-doc [new prereqs: do-pre-config-indep]======
====== making target debian/stamp/dep-configure-indep [new prereqs: do-pre-config-indep flex-doc]======
make[1]: Leaving directory `/build/buildd/flex-2.5.35'
====== making target debian/stamp/do-pre-build-indep [new prereqs: do-configure-indep]======
make[1]: Entering directory `/build/buildd/flex-2.5.35'
make[1]: warning: -jN forced in submake: disabling jobserver mode.
====== making target debian/stamp/CONFIG/flex [new prereqs: do-pre-config-arch]======
====== making target debian/stamp/dep-configure-arch [new prereqs: do-pre-config-arch flex]======
make[1]: Leaving directory `/build/buildd/flex-2.5.35'
====== making target debian/stamp/do-pre-build-arch [new prereqs: do-configure-arch]======
make[1]: Entering directory `/build/buildd/flex-2.5.35'
make[1]: warning: -jN forced in submake: disabling jobserver mode.
====== making target debian/stamp/pre-build-common [new prereqs: ]======
make[1]: Leaving directory `/build/buildd/flex-2.5.35'
/usr/bin/make -f debian/rules debian/stamp/pre-build-indep
make[1]: Entering directory `/build/buildd/flex-2.5.35'
make[1]: warning: -jN forced in submake: disabling jobserver mode.
make[1]: `debian/stamp/pre-build-common' is up to date.
make[1]: Leaving directory `/build/buildd/flex-2.5.35'
/usr/bin/make -f debian/rules debian/stamp/pre-build-arch
make[1]: Entering directory `/build/buildd/flex-2.5.35'
make[1]: warning: -jN forced in submake: disabling jobserver mode.
====== making target debian/stamp/pre-build-indep [new prereqs: do-configure-indep]======
make[1]: Leaving directory `/build/buildd/flex-2.5.35'
====== making target debian/stamp/do-build-indep [new prereqs: do-pre-build-indep]======
/usr/bin/make -f debian/rules debian/stamp/dep-build-indep
make[1]: Entering directory `/build/buildd/flex-2.5.35'
make[1]: warning: -jN forced in submake: disabling jobserver mode.
====== making target debian/stamp/pre-build-arch [new prereqs: do-configure-arch]======
make[1]: Leaving directory `/build/buildd/flex-2.5.35'
====== making target debian/stamp/do-build-arch [new prereqs: do-pre-build-arch]======
/usr/bin/make -f debian/rules debian/stamp/dep-build-arch
make[1]: Entering directory `/build/buildd/flex-2.5.35'
make[1]: warning: -jN forced in submake: disabling jobserver mode.
====== making target debian/stamp/build/flex-doc [new prereqs: ]======
/usr/bin/make -C doc flex.info flex.html
make[2]: Entering directory `/build/buildd/flex-2.5.35/doc'
Updating ./version.texi
make[1]: Entering directory `/build/buildd/flex-2.5.35'
make[1]: warning: -jN forced in submake: disabling jobserver mode.
restore=: && backupdir=".am$$" && \
	am__cwd=`pwd` && cd . && \
	rm -rf $backupdir && mkdir $backupdir && \
	if (/bin/bash /build/buildd/flex-2.5.35/missing --run makeinfo --version) >/dev/null 2>&1; then \
	  for f in flex.info flex.info-[0-9] flex.info-[0-9][0-9] flex.i[0-9] flex.i[0-9][0-9]; do \
	    if test -f $f; then mv $f $backupdir; restore=mv; else :; fi; \
	  done; \
	else :; fi && \
	cd "$am__cwd"; \
	if /bin/bash /build/buildd/flex-2.5.35/missing --run makeinfo   -I . \
	 -o flex.info flex.texi; \
	then \
	  rc=0; \
	  cd .; \
	else \
	  rc=$?; \
	  cd . && \
	  $restore $backupdir/* `echo "./flex.info" | sed 's|[^/]*$||'`; \
	fi; \
	rm -rf $backupdir; exit $rc
rm -rf flex.htp
if /bin/bash /build/buildd/flex-2.5.35/missing --run makeinfo --html   -I . \
	 -o flex.htp flex.texi; \
	then \
	  rm -rf flex.html; \
	  if test ! -d flex.htp && test -d flex; then \
	    mv flex flex.html; else mv flex.htp flex.html; fi; \
	else \
	  if test ! -d flex.htp && test -d flex; then \
	    rm -rf flex; else rm -Rf flex.htp flex.html; fi; \
	  exit 1; \
	fi
====== making target debian/stamp/build/flex [new prereqs: ]======
bash -n debian/doc.postinst
bash -n debian/doc.prerm
bash -n debian/postinst
bash -n debian/prerm
test -f stamp-build-flex || /usr/bin/make CC="cc" CFLAGS="-Wall -g -O2 -Wall -D_REENTRANT" LDFLAGS="-Wl,-Bsymbolic-functions -s -s"
make[2]: Entering directory `/build/buildd/flex-2.5.35'
/usr/bin/make  all-recursive
make[3]: Entering directory `/build/buildd/flex-2.5.35'
Making all in .
make[4]: Entering directory `/build/buildd/flex-2.5.35'
cc -DHAVE_CONFIG_H -I.  -DLOCALEDIR=\"/usr/share/locale\" -I./intl   -Wall -g -O2 -Wall -D_REENTRANT -MT libmain.o -MD -MP -MF .deps/libmain.Tpo -c -o libmain.o libmain.c
cc -DHAVE_CONFIG_H -I.  -DLOCALEDIR=\"/usr/share/locale\" -I./intl   -Wall -g -O2 -Wall -D_REENTRANT -MT libyywrap.o -MD -MP -MF .deps/libyywrap.Tpo -c -o libyywrap.o libyywrap.c
mv -f .deps/libyywrap.Tpo .deps/libyywrap.Po
cc -DHAVE_CONFIG_H -I.  -DLOCALEDIR=\"/usr/share/locale\" -I./intl  -fPIC  -Wall -g -O2 -Wall -D_REENTRANT -MT libfl_pic_a-libmain.o -MD -MP -MF .deps/libfl_pic_a-libmain.Tpo -c -o libfl_pic_a-libmain.o `test -f 'libmain.c' || echo './'`libmain.c
mv -f .deps/libfl_pic_a-libmain.Tpo .deps/libfl_pic_a-libmain.Po
cc -DHAVE_CONFIG_H -I.  -DLOCALEDIR=\"/usr/share/locale\" -I./intl  -fPIC  -Wall -g -O2 -Wall -D_REENTRANT -MT libfl_pic_a-libyywrap.o -MD -MP -MF .deps/libfl_pic_a-libyywrap.Tpo -c -o libfl_pic_a-libyywrap.o `test -f 'libyywrap.c' || echo './'`libyywrap.c
mv -f .deps/libmain.Tpo .deps/libmain.Po
cc -DHAVE_CONFIG_H -I.  -DLOCALEDIR=\"/usr/share/locale\" -I./intl   -Wall -g -O2 -Wall -D_REENTRANT -MT ccl.o -MD -MP -MF .deps/ccl.Tpo -c -o ccl.o ccl.c
mv -f .deps/libfl_pic_a-libyywrap.Tpo .deps/libfl_pic_a-libyywrap.Po
cc -DHAVE_CONFIG_H -I.  -DLOCALEDIR=\"/usr/share/locale\" -I./intl   -Wall -g -O2 -Wall -D_REENTRANT -MT dfa.o -MD -MP -MF .deps/dfa.Tpo -c -o dfa.o dfa.c
make[2]: Leaving directory `/build/buildd/flex-2.5.35/doc'
mv -f .deps/ccl.Tpo .deps/ccl.Po
====== making target debian/stamp/BUILD/flex-doc [new prereqs: do-pre-build-indep flex-doc]======
cc -DHAVE_CONFIG_H -I.  -DLOCALEDIR=\"/usr/share/locale\" -I./intl   -Wall -g -O2 -Wall -D_REENTRANT -MT ecs.o -MD -MP -MF .deps/ecs.Tpo -c -o ecs.o ecs.c
====== making target debian/stamp/dep-build-indep [new prereqs: do-pre-build-indep flex-doc]======
make[1]: Leaving directory `/build/buildd/flex-2.5.35'
mv -f .deps/ecs.Tpo .deps/ecs.Po
cc -DHAVE_CONFIG_H -I.  -DLOCALEDIR=\"/usr/share/locale\" -I./intl   -Wall -g -O2 -Wall -D_REENTRANT -MT scanflags.o -MD -MP -MF .deps/scanflags.Tpo -c -o scanflags.o scanflags.c
mv -f .deps/dfa.Tpo .deps/dfa.Po
cc -DHAVE_CONFIG_H -I.  -DLOCALEDIR=\"/usr/share/locale\" -I./intl   -Wall -g -O2 -Wall -D_REENTRANT -MT gen.o -MD -MP -MF .deps/gen.Tpo -c -o gen.o gen.c
mv -f .deps/scanflags.Tpo .deps/scanflags.Po
cc -DHAVE_CONFIG_H -I.  -DLOCALEDIR=\"/usr/share/locale\" -I./intl   -Wall -g -O2 -Wall -D_REENTRANT -MT main.o -MD -MP -MF .deps/main.Tpo -c -o main.o main.c
mv -f .deps/main.Tpo .deps/main.Po
cc -DHAVE_CONFIG_H -I.  -DLOCALEDIR=\"/usr/share/locale\" -I./intl   -Wall -g -O2 -Wall -D_REENTRANT -MT misc.o -MD -MP -MF .deps/misc.Tpo -c -o misc.o misc.c
mv -f .deps/gen.Tpo .deps/gen.Po
cc -DHAVE_CONFIG_H -I.  -DLOCALEDIR=\"/usr/share/locale\" -I./intl   -Wall -g -O2 -Wall -D_REENTRANT -MT nfa.o -MD -MP -MF .deps/nfa.Tpo -c -o nfa.o nfa.c
mv -f .deps/nfa.Tpo .deps/nfa.Po
cc -DHAVE_CONFIG_H -I.  -DLOCALEDIR=\"/usr/share/locale\" -I./intl   -Wall -g -O2 -Wall -D_REENTRANT -MT parse.o -MD -MP -MF .deps/parse.Tpo -c -o parse.o parse.c
mv -f .deps/misc.Tpo .deps/misc.Po
cc -DHAVE_CONFIG_H -I.  -DLOCALEDIR=\"/usr/share/locale\" -I./intl   -Wall -g -O2 -Wall -D_REENTRANT -MT scan.o -MD -MP -MF .deps/scan.Tpo -c -o scan.o scan.c
scan.c: In function 'flexscan':
scan.c:2280: warning: label 'find_rule' defined but not used
mv -f .deps/parse.Tpo .deps/parse.Po
cc -DHAVE_CONFIG_H -I.  -DLOCALEDIR=\"/usr/share/locale\" -I./intl   -Wall -g -O2 -Wall -D_REENTRANT -MT skel.o -MD -MP -MF .deps/skel.Tpo -c -o skel.o skel.c
mv -f .deps/skel.Tpo .deps/skel.Po
cc -DHAVE_CONFIG_H -I.  -DLOCALEDIR=\"/usr/share/locale\" -I./intl   -Wall -g -O2 -Wall -D_REENTRANT -MT sym.o -MD -MP -MF .deps/sym.Tpo -c -o sym.o sym.c
mv -f .deps/sym.Tpo .deps/sym.Po
cc -DHAVE_CONFIG_H -I.  -DLOCALEDIR=\"/usr/share/locale\" -I./intl   -Wall -g -O2 -Wall -D_REENTRANT -MT tblcmp.o -MD -MP -MF .deps/tblcmp.Tpo -c -o tblcmp.o tblcmp.c
mv -f .deps/tblcmp.Tpo .deps/tblcmp.Po
cc -DHAVE_CONFIG_H -I.  -DLOCALEDIR=\"/usr/share/locale\" -I./intl   -Wall -g -O2 -Wall -D_REENTRANT -MT yylex.o -MD -MP -MF .deps/yylex.Tpo -c -o yylex.o yylex.c
mv -f .deps/yylex.Tpo .deps/yylex.Po
cc -DHAVE_CONFIG_H -I.  -DLOCALEDIR=\"/usr/share/locale\" -I./intl   -Wall -g -O2 -Wall -D_REENTRANT -MT options.o -MD -MP -MF .deps/options.Tpo -c -o options.o options.c
mv -f .deps/options.Tpo .deps/options.Po
cc -DHAVE_CONFIG_H -I.  -DLOCALEDIR=\"/usr/share/locale\" -I./intl   -Wall -g -O2 -Wall -D_REENTRANT -MT scanopt.o -MD -MP -MF .deps/scanopt.Tpo -c -o scanopt.o scanopt.c
mv -f .deps/scanopt.Tpo .deps/scanopt.Po
cc -DHAVE_CONFIG_H -I.  -DLOCALEDIR=\"/usr/share/locale\" -I./intl   -Wall -g -O2 -Wall -D_REENTRANT -MT buf.o -MD -MP -MF .deps/buf.Tpo -c -o buf.o buf.c
mv -f .deps/buf.Tpo .deps/buf.Po
cc -DHAVE_CONFIG_H -I.  -DLOCALEDIR=\"/usr/share/locale\" -I./intl   -Wall -g -O2 -Wall -D_REENTRANT -MT tables.o -MD -MP -MF .deps/tables.Tpo -c -o tables.o tables.c
mv -f .deps/scan.Tpo .deps/scan.Po
cc -DHAVE_CONFIG_H -I.  -DLOCALEDIR=\"/usr/share/locale\" -I./intl   -Wall -g -O2 -Wall -D_REENTRANT -MT tables_shared.o -MD -MP -MF .deps/tables_shared.Tpo -c -o tables_shared.o tables_shared.c
tables.c:340: warning: 'yytbl_data_getijk' defined but not used
mv -f .deps/tables_shared.Tpo .deps/tables_shared.Po
cc -DHAVE_CONFIG_H -I.  -DLOCALEDIR=\"/usr/share/locale\" -I./intl   -Wall -g -O2 -Wall -D_REENTRANT -MT filter.o -MD -MP -MF .deps/filter.Tpo -c -o filter.o filter.c
mv -f .deps/tables.Tpo .deps/tables.Po
cc -DHAVE_CONFIG_H -I.  -DLOCALEDIR=\"/usr/share/locale\" -I./intl   -Wall -g -O2 -Wall -D_REENTRANT -MT regex.o -MD -MP -MF .deps/regex.Tpo -c -o regex.o regex.c
mv -f .deps/filter.Tpo .deps/filter.Po
rm -f libfl.a
ar cru libfl.a libmain.o libyywrap.o 
ranlib libfl.a
rm -f libfl_pic.a
ar cru libfl_pic.a libfl_pic_a-libmain.o libfl_pic_a-libyywrap.o 
ranlib libfl_pic.a
mv -f .deps/regex.Tpo .deps/regex.Po
cc  -Wall -g -O2 -Wall -D_REENTRANT  -Wl,-Bsymbolic-functions -s -s -o flex ccl.o dfa.o ecs.o scanflags.o gen.o main.o misc.o nfa.o parse.o scan.o skel.o sym.o tblcmp.o yylex.o options.o scanopt.o buf.o tables.o tables_shared.o filter.o regex.o  -lm 
make[4]: Leaving directory `/build/buildd/flex-2.5.35'
Making all in doc
make[4]: Entering directory `/build/buildd/flex-2.5.35/doc'
make[4]: Nothing to be done for `all'.
make[4]: Leaving directory `/build/buildd/flex-2.5.35/doc'
Making all in m4
make[4]: Entering directory `/build/buildd/flex-2.5.35/m4'
make[4]: Nothing to be done for `all'.
make[4]: Leaving directory `/build/buildd/flex-2.5.35/m4'
Making all in examples
make[4]: Entering directory `/build/buildd/flex-2.5.35/examples'
Making all in manual
make[5]: Entering directory `/build/buildd/flex-2.5.35/examples/manual'
make[5]: Nothing to be done for `all'.
make[5]: Leaving directory `/build/buildd/flex-2.5.35/examples/manual'
Making all in fastwc
make[5]: Entering directory `/build/buildd/flex-2.5.35/examples/fastwc'
make[5]: Nothing to be done for `all'.
make[5]: Leaving directory `/build/buildd/flex-2.5.35/examples/fastwc'
make[5]: Entering directory `/build/buildd/flex-2.5.35/examples'
make[5]: Nothing to be done for `all-am'.
make[5]: Leaving directory `/build/buildd/flex-2.5.35/examples'
make[4]: Leaving directory `/build/buildd/flex-2.5.35/examples'
Making all in po
make[4]: Entering directory `/build/buildd/flex-2.5.35/po'
make[4]: Nothing to be done for `all'.
make[4]: Leaving directory `/build/buildd/flex-2.5.35/po'
Making all in tools
make[4]: Entering directory `/build/buildd/flex-2.5.35/tools'
make[4]: Nothing to be done for `all'.
make[4]: Leaving directory `/build/buildd/flex-2.5.35/tools'
Making all in tests
make[4]: Entering directory `/build/buildd/flex-2.5.35/tests'
Making all in test-concatenated-options
make[5]: Entering directory `/build/buildd/flex-2.5.35/tests/test-concatenated-options'
make[5]: Nothing to be done for `all'.
make[5]: Leaving directory `/build/buildd/flex-2.5.35/tests/test-concatenated-options'
Making all in test-c++-yywrap
make[5]: Entering directory `/build/buildd/flex-2.5.35/tests/test-c++-yywrap'
make[5]: Nothing to be done for `all'.
make[5]: Leaving directory `/build/buildd/flex-2.5.35/tests/test-c++-yywrap'
Making all in test-extended
make[5]: Entering directory `/build/buildd/flex-2.5.35/tests/test-extended'
make[5]: Nothing to be done for `all'.
make[5]: Leaving directory `/build/buildd/flex-2.5.35/tests/test-extended'
Making all in test-ccl
make[5]: Entering directory `/build/buildd/flex-2.5.35/tests/test-ccl'
make[5]: Nothing to be done for `all'.
make[5]: Leaving directory `/build/buildd/flex-2.5.35/tests/test-ccl'
Making all in test-quotes
make[5]: Entering directory `/build/buildd/flex-2.5.35/tests/test-quotes'
make[5]: Nothing to be done for `all'.
make[5]: Leaving directory `/build/buildd/flex-2.5.35/tests/test-quotes'
Making all in test-rescan-r
make[5]: Entering directory `/build/buildd/flex-2.5.35/tests/test-rescan-r'
make[5]: Nothing to be done for `all'.
make[5]: Leaving directory `/build/buildd/flex-2.5.35/tests/test-rescan-r'
Making all in test-rescan-nr
make[5]: Entering directory `/build/buildd/flex-2.5.35/tests/test-rescan-nr'
make[5]: Nothing to be done for `all'.
make[5]: Leaving directory `/build/buildd/flex-2.5.35/tests/test-rescan-nr'
Making all in test-basic-nr
make[5]: Entering directory `/build/buildd/flex-2.5.35/tests/test-basic-nr'
make[5]: Nothing to be done for `all'.
make[5]: Leaving directory `/build/buildd/flex-2.5.35/tests/test-basic-nr'
Making all in test-basic-r
make[5]: Entering directory `/build/buildd/flex-2.5.35/tests/test-basic-r'
make[5]: Nothing to be done for `all'.
make[5]: Leaving directory `/build/buildd/flex-2.5.35/tests/test-basic-r'
Making all in test-bison-yylloc
make[5]: Entering directory `/build/buildd/flex-2.5.35/tests/test-bison-yylloc'
make[5]: Nothing to be done for `all'.
make[5]: Leaving directory `/build/buildd/flex-2.5.35/tests/test-bison-yylloc'
Making all in test-bison-yylval
make[5]: Entering directory `/build/buildd/flex-2.5.35/tests/test-bison-yylval'
make[5]: Nothing to be done for `all'.
make[5]: Leaving directory `/build/buildd/flex-2.5.35/tests/test-bison-yylval'
Making all in test-bison-nr
make[5]: Entering directory `/build/buildd/flex-2.5.35/tests/test-bison-nr'
make[5]: Nothing to be done for `all'.
make[5]: Leaving directory `/build/buildd/flex-2.5.35/tests/test-bison-nr'
Making all in test-multiple-scanners-nr
make[5]: Entering directory `/build/buildd/flex-2.5.35/tests/test-multiple-scanners-nr'
make[5]: Nothing to be done for `all'.
make[5]: Leaving directory `/build/buildd/flex-2.5.35/tests/test-multiple-scanners-nr'
Making all in test-multiple-scanners-r
make[5]: Entering directory `/build/buildd/flex-2.5.35/tests/test-multiple-scanners-r'
make[5]: Nothing to be done for `all'.
make[5]: Leaving directory `/build/buildd/flex-2.5.35/tests/test-multiple-scanners-r'
Making all in test-header-nr
make[5]: Entering directory `/build/buildd/flex-2.5.35/tests/test-header-nr'
make[5]: Nothing to be done for `all'.
make[5]: Leaving directory `/build/buildd/flex-2.5.35/tests/test-header-nr'
Making all in test-header-r
make[5]: Entering directory `/build/buildd/flex-2.5.35/tests/test-header-r'
make[5]: Nothing to be done for `all'.
make[5]: Leaving directory `/build/buildd/flex-2.5.35/tests/test-header-r'
Making all in test-reject
make[5]: Entering directory `/build/buildd/flex-2.5.35/tests/test-reject'
make[5]: Nothing to be done for `all'.
make[5]: Leaving directory `/build/buildd/flex-2.5.35/tests/test-reject'
Making all in test-c++-multiple-scanners
make[5]: Entering directory `/build/buildd/flex-2.5.35/tests/test-c++-multiple-scanners'
make[5]: Nothing to be done for `all'.
make[5]: Leaving directory `/build/buildd/flex-2.5.35/tests/test-c++-multiple-scanners'
Making all in test-c++-basic
make[5]: Entering directory `/build/buildd/flex-2.5.35/tests/test-c++-basic'
make[5]: Nothing to be done for `all'.
make[5]: Leaving directory `/build/buildd/flex-2.5.35/tests/test-c++-basic'
Making all in test-posixly-correct
make[5]: Entering directory `/build/buildd/flex-2.5.35/tests/test-posixly-correct'
make[5]: Nothing to be done for `all'.
make[5]: Leaving directory `/build/buildd/flex-2.5.35/tests/test-posixly-correct'
Making all in test-posix
make[5]: Entering directory `/build/buildd/flex-2.5.35/tests/test-posix'
make[5]: Nothing to be done for `all'.
make[5]: Leaving directory `/build/buildd/flex-2.5.35/tests/test-posix'
Making all in test-mem-r
make[5]: Entering directory `/build/buildd/flex-2.5.35/tests/test-mem-r'
make[5]: Nothing to be done for `all'.
make[5]: Leaving directory `/build/buildd/flex-2.5.35/tests/test-mem-r'
Making all in test-mem-nr
make[5]: Entering directory `/build/buildd/flex-2.5.35/tests/test-mem-nr'
make[5]: Nothing to be done for `all'.
make[5]: Leaving directory `/build/buildd/flex-2.5.35/tests/test-mem-nr'
Making all in test-debug-nr
make[5]: Entering directory `/build/buildd/flex-2.5.35/tests/test-debug-nr'
make[5]: Nothing to be done for `all'.
make[5]: Leaving directory `/build/buildd/flex-2.5.35/tests/test-debug-nr'
Making all in test-debug-r
make[5]: Entering directory `/build/buildd/flex-2.5.35/tests/test-debug-r'
make[5]: Nothing to be done for `all'.
make[5]: Leaving directory `/build/buildd/flex-2.5.35/tests/test-debug-r'
Making all in test-lineno-r
make[5]: Entering directory `/build/buildd/flex-2.5.35/tests/test-lineno-r'
make[5]: Nothing to be done for `all'.
make[5]: Leaving directory `/build/buildd/flex-2.5.35/tests/test-lineno-r'
Making all in test-lineno-nr
make[5]: Entering directory `/build/buildd/flex-2.5.35/tests/test-lineno-nr'
make[5]: Nothing to be done for `all'.
make[5]: Leaving directory `/build/buildd/flex-2.5.35/tests/test-lineno-nr'
Making all in test-linedir-r
make[5]: Entering directory `/build/buildd/flex-2.5.35/tests/test-linedir-r'
make[5]: Nothing to be done for `all'.
make[5]: Leaving directory `/build/buildd/flex-2.5.35/tests/test-linedir-r'
Making all in test-array-nr
make[5]: Entering directory `/build/buildd/flex-2.5.35/tests/test-array-nr'
make[5]: Nothing to be done for `all'.
make[5]: Leaving directory `/build/buildd/flex-2.5.35/tests/test-array-nr'
Making all in test-array-r
make[5]: Entering directory `/build/buildd/flex-2.5.35/tests/test-array-r'
make[5]: Nothing to be done for `all'.
make[5]: Leaving directory `/build/buildd/flex-2.5.35/tests/test-array-r'
Making all in test-c-cpp-nr
make[5]: Entering directory `/build/buildd/flex-2.5.35/tests/test-c-cpp-nr'
make[5]: Nothing to be done for `all'.
make[5]: Leaving directory `/build/buildd/flex-2.5.35/tests/test-c-cpp-nr'
Making all in test-c-cpp-r
make[5]: Entering directory `/build/buildd/flex-2.5.35/tests/test-c-cpp-r'
make[5]: Nothing to be done for `all'.
make[5]: Leaving directory `/build/buildd/flex-2.5.35/tests/test-c-cpp-r'
Making all in test-include-by-buffer
make[5]: Entering directory `/build/buildd/flex-2.5.35/tests/test-include-by-buffer'
make[5]: Nothing to be done for `all'.
make[5]: Leaving directory `/build/buildd/flex-2.5.35/tests/test-include-by-buffer'
Making all in test-include-by-push
make[5]: Entering directory `/build/buildd/flex-2.5.35/tests/test-include-by-push'
make[5]: Nothing to be done for `all'.
make[5]: Leaving directory `/build/buildd/flex-2.5.35/tests/test-include-by-push'
Making all in test-include-by-reentrant
make[5]: Entering directory `/build/buildd/flex-2.5.35/tests/test-include-by-reentrant'
make[5]: Nothing to be done for `all'.
make[5]: Leaving directory `/build/buildd/flex-2.5.35/tests/test-include-by-reentrant'
Making all in test-prefix-nr
make[5]: Entering directory `/build/buildd/flex-2.5.35/tests/test-prefix-nr'
make[5]: Nothing to be done for `all'.
make[5]: Leaving directory `/build/buildd/flex-2.5.35/tests/test-prefix-nr'
Making all in test-prefix-r
make[5]: Entering directory `/build/buildd/flex-2.5.35/tests/test-prefix-r'
make[5]: Nothing to be done for `all'.
make[5]: Leaving directory `/build/buildd/flex-2.5.35/tests/test-prefix-r'
Making all in test-pthread
make[5]: Entering directory `/build/buildd/flex-2.5.35/tests/test-pthread'
make[5]: Nothing to be done for `all'.
make[5]: Leaving directory `/build/buildd/flex-2.5.35/tests/test-pthread'
Making all in test-string-nr
make[5]: Entering directory `/build/buildd/flex-2.5.35/tests/test-string-nr'
make[5]: Nothing to be done for `all'.
make[5]: Leaving directory `/build/buildd/flex-2.5.35/tests/test-string-nr'
Making all in test-string-r
make[5]: Entering directory `/build/buildd/flex-2.5.35/tests/test-string-r'
make[5]: Nothing to be done for `all'.
make[5]: Leaving directory `/build/buildd/flex-2.5.35/tests/test-string-r'
Making all in test-yyextra
make[5]: Entering directory `/build/buildd/flex-2.5.35/tests/test-yyextra'
make[5]: Nothing to be done for `all'.
make[5]: Leaving directory `/build/buildd/flex-2.5.35/tests/test-yyextra'
Making all in test-alloc-extra
make[5]: Entering directory `/build/buildd/flex-2.5.35/tests/test-alloc-extra'
make[5]: Nothing to be done for `all'.
make[5]: Leaving directory `/build/buildd/flex-2.5.35/tests/test-alloc-extra'
Making all in test-noansi-nr
make[5]: Entering directory `/build/buildd/flex-2.5.35/tests/test-noansi-nr'
make[5]: Nothing to be done for `all'.
make[5]: Leaving directory `/build/buildd/flex-2.5.35/tests/test-noansi-nr'
Making all in test-noansi-r
make[5]: Entering directory `/build/buildd/flex-2.5.35/tests/test-noansi-r'
make[5]: Nothing to be done for `all'.
make[5]: Leaving directory `/build/buildd/flex-2.5.35/tests/test-noansi-r'
Making all in test-top
make[5]: Entering directory `/build/buildd/flex-2.5.35/tests/test-top'
make[5]: Nothing to be done for `all'.
make[5]: Leaving directory `/build/buildd/flex-2.5.35/tests/test-top'
Making all in test-table-opts
make[5]: Entering directory `/build/buildd/flex-2.5.35/tests/test-table-opts'
make[5]: Nothing to be done for `all'.
make[5]: Leaving directory `/build/buildd/flex-2.5.35/tests/test-table-opts'
make[5]: Entering directory `/build/buildd/flex-2.5.35/tests'
make[5]: Nothing to be done for `all-am'.
make[5]: Leaving directory `/build/buildd/flex-2.5.35/tests'
make[4]: Leaving directory `/build/buildd/flex-2.5.35/tests'
make[3]: Leaving directory `/build/buildd/flex-2.5.35'
make[2]: Leaving directory `/build/buildd/flex-2.5.35'
test -f stamp-build-flex || /usr/bin/make -C po
make[2]: Entering directory `/build/buildd/flex-2.5.35/po'
make[2]: Nothing to be done for `all'.
make[2]: Leaving directory `/build/buildd/flex-2.5.35/po'
test -f stamp-build-flex || /usr/bin/make check
make[2]: Entering directory `/build/buildd/flex-2.5.35'
/usr/bin/make  check-recursive
make[3]: Entering directory `/build/buildd/flex-2.5.35'
Making check in .
make[4]: Entering directory `/build/buildd/flex-2.5.35'
make[4]: Nothing to be done for `check-am'.
make[4]: Leaving directory `/build/buildd/flex-2.5.35'
Making check in doc
make[4]: Entering directory `/build/buildd/flex-2.5.35/doc'
make[4]: Nothing to be done for `check'.
make[4]: Leaving directory `/build/buildd/flex-2.5.35/doc'
Making check in m4
make[4]: Entering directory `/build/buildd/flex-2.5.35/m4'
make[4]: Nothing to be done for `check'.
make[4]: Leaving directory `/build/buildd/flex-2.5.35/m4'
Making check in examples
make[4]: Entering directory `/build/buildd/flex-2.5.35/examples'
Making check in manual
make[5]: Entering directory `/build/buildd/flex-2.5.35/examples/manual'
make[5]: Nothing to be done for `check'.
make[5]: Leaving directory `/build/buildd/flex-2.5.35/examples/manual'
Making check in fastwc
make[5]: Entering directory `/build/buildd/flex-2.5.35/examples/fastwc'
make[5]: Nothing to be done for `check'.
make[5]: Leaving directory `/build/buildd/flex-2.5.35/examples/fastwc'
make[5]: Entering directory `/build/buildd/flex-2.5.35/examples'
make[5]: Nothing to be done for `check-am'.
make[5]: Leaving directory `/build/buildd/flex-2.5.35/examples'
make[4]: Leaving directory `/build/buildd/flex-2.5.35/examples'
Making check in po
make[4]: Entering directory `/build/buildd/flex-2.5.35/po'
make[4]: Nothing to be done for `check'.
make[4]: Leaving directory `/build/buildd/flex-2.5.35/po'
Making check in tools
make[4]: Entering directory `/build/buildd/flex-2.5.35/tools'
make[4]: Nothing to be done for `check'.
make[4]: Leaving directory `/build/buildd/flex-2.5.35/tools'
Making check in tests
make[4]: Entering directory `/build/buildd/flex-2.5.35/tests'
Making check in test-concatenated-options
make[5]: Entering directory `/build/buildd/flex-2.5.35/tests/test-concatenated-options'
make[5]: Nothing to be done for `check'.
make[5]: Leaving directory `/build/buildd/flex-2.5.35/tests/test-concatenated-options'
Making check in test-c++-yywrap
make[5]: Entering directory `/build/buildd/flex-2.5.35/tests/test-c++-yywrap'
make[5]: Nothing to be done for `check'.
make[5]: Leaving directory `/build/buildd/flex-2.5.35/tests/test-c++-yywrap'
Making check in test-extended
make[5]: Entering directory `/build/buildd/flex-2.5.35/tests/test-extended'
make[5]: Nothing to be done for `check'.
make[5]: Leaving directory `/build/buildd/flex-2.5.35/tests/test-extended'
Making check in test-ccl
make[5]: Entering directory `/build/buildd/flex-2.5.35/tests/test-ccl'
make[5]: Nothing to be done for `check'.
make[5]: Leaving directory `/build/buildd/flex-2.5.35/tests/test-ccl'
Making check in test-quotes
make[5]: Entering directory `/build/buildd/flex-2.5.35/tests/test-quotes'
make[5]: Nothing to be done for `check'.
make[5]: Leaving directory `/build/buildd/flex-2.5.35/tests/test-quotes'
Making check in test-rescan-r
make[5]: Entering directory `/build/buildd/flex-2.5.35/tests/test-rescan-r'
make[5]: Nothing to be done for `check'.
make[5]: Leaving directory `/build/buildd/flex-2.5.35/tests/test-rescan-r'
Making check in test-rescan-nr
make[5]: Entering directory `/build/buildd/flex-2.5.35/tests/test-rescan-nr'
make[5]: Nothing to be done for `check'.
make[5]: Leaving directory `/build/buildd/flex-2.5.35/tests/test-rescan-nr'
Making check in test-basic-nr
make[5]: Entering directory `/build/buildd/flex-2.5.35/tests/test-basic-nr'
make[5]: Nothing to be done for `check'.
make[5]: Leaving directory `/build/buildd/flex-2.5.35/tests/test-basic-nr'
Making check in test-basic-r
make[5]: Entering directory `/build/buildd/flex-2.5.35/tests/test-basic-r'
make[5]: Nothing to be done for `check'.
make[5]: Leaving directory `/build/buildd/flex-2.5.35/tests/test-basic-r'
Making check in test-bison-yylloc
make[5]: Entering directory `/build/buildd/flex-2.5.35/tests/test-bison-yylloc'
make[5]: Nothing to be done for `check'.
make[5]: Leaving directory `/build/buildd/flex-2.5.35/tests/test-bison-yylloc'
Making check in test-bison-yylval
make[5]: Entering directory `/build/buildd/flex-2.5.35/tests/test-bison-yylval'
make[5]: Nothing to be done for `check'.
make[5]: Leaving directory `/build/buildd/flex-2.5.35/tests/test-bison-yylval'
Making check in test-bison-nr
make[5]: Entering directory `/build/buildd/flex-2.5.35/tests/test-bison-nr'
make[5]: Nothing to be done for `check'.
make[5]: Leaving directory `/build/buildd/flex-2.5.35/tests/test-bison-nr'
Making check in test-multiple-scanners-nr
make[5]: Entering directory `/build/buildd/flex-2.5.35/tests/test-multiple-scanners-nr'
make[5]: Nothing to be done for `check'.
make[5]: Leaving directory `/build/buildd/flex-2.5.35/tests/test-multiple-scanners-nr'
Making check in test-multiple-scanners-r
make[5]: Entering directory `/build/buildd/flex-2.5.35/tests/test-multiple-scanners-r'
make[5]: Nothing to be done for `check'.
make[5]: Leaving directory `/build/buildd/flex-2.5.35/tests/test-multiple-scanners-r'
Making check in test-header-nr
make[5]: Entering directory `/build/buildd/flex-2.5.35/tests/test-header-nr'
make[5]: Nothing to be done for `check'.
make[5]: Leaving directory `/build/buildd/flex-2.5.35/tests/test-header-nr'
Making check in test-header-r
make[5]: Entering directory `/build/buildd/flex-2.5.35/tests/test-header-r'
make[5]: Nothing to be done for `check'.
make[5]: Leaving directory `/build/buildd/flex-2.5.35/tests/test-header-r'
Making check in test-reject
make[5]: Entering directory `/build/buildd/flex-2.5.35/tests/test-reject'
make[5]: Nothing to be done for `check'.
make[5]: Leaving directory `/build/buildd/flex-2.5.35/tests/test-reject'
Making check in test-c++-multiple-scanners
make[5]: Entering directory `/build/buildd/flex-2.5.35/tests/test-c++-multiple-scanners'
make[5]: Nothing to be done for `check'.
make[5]: Leaving directory `/build/buildd/flex-2.5.35/tests/test-c++-multiple-scanners'
Making check in test-c++-basic
make[5]: Entering directory `/build/buildd/flex-2.5.35/tests/test-c++-basic'
make[5]: Nothing to be done for `check'.
make[5]: Leaving directory `/build/buildd/flex-2.5.35/tests/test-c++-basic'
Making check in test-posixly-correct
make[5]: Entering directory `/build/buildd/flex-2.5.35/tests/test-posixly-correct'
make[5]: Nothing to be done for `check'.
make[5]: Leaving directory `/build/buildd/flex-2.5.35/tests/test-posixly-correct'
Making check in test-posix
make[5]: Entering directory `/build/buildd/flex-2.5.35/tests/test-posix'
make[5]: Nothing to be done for `check'.
make[5]: Leaving directory `/build/buildd/flex-2.5.35/tests/test-posix'
Making check in test-mem-r
make[5]: Entering directory `/build/buildd/flex-2.5.35/tests/test-mem-r'
make[5]: Nothing to be done for `check'.
make[5]: Leaving directory `/build/buildd/flex-2.5.35/tests/test-mem-r'
Making check in test-mem-nr
make[5]: Entering directory `/build/buildd/flex-2.5.35/tests/test-mem-nr'
make[5]: Nothing to be done for `check'.
make[5]: Leaving directory `/build/buildd/flex-2.5.35/tests/test-mem-nr'
Making check in test-debug-nr
make[5]: Entering directory `/build/buildd/flex-2.5.35/tests/test-debug-nr'
make[5]: Nothing to be done for `check'.
make[5]: Leaving directory `/build/buildd/flex-2.5.35/tests/test-debug-nr'
Making check in test-debug-r
make[5]: Entering directory `/build/buildd/flex-2.5.35/tests/test-debug-r'
make[5]: Nothing to be done for `check'.
make[5]: Leaving directory `/build/buildd/flex-2.5.35/tests/test-debug-r'
Making check in test-lineno-r
make[5]: Entering directory `/build/buildd/flex-2.5.35/tests/test-lineno-r'
make[5]: Nothing to be done for `check'.
make[5]: Leaving directory `/build/buildd/flex-2.5.35/tests/test-lineno-r'
Making check in test-lineno-nr
make[5]: Entering directory `/build/buildd/flex-2.5.35/tests/test-lineno-nr'
make[5]: Nothing to be done for `check'.
make[5]: Leaving directory `/build/buildd/flex-2.5.35/tests/test-lineno-nr'
Making check in test-linedir-r
make[5]: Entering directory `/build/buildd/flex-2.5.35/tests/test-linedir-r'
make[5]: Nothing to be done for `check'.
make[5]: Leaving directory `/build/buildd/flex-2.5.35/tests/test-linedir-r'
Making check in test-array-nr
make[5]: Entering directory `/build/buildd/flex-2.5.35/tests/test-array-nr'
make[5]: Nothing to be done for `check'.
make[5]: Leaving directory `/build/buildd/flex-2.5.35/tests/test-array-nr'
Making check in test-array-r
make[5]: Entering directory `/build/buildd/flex-2.5.35/tests/test-array-r'
make[5]: Nothing to be done for `check'.
make[5]: Leaving directory `/build/buildd/flex-2.5.35/tests/test-array-r'
Making check in test-c-cpp-nr
make[5]: Entering directory `/build/buildd/flex-2.5.35/tests/test-c-cpp-nr'
make[5]: Nothing to be done for `check'.
make[5]: Leaving directory `/build/buildd/flex-2.5.35/tests/test-c-cpp-nr'
Making check in test-c-cpp-r
make[5]: Entering directory `/build/buildd/flex-2.5.35/tests/test-c-cpp-r'
make[5]: Nothing to be done for `check'.
make[5]: Leaving directory `/build/buildd/flex-2.5.35/tests/test-c-cpp-r'
Making check in test-include-by-buffer
make[5]: Entering directory `/build/buildd/flex-2.5.35/tests/test-include-by-buffer'
make[5]: Nothing to be done for `check'.
make[5]: Leaving directory `/build/buildd/flex-2.5.35/tests/test-include-by-buffer'
Making check in test-include-by-push
make[5]: Entering directory `/build/buildd/flex-2.5.35/tests/test-include-by-push'
make[5]: Nothing to be done for `check'.
make[5]: Leaving directory `/build/buildd/flex-2.5.35/tests/test-include-by-push'
Making check in test-include-by-reentrant
make[5]: Entering directory `/build/buildd/flex-2.5.35/tests/test-include-by-reentrant'
make[5]: Nothing to be done for `check'.
make[5]: Leaving directory `/build/buildd/flex-2.5.35/tests/test-include-by-reentrant'
Making check in test-prefix-nr
make[5]: Entering directory `/build/buildd/flex-2.5.35/tests/test-prefix-nr'
make[5]: Nothing to be done for `check'.
make[5]: Leaving directory `/build/buildd/flex-2.5.35/tests/test-prefix-nr'
Making check in test-prefix-r
make[5]: Entering directory `/build/buildd/flex-2.5.35/tests/test-prefix-r'
make[5]: Nothing to be done for `check'.
make[5]: Leaving directory `/build/buildd/flex-2.5.35/tests/test-prefix-r'
Making check in test-pthread
make[5]: Entering directory `/build/buildd/flex-2.5.35/tests/test-pthread'
make[5]: Nothing to be done for `check'.
make[5]: Leaving directory `/build/buildd/flex-2.5.35/tests/test-pthread'
Making check in test-string-nr
make[5]: Entering directory `/build/buildd/flex-2.5.35/tests/test-string-nr'
make[5]: Nothing to be done for `check'.
make[5]: Leaving directory `/build/buildd/flex-2.5.35/tests/test-string-nr'
Making check in test-string-r
make[5]: Entering directory `/build/buildd/flex-2.5.35/tests/test-string-r'
make[5]: Nothing to be done for `check'.
make[5]: Leaving directory `/build/buildd/flex-2.5.35/tests/test-string-r'
Making check in test-yyextra
make[5]: Entering directory `/build/buildd/flex-2.5.35/tests/test-yyextra'
make[5]: Nothing to be done for `check'.
make[5]: Leaving directory `/build/buildd/flex-2.5.35/tests/test-yyextra'
Making check in test-alloc-extra
make[5]: Entering directory `/build/buildd/flex-2.5.35/tests/test-alloc-extra'
make[5]: Nothing to be done for `check'.
make[5]: Leaving directory `/build/buildd/flex-2.5.35/tests/test-alloc-extra'
Making check in test-noansi-nr
make[5]: Entering directory `/build/buildd/flex-2.5.35/tests/test-noansi-nr'
make[5]: Nothing to be done for `check'.
make[5]: Leaving directory `/build/buildd/flex-2.5.35/tests/test-noansi-nr'
Making check in test-noansi-r
make[5]: Entering directory `/build/buildd/flex-2.5.35/tests/test-noansi-r'
make[5]: Nothing to be done for `check'.
make[5]: Leaving directory `/build/buildd/flex-2.5.35/tests/test-noansi-r'
Making check in test-top
make[5]: Entering directory `/build/buildd/flex-2.5.35/tests/test-top'
make[5]: Nothing to be done for `check'.
make[5]: Leaving directory `/build/buildd/flex-2.5.35/tests/test-top'
Making check in test-table-opts
make[5]: Entering directory `/build/buildd/flex-2.5.35/tests/test-table-opts'
make[5]: Nothing to be done for `check'.
make[5]: Leaving directory `/build/buildd/flex-2.5.35/tests/test-table-opts'
make[5]: Entering directory `/build/buildd/flex-2.5.35/tests'
/usr/bin/make  check-local
make[6]: Entering directory `/build/buildd/flex-2.5.35/tests'
Making clean in test-table-opts
make[7]: Entering directory `/build/buildd/flex-2.5.35/tests/test-table-opts'
test -z "scanner.c OUTPUT test-opt-nr-Ca.o test-opt-r-Ca.o test-opt-nr-Ce.o test-opt-r-Ce.o test-opt-nr-Cf.o test-opt-r-Cf.o test-opt-nr-CF.o test-opt-r-CF.o test-opt-nr-Cm.o test-opt-r-Cm.o test-opt-nr-Cem.o test-opt-r-Cem.o test-opt-nr-Cae.o test-opt-r-Cae.o test-opt-nr-Caef.o test-opt-r-Caef.o test-opt-nr-CaeF.o test-opt-r-CaeF.o test-opt-nr-Cam.o test-opt-r-Cam.o test-opt-nr-Caem.o test-opt-r-Caem.o test-ver-nr-Ca.o test-ver-r-Ca.o test-ver-nr-Ce.o test-ver-r-Ce.o test-ver-nr-Cf.o test-ver-r-Cf.o test-ver-nr-CF.o test-ver-r-CF.o test-ver-nr-Cm.o test-ver-r-Cm.o test-ver-nr-Cem.o test-ver-r-Cem.o test-ver-nr-Cae.o test-ver-r-Cae.o test-ver-nr-Caef.o test-ver-r-Caef.o test-ver-nr-CaeF.o test-ver-r-CaeF.o test-ver-nr-Cam.o test-ver-r-Cam.o test-ver-nr-Caem.o test-ver-r-Caem.o test-ser-nr-Ca.o test-ser-r-Ca.o test-ser-nr-Ce.o test-ser-r-Ce.o test-ser-nr-Cf.o test-ser-r-Cf.o test-ser-nr-CF.o test-ser-r-CF.o test-ser-nr-Cm.o test-ser-r-Cm.o test-ser-nr-Cem.o test-ser-r-Cem.o te
 st-ser-nr-Cae.o test-ser-r-Cae.o test-ser-nr-Caef.o test-ser-r-Caef.o test-ser-nr-CaeF.o test-ser-r-CaeF.o test-ser-nr-Cam.o test-ser-r-Cam.o test-ser-nr-Caem.o test-ser-r-Caem.o test-opt-nr-Ca.c test-opt-r-Ca.c test-opt-nr-Ce.c test-opt-r-Ce.c test-opt-nr-Cf.c test-opt-r-Cf.c test-opt-nr-CF.c test-opt-r-CF.c test-opt-nr-Cm.c test-opt-r-Cm.c test-opt-nr-Cem.c test-opt-r-Cem.c test-opt-nr-Cae.c test-opt-r-Cae.c test-opt-nr-Caef.c test-opt-r-Caef.c test-opt-nr-CaeF.c test-opt-r-CaeF.c test-opt-nr-Cam.c test-opt-r-Cam.c test-opt-nr-Caem.c test-opt-r-Caem.c test-ver-nr-Ca.c test-ver-r-Ca.c test-ver-nr-Ce.c test-ver-r-Ce.c test-ver-nr-Cf.c test-ver-r-Cf.c test-ver-nr-CF.c test-ver-r-CF.c test-ver-nr-Cm.c test-ver-r-Cm.c test-ver-nr-Cem.c test-ver-r-Cem.c test-ver-nr-Cae.c test-ver-r-Cae.c test-ver-nr-Caef.c test-ver-r-Caef.c test-ver-nr-CaeF.c test-ver-r-CaeF.c test-ver-nr-Cam.c test-ver-r-Cam.c test-ver-nr-Caem.c test-ver-r-Caem.c test-ser-nr-Ca.c test-ser-r-Ca.c test-ser-nr-Ce.
 c test-ser-r-Ce.c test-ser-nr-Cf.c test-ser-r-Cf.c test-ser-nr-CF.c test-ser-r-CF.c test-ser-nr-Cm.c test-ser-r-Cm.c test-ser-nr-Cem.c test-ser-r-Cem.c test-ser-nr-Cae.c test-ser-r-Cae.c test-ser-nr-Caef.c test-ser-r-Caef.c test-ser-nr-CaeF.c test-ser-r-CaeF.c test-ser-nr-Cam.c test-ser-r-Cam.c test-ser-nr-Caem.c test-ser-r-Caem.c test-opt-nr-Ca.tables test-opt-r-Ca.tables test-opt-nr-Ce.tables test-opt-r-Ce.tables test-opt-nr-Cf.tables test-opt-r-Cf.tables test-opt-nr-CF.tables test-opt-r-CF.tables test-opt-nr-Cm.tables test-opt-r-Cm.tables test-opt-nr-Cem.tables test-opt-r-Cem.tables test-opt-nr-Cae.tables test-opt-r-Cae.tables test-opt-nr-Caef.tables test-opt-r-Caef.tables test-opt-nr-CaeF.tables test-opt-r-CaeF.tables test-opt-nr-Cam.tables test-opt-r-Cam.tables test-opt-nr-Caem.tables test-opt-r-Caem.tables test-ver-nr-Ca.tables test-ver-r-Ca.tables test-ver-nr-Ce.tables test-ver-r-Ce.tables test-ver-nr-Cf.tables test-ver-r-Cf.tables test-ver-nr-CF.tables test-ver-r-CF.
 tables test-ver-nr-Cm.tables test-ver-r-Cm.tables test-ver-nr-Cem.tables test-ver-r-Cem.tables test-ver-nr-Cae.tables test-ver-r-Cae.tables test-ver-nr-Caef.tables test-ver-r-Caef.tables test-ver-nr-CaeF.tables test-ver-r-CaeF.tables test-ver-nr-Cam.tables test-ver-r-Cam.tables test-ver-nr-Caem.tables test-ver-r-Caem.tables test-ser-nr-Ca.tables test-ser-r-Ca.tables test-ser-nr-Ce.tables test-ser-r-Ce.tables test-ser-nr-Cf.tables test-ser-r-Cf.tables test-ser-nr-CF.tables test-ser-r-CF.tables test-ser-nr-Cm.tables test-ser-r-Cm.tables test-ser-nr-Cem.tables test-ser-r-Cem.tables test-ser-nr-Cae.tables test-ser-r-Cae.tables test-ser-nr-Caef.tables test-ser-r-Caef.tables test-ser-nr-CaeF.tables test-ser-r-CaeF.tables test-ser-nr-Cam.tables test-ser-r-Cam.tables test-ser-nr-Caem.tables test-ser-r-Caem.tables test-mul.tables all-ser.tables test-opt-nr-Ca test-opt-r-Ca test-opt-nr-Ce test-opt-r-Ce test-opt-nr-Cf test-opt-r-Cf test-opt-nr-CF test-opt-r-CF test-opt-nr-Cm test-opt-r
 -Cm test-opt-nr-Cem test-opt-r-Cem test-opt-nr-Cae test-opt-r-Cae test-opt-nr-Caef test-opt-r-Caef test-opt-nr-CaeF test-opt-r-CaeF test-opt-nr-Cam test-opt-r-Cam test-opt-nr-Caem test-opt-r-Caem test-ver-nr-Ca test-ver-r-Ca test-ver-nr-Ce test-ver-r-Ce test-ver-nr-Cf test-ver-r-Cf test-ver-nr-CF test-ver-r-CF test-ver-nr-Cm test-ver-r-Cm test-ver-nr-Cem test-ver-r-Cem test-ver-nr-Cae test-ver-r-Cae test-ver-nr-Caef test-ver-r-Caef test-ver-nr-CaeF test-ver-r-CaeF test-ver-nr-Cam test-ver-r-Cam test-ver-nr-Caem test-ver-r-Caem test-ser-nr-Ca test-ser-r-Ca test-ser-nr-Ce test-ser-r-Ce test-ser-nr-Cf test-ser-r-Cf test-ser-nr-CF test-ser-r-CF test-ser-nr-Cm test-ser-r-Cm test-ser-nr-Cem test-ser-r-Cem test-ser-nr-Cae test-ser-r-Cae test-ser-nr-Caef test-ser-r-Caef test-ser-nr-CaeF test-ser-r-CaeF test-ser-nr-Cam test-ser-r-Cam test-ser-nr-Caem test-ser-r-Caem" || rm -f scanner.c OUTPUT test-opt-nr-Ca.o test-opt-r-Ca.o test-opt-nr-Ce.o test-opt-r-Ce.o test-opt-nr-Cf.o test-opt-
 r-Cf.o test-opt-nr-CF.o test-opt-r-CF.o test-opt-nr-Cm.o test-opt-r-Cm.o test-opt-nr-Cem.o test-opt-r-Cem.o test-opt-nr-Cae.o test-opt-r-Cae.o test-opt-nr-Caef.o test-opt-r-Caef.o test-opt-nr-CaeF.o test-opt-r-CaeF.o test-opt-nr-Cam.o test-opt-r-Cam.o test-opt-nr-Caem.o test-opt-r-Caem.o test-ver-nr-Ca.o test-ver-r-Ca.o test-ver-nr-Ce.o test-ver-r-Ce.o test-ver-nr-Cf.o test-ver-r-Cf.o test-ver-nr-CF.o test-ver-r-CF.o test-ver-nr-Cm.o test-ver-r-Cm.o test-ver-nr-Cem.o test-ver-r-Cem.o test-ver-nr-Cae.o test-ver-r-Cae.o test-ver-nr-Caef.o test-ver-r-Caef.o test-ver-nr-CaeF.o test-ver-r-CaeF.o test-ver-nr-Cam.o test-ver-r-Cam.o test-ver-nr-Caem.o test-ver-r-Caem.o test-ser-nr-Ca.o test-ser-r-Ca.o test-ser-nr-Ce.o test-ser-r-Ce.o test-ser-nr-Cf.o test-ser-r-Cf.o test-ser-nr-CF.o test-ser-r-CF.o test-ser-nr-Cm.o test-ser-r-Cm.o test-ser-nr-Cem.o test-ser-r-Cem.o test-ser-nr-Cae.o test-ser-r-Cae.o test-ser-nr-Caef.o test-ser-r-Caef.o test-ser-nr-CaeF.o test-ser-r-CaeF.o test-ser-n
 r-Cam.o test-ser-r-Cam.o test-ser-nr-Caem.o test-ser-r-Caem.o test-opt-nr-Ca.c test-opt-r-Ca.c test-opt-nr-Ce.c test-opt-r-Ce.c test-opt-nr-Cf.c test-opt-r-Cf.c test-opt-nr-CF.c test-opt-r-CF.c test-opt-nr-Cm.c test-opt-r-Cm.c test-opt-nr-Cem.c test-opt-r-Cem.c test-opt-nr-Cae.c test-opt-r-Cae.c test-opt-nr-Caef.c test-opt-r-Caef.c test-opt-nr-CaeF.c test-opt-r-CaeF.c test-opt-nr-Cam.c test-opt-r-Cam.c test-opt-nr-Caem.c test-opt-r-Caem.c test-ver-nr-Ca.c test-ver-r-Ca.c test-ver-nr-Ce.c test-ver-r-Ce.c test-ver-nr-Cf.c test-ver-r-Cf.c test-ver-nr-CF.c test-ver-r-CF.c test-ver-nr-Cm.c test-ver-r-Cm.c test-ver-nr-Cem.c test-ver-r-Cem.c test-ver-nr-Cae.c test-ver-r-Cae.c test-ver-nr-Caef.c test-ver-r-Caef.c test-ver-nr-CaeF.c test-ver-r-CaeF.c test-ver-nr-Cam.c test-ver-r-Cam.c test-ver-nr-Caem.c test-ver-r-Caem.c test-ser-nr-Ca.c test-ser-r-Ca.c test-ser-nr-Ce.c test-ser-r-Ce.c test-ser-nr-Cf.c test-ser-r-Cf.c test-ser-nr-CF.c test-ser-r-CF.c test-ser-nr-Cm.c test-ser-r-Cm.c 
 test-ser-nr-Cem.c test-ser-r-Cem.c test-ser-nr-Cae.c test-ser-r-Cae.c test-ser-nr-Caef.c test-ser-r-Caef.c test-ser-nr-CaeF.c test-ser-r-CaeF.c test-ser-nr-Cam.c test-ser-r-Cam.c test-ser-nr-Caem.c test-ser-r-Caem.c test-opt-nr-Ca.tables test-opt-r-Ca.tables test-opt-nr-Ce.tables test-opt-r-Ce.tables test-opt-nr-Cf.tables test-opt-r-Cf.tables test-opt-nr-CF.tables test-opt-r-CF.tables test-opt-nr-Cm.tables test-opt-r-Cm.tables test-opt-nr-Cem.tables test-opt-r-Cem.tables test-opt-nr-Cae.tables test-opt-r-Cae.tables test-opt-nr-Caef.tables test-opt-r-Caef.tables test-opt-nr-CaeF.tables test-opt-r-CaeF.tables test-opt-nr-Cam.tables test-opt-r-Cam.tables test-opt-nr-Caem.tables test-opt-r-Caem.tables test-ver-nr-Ca.tables test-ver-r-Ca.tables test-ver-nr-Ce.tables test-ver-r-Ce.tables test-ver-nr-Cf.tables test-ver-r-Cf.tables test-ver-nr-CF.tables test-ver-r-CF.tables test-ver-nr-Cm.tables test-ver-r-Cm.tables test-ver-nr-Cem.tables test-ver-r-Cem.tables test-ver-nr-Cae.tables
  test-ver-r-Cae.tables test-ver-nr-Caef.tables test-ver-r-Caef.tables test-ver-nr-CaeF.tables test-ver-r-CaeF.tables test-ver-nr-Cam.tables test-ver-r-Cam.tables test-ver-nr-Caem.tables test-ver-r-Caem.tables test-ser-nr-Ca.tables test-ser-r-Ca.tables test-ser-nr-Ce.tables test-ser-r-Ce.tables test-ser-nr-Cf.tables test-ser-r-Cf.tables test-ser-nr-CF.tables test-ser-r-CF.tables test-ser-nr-Cm.tables test-ser-r-Cm.tables test-ser-nr-Cem.tables test-ser-r-Cem.tables test-ser-nr-Cae.tables test-ser-r-Cae.tables test-ser-nr-Caef.tables test-ser-r-Caef.tables test-ser-nr-CaeF.tables test-ser-r-CaeF.tables test-ser-nr-Cam.tables test-ser-r-Cam.tables test-ser-nr-Caem.tables test-ser-r-Caem.tables test-mul.tables all-ser.tables test-opt-nr-Ca test-opt-r-Ca test-opt-nr-Ce test-opt-r-Ce test-opt-nr-Cf test-opt-r-Cf test-opt-nr-CF test-opt-r-CF test-opt-nr-Cm test-opt-r-Cm test-opt-nr-Cem test-opt-r-Cem test-opt-nr-Cae test-opt-r-Cae test-opt-nr-Caef test-opt-r-Caef test-opt-nr-CaeF t
 est-opt-r-CaeF test-opt-nr-Cam test-opt-r-Cam test-opt-nr-Caem test-opt-r-Caem test-ver-nr-Ca test-ver-r-Ca test-ver-nr-Ce test-ver-r-Ce test-ver-nr-Cf test-ver-r-Cf test-ver-nr-CF test-ver-r-CF test-ver-nr-Cm test-ver-r-Cm test-ver-nr-Cem test-ver-r-Cem test-ver-nr-Cae test-ver-r-Cae test-ver-nr-Caef test-ver-r-Caef test-ver-nr-CaeF test-ver-r-CaeF test-ver-nr-Cam test-ver-r-Cam test-ver-nr-Caem test-ver-r-Caem test-ser-nr-Ca test-ser-r-Ca test-ser-nr-Ce test-ser-r-Ce test-ser-nr-Cf test-ser-r-Cf test-ser-nr-CF test-ser-r-CF test-ser-nr-Cm test-ser-r-Cm test-ser-nr-Cem test-ser-r-Cem test-ser-nr-Cae test-ser-r-Cae test-ser-nr-Caef test-ser-r-Caef test-ser-nr-CaeF test-ser-r-CaeF test-ser-nr-Cam test-ser-r-Cam test-ser-nr-Caem test-ser-r-Caem
make[7]: Leaving directory `/build/buildd/flex-2.5.35/tests/test-table-opts'
Making clean in test-top
make[7]: Entering directory `/build/buildd/flex-2.5.35/tests/test-top'
test -z "scanner.c scanner.h test-top OUTPUT scanner.o main.o" || rm -f scanner.c scanner.h test-top OUTPUT scanner.o main.o
make[7]: Leaving directory `/build/buildd/flex-2.5.35/tests/test-top'
Making clean in test-noansi-r
make[7]: Entering directory `/build/buildd/flex-2.5.35/tests/test-noansi-r'
test -z "scanner.c parser.c parser.h test-noansi-r OUTPUT scanner.o " || rm -f scanner.c parser.c parser.h test-noansi-r OUTPUT scanner.o 
make[7]: Leaving directory `/build/buildd/flex-2.5.35/tests/test-noansi-r'
Making clean in test-noansi-nr
make[7]: Entering directory `/build/buildd/flex-2.5.35/tests/test-noansi-nr'
test -z "scanner.c parser.c parser.h test-noansi-nr OUTPUT scanner.o " || rm -f scanner.c parser.c parser.h test-noansi-nr OUTPUT scanner.o 
make[7]: Leaving directory `/build/buildd/flex-2.5.35/tests/test-noansi-nr'
Making clean in test-alloc-extra
make[7]: Entering directory `/build/buildd/flex-2.5.35/tests/test-alloc-extra'
test -z "scanner.c scanner.h parser.c parser.h test-alloc-extra OUTPUT scanner.o " || rm -f scanner.c scanner.h parser.c parser.h test-alloc-extra OUTPUT scanner.o 
make[7]: Leaving directory `/build/buildd/flex-2.5.35/tests/test-alloc-extra'
Making clean in test-yyextra
make[7]: Entering directory `/build/buildd/flex-2.5.35/tests/test-yyextra'
test -z "scanner.c scanner.h parser.c parser.h test-yyextra OUTPUT scanner.o " || rm -f scanner.c scanner.h parser.c parser.h test-yyextra OUTPUT scanner.o 
make[7]: Leaving directory `/build/buildd/flex-2.5.35/tests/test-yyextra'
Making clean in test-string-r
make[7]: Entering directory `/build/buildd/flex-2.5.35/tests/test-string-r'
test -z "scanner.c scanner.h parser.c parser.h test-string-r OUTPUT scanner.o " || rm -f scanner.c scanner.h parser.c parser.h test-string-r OUTPUT scanner.o 
make[7]: Leaving directory `/build/buildd/flex-2.5.35/tests/test-string-r'
Making clean in test-string-nr
make[7]: Entering directory `/build/buildd/flex-2.5.35/tests/test-string-nr'
test -z "scanner.c scanner.h parser.c parser.h test-string-nr OUTPUT scanner.o " || rm -f scanner.c scanner.h parser.c parser.h test-string-nr OUTPUT scanner.o 
make[7]: Leaving directory `/build/buildd/flex-2.5.35/tests/test-string-nr'
Making clean in test-pthread
make[7]: Entering directory `/build/buildd/flex-2.5.35/tests/test-pthread'
test -z "scanner.c scanner.h parser.c parser.h test-pthread OUTPUT scanner.o " || rm -f scanner.c scanner.h parser.c parser.h test-pthread OUTPUT scanner.o 
make[7]: Leaving directory `/build/buildd/flex-2.5.35/tests/test-pthread'
Making clean in test-prefix-r
make[7]: Entering directory `/build/buildd/flex-2.5.35/tests/test-prefix-r'
test -z "scanner.c scanner.h parser.c parser.h test-prefix-r OUTPUT scanner.o " || rm -f scanner.c scanner.h parser.c parser.h test-prefix-r OUTPUT scanner.o 
make[7]: Leaving directory `/build/buildd/flex-2.5.35/tests/test-prefix-r'
Making clean in test-prefix-nr
make[7]: Entering directory `/build/buildd/flex-2.5.35/tests/test-prefix-nr'
test -z "scanner.c scanner.h parser.c parser.h test-prefix-nr OUTPUT scanner.o " || rm -f scanner.c scanner.h parser.c parser.h test-prefix-nr OUTPUT scanner.o 
make[7]: Leaving directory `/build/buildd/flex-2.5.35/tests/test-prefix-nr'
Making clean in test-include-by-reentrant
make[7]: Entering directory `/build/buildd/flex-2.5.35/tests/test-include-by-reentrant'
test -z "scanner.c scanner.h parser.c parser.h test-include-by-reentrant OUTPUT scanner.o " || rm -f scanner.c scanner.h parser.c parser.h test-include-by-reentrant OUTPUT scanner.o 
make[7]: Leaving directory `/build/buildd/flex-2.5.35/tests/test-include-by-reentrant'
Making clean in test-include-by-push
make[7]: Entering directory `/build/buildd/flex-2.5.35/tests/test-include-by-push'
test -z "scanner.c scanner.h parser.c parser.h test-include-by-push OUTPUT scanner.o " || rm -f scanner.c scanner.h parser.c parser.h test-include-by-push OUTPUT scanner.o 
make[7]: Leaving directory `/build/buildd/flex-2.5.35/tests/test-include-by-push'
Making clean in test-include-by-buffer
make[7]: Entering directory `/build/buildd/flex-2.5.35/tests/test-include-by-buffer'
test -z "scanner.c scanner.h parser.c parser.h test-include-by-buffer OUTPUT scanner.o " || rm -f scanner.c scanner.h parser.c parser.h test-include-by-buffer OUTPUT scanner.o 
make[7]: Leaving directory `/build/buildd/flex-2.5.35/tests/test-include-by-buffer'
Making clean in test-c-cpp-r
make[7]: Entering directory `/build/buildd/flex-2.5.35/tests/test-c-cpp-r'
test -z "scanner.cpp test-c-cpp-r scanner.o OUTPUT" || rm -f scanner.cpp test-c-cpp-r scanner.o OUTPUT
make[7]: Leaving directory `/build/buildd/flex-2.5.35/tests/test-c-cpp-r'
Making clean in test-c-cpp-nr
make[7]: Entering directory `/build/buildd/flex-2.5.35/tests/test-c-cpp-nr'
test -z "scanner.cpp test-c-cpp-nr scanner.o OUTPUT" || rm -f scanner.cpp test-c-cpp-nr scanner.o OUTPUT
make[7]: Leaving directory `/build/buildd/flex-2.5.35/tests/test-c-cpp-nr'
Making clean in test-array-r
make[7]: Entering directory `/build/buildd/flex-2.5.35/tests/test-array-r'
test -z "scanner.c test-array-r OUTPUT scanner.o" || rm -f scanner.c test-array-r OUTPUT scanner.o
make[7]: Leaving directory `/build/buildd/flex-2.5.35/tests/test-array-r'
Making clean in test-array-nr
make[7]: Entering directory `/build/buildd/flex-2.5.35/tests/test-array-nr'
test -z "scanner.c parser.c parser.h test-array-nr OUTPUT scanner.o " || rm -f scanner.c parser.c parser.h test-array-nr OUTPUT scanner.o 
make[7]: Leaving directory `/build/buildd/flex-2.5.35/tests/test-array-nr'
Making clean in test-linedir-r
make[7]: Entering directory `/build/buildd/flex-2.5.35/tests/test-linedir-r'
test -z "scanner.c scanner.h test-linedir-r OUTPUT scanner.o main.o" || rm -f scanner.c scanner.h test-linedir-r OUTPUT scanner.o main.o
make[7]: Leaving directory `/build/buildd/flex-2.5.35/tests/test-linedir-r'
Making clean in test-lineno-nr
make[7]: Entering directory `/build/buildd/flex-2.5.35/tests/test-lineno-nr'
test -z "scanner.c test-lineno-nr OUTPUT scanner.o" || rm -f scanner.c test-lineno-nr OUTPUT scanner.o
make[7]: Leaving directory `/build/buildd/flex-2.5.35/tests/test-lineno-nr'
Making clean in test-lineno-r
make[7]: Entering directory `/build/buildd/flex-2.5.35/tests/test-lineno-r'
test -z "scanner.c test-lineno-r OUTPUT scanner.o" || rm -f scanner.c test-lineno-r OUTPUT scanner.o
make[7]: Leaving directory `/build/buildd/flex-2.5.35/tests/test-lineno-r'
Making clean in test-debug-r
make[7]: Entering directory `/build/buildd/flex-2.5.35/tests/test-debug-r'
test -z "scanner.c test-debug-r OUTPUT scanner.o " || rm -f scanner.c test-debug-r OUTPUT scanner.o 
make[7]: Leaving directory `/build/buildd/flex-2.5.35/tests/test-debug-r'
Making clean in test-debug-nr
make[7]: Entering directory `/build/buildd/flex-2.5.35/tests/test-debug-nr'
test -z "scanner.c scanner.h test-debug-nr OUTPUT scanner.o" || rm -f scanner.c scanner.h test-debug-nr OUTPUT scanner.o
make[7]: Leaving directory `/build/buildd/flex-2.5.35/tests/test-debug-nr'
Making clean in test-mem-nr
make[7]: Entering directory `/build/buildd/flex-2.5.35/tests/test-mem-nr'
test -z "scanner.c scanner.h test-mem-nr OUTPUT scanner.o" || rm -f scanner.c scanner.h test-mem-nr OUTPUT scanner.o
make[7]: Leaving directory `/build/buildd/flex-2.5.35/tests/test-mem-nr'
Making clean in test-mem-r
make[7]: Entering directory `/build/buildd/flex-2.5.35/tests/test-mem-r'
test -z "scanner.c scanner.h test-mem-r OUTPUT scanner.o" || rm -f scanner.c scanner.h test-mem-r OUTPUT scanner.o
make[7]: Leaving directory `/build/buildd/flex-2.5.35/tests/test-mem-r'
Making clean in test-posix
make[7]: Entering directory `/build/buildd/flex-2.5.35/tests/test-posix'
test -z "scanner.c scanner.h test-posix OUTPUT scanner.o" || rm -f scanner.c scanner.h test-posix OUTPUT scanner.o
make[7]: Leaving directory `/build/buildd/flex-2.5.35/tests/test-posix'
Making clean in test-posixly-correct
make[7]: Entering directory `/build/buildd/flex-2.5.35/tests/test-posixly-correct'
test -z "scanner.c scanner.h test-posixly-correct OUTPUT scanner.o " || rm -f scanner.c scanner.h test-posixly-correct OUTPUT scanner.o 
make[7]: Leaving directory `/build/buildd/flex-2.5.35/tests/test-posixly-correct'
Making clean in test-c++-basic
make[7]: Entering directory `/build/buildd/flex-2.5.35/tests/test-c++-basic'
test -z "scanner.cpp scanner.h test-c++-basic OUTPUT scanner.o" || rm -f scanner.cpp scanner.h test-c++-basic OUTPUT scanner.o
make[7]: Leaving directory `/build/buildd/flex-2.5.35/tests/test-c++-basic'
Making clean in test-c++-multiple-scanners
make[7]: Entering directory `/build/buildd/flex-2.5.35/tests/test-c++-multiple-scanners'
test -z "scanner-1.cpp test-c++-multiple-scanners OUTPUT scanner-1.o scanner-2.o main.o scanner-2.cpp" || rm -f scanner-1.cpp test-c++-multiple-scanners OUTPUT scanner-1.o scanner-2.o main.o scanner-2.cpp
make[7]: Leaving directory `/build/buildd/flex-2.5.35/tests/test-c++-multiple-scanners'
Making clean in test-reject
make[7]: Entering directory `/build/buildd/flex-2.5.35/tests/test-reject'
test -z "scanner.c test-reject-* OUTPUT test-reject-nr.o test-reject-r.o test-reject-ver.o test-reject-ser.o" || rm -f scanner.c test-reject-* OUTPUT test-reject-nr.o test-reject-r.o test-reject-ver.o test-reject-ser.o
make[7]: Leaving directory `/build/buildd/flex-2.5.35/tests/test-reject'
Making clean in test-header-r
make[7]: Entering directory `/build/buildd/flex-2.5.35/tests/test-header-r'
test -z "scanner.c scanner.h test-header-r OUTPUT scanner.o main.o" || rm -f scanner.c scanner.h test-header-r OUTPUT scanner.o main.o
make[7]: Leaving directory `/build/buildd/flex-2.5.35/tests/test-header-r'
Making clean in test-header-nr
make[7]: Entering directory `/build/buildd/flex-2.5.35/tests/test-header-nr'
test -z "scanner.c scanner.h test-header-nr scanner.o main.o OUTPUT" || rm -f scanner.c scanner.h test-header-nr scanner.o main.o OUTPUT
make[7]: Leaving directory `/build/buildd/flex-2.5.35/tests/test-header-nr'
Making clean in test-multiple-scanners-r
make[7]: Entering directory `/build/buildd/flex-2.5.35/tests/test-multiple-scanners-r'
test -z "scanner-1.c scanner-1.h test-multiple-scanners-r OUTPUT scanner-1.o scanner-2.o main.o scanner-2.c scanner-2.h scanner-1.tables scanner-2.tables" || rm -f scanner-1.c scanner-1.h test-multiple-scanners-r OUTPUT scanner-1.o scanner-2.o main.o scanner-2.c scanner-2.h scanner-1.tables scanner-2.tables
make[7]: Leaving directory `/build/buildd/flex-2.5.35/tests/test-multiple-scanners-r'
Making clean in test-multiple-scanners-nr
make[7]: Entering directory `/build/buildd/flex-2.5.35/tests/test-multiple-scanners-nr'
test -z "scanner-1.c scanner-1.h test-multiple-scanners-nr OUTPUT scanner-1.o scanner-2.o main.o scanner-2.c scanner-2.h" || rm -f scanner-1.c scanner-1.h test-multiple-scanners-nr OUTPUT scanner-1.o scanner-2.o main.o scanner-2.c scanner-2.h
make[7]: Leaving directory `/build/buildd/flex-2.5.35/tests/test-multiple-scanners-nr'
Making clean in test-bison-nr
make[7]: Entering directory `/build/buildd/flex-2.5.35/tests/test-bison-nr'
test -z "scanner.c scanner.h parser.c parser.h test-bison-nr scanner.o parser.o main.o OUTPUT" || rm -f scanner.c scanner.h parser.c parser.h test-bison-nr scanner.o parser.o main.o OUTPUT
make[7]: Leaving directory `/build/buildd/flex-2.5.35/tests/test-bison-nr'
Making clean in test-bison-yylval
make[7]: Entering directory `/build/buildd/flex-2.5.35/tests/test-bison-yylval'
test -z "scanner.c scanner.h parser.c parser.h test-bison-yylval parser.o scanner.o main.o OUTPUT" || rm -f scanner.c scanner.h parser.c parser.h test-bison-yylval parser.o scanner.o main.o OUTPUT
make[7]: Leaving directory `/build/buildd/flex-2.5.35/tests/test-bison-yylval'
Making clean in test-bison-yylloc
make[7]: Entering directory `/build/buildd/flex-2.5.35/tests/test-bison-yylloc'
test -z "scanner.c scanner.h parser.c parser.h test-bison-yylloc scanner.o parser.o main.o OUTPUT" || rm -f scanner.c scanner.h parser.c parser.h test-bison-yylloc scanner.o parser.o main.o OUTPUT
make[7]: Leaving directory `/build/buildd/flex-2.5.35/tests/test-bison-yylloc'
Making clean in test-basic-r
make[7]: Entering directory `/build/buildd/flex-2.5.35/tests/test-basic-r'
test -z "scanner.c parser.c parser.h test-basic-r OUTPUT scanner.o " || rm -f scanner.c parser.c parser.h test-basic-r OUTPUT scanner.o 
make[7]: Leaving directory `/build/buildd/flex-2.5.35/tests/test-basic-r'
Making clean in test-basic-nr
make[7]: Entering directory `/build/buildd/flex-2.5.35/tests/test-basic-nr'
test -z "scanner.c parser.c parser.h test-basic-nr OUTPUT scanner.o " || rm -f scanner.c parser.c parser.h test-basic-nr OUTPUT scanner.o 
make[7]: Leaving directory `/build/buildd/flex-2.5.35/tests/test-basic-nr'
Making clean in test-rescan-nr
make[7]: Entering directory `/build/buildd/flex-2.5.35/tests/test-rescan-nr'
test -z "scanner.c scanner.h test-rescan-nr OUTPUT scanner.o " || rm -f scanner.c scanner.h test-rescan-nr OUTPUT scanner.o 
make[7]: Leaving directory `/build/buildd/flex-2.5.35/tests/test-rescan-nr'
Making clean in test-rescan-r
make[7]: Entering directory `/build/buildd/flex-2.5.35/tests/test-rescan-r'
test -z "scanner.c scanner.h test-rescan-r OUTPUT scanner.o " || rm -f scanner.c scanner.h test-rescan-r OUTPUT scanner.o 
make[7]: Leaving directory `/build/buildd/flex-2.5.35/tests/test-rescan-r'
Making clean in test-quotes
make[7]: Entering directory `/build/buildd/flex-2.5.35/tests/test-quotes'
test -z "l.out c.out  scanner.c scanner.h test-quotes OUTPUT scanner.o" || rm -f l.out c.out  scanner.c scanner.h test-quotes OUTPUT scanner.o
make[7]: Leaving directory `/build/buildd/flex-2.5.35/tests/test-quotes'
Making clean in test-ccl
make[7]: Entering directory `/build/buildd/flex-2.5.35/tests/test-ccl'
test -z "scanner.c scanner.h  test-ccl OUTPUT scanner.o" || rm -f scanner.c scanner.h  test-ccl OUTPUT scanner.o
make[7]: Leaving directory `/build/buildd/flex-2.5.35/tests/test-ccl'
Making clean in test-extended
make[7]: Entering directory `/build/buildd/flex-2.5.35/tests/test-extended'
test -z "scanner.c scanner.h test-extended OUTPUT scanner.o" || rm -f scanner.c scanner.h test-extended OUTPUT scanner.o
make[7]: Leaving directory `/build/buildd/flex-2.5.35/tests/test-extended'
Making clean in test-c++-yywrap
make[7]: Entering directory `/build/buildd/flex-2.5.35/tests/test-c++-yywrap'
test -z "scanner.cpp scanner.h test-c++-yywrap OUTPUT scanner.o" || rm -f scanner.cpp scanner.h test-c++-yywrap OUTPUT scanner.o
make[7]: Leaving directory `/build/buildd/flex-2.5.35/tests/test-c++-yywrap'
Making clean in test-concatenated-options
make[7]: Entering directory `/build/buildd/flex-2.5.35/tests/test-concatenated-options'
test -z "OUTPUT" || rm -f OUTPUT
make[7]: Leaving directory `/build/buildd/flex-2.5.35/tests/test-concatenated-options'
Making clean in .
make[7]: Entering directory `/build/buildd/flex-2.5.35/tests'
make[7]: Nothing to be done for `clean-am'.
make[7]: Leaving directory `/build/buildd/flex-2.5.35/tests'
NOK=;\
	NFAIL=;\
	for dir in test-concatenated-options test-c++-yywrap test-extended test-ccl test-quotes test-rescan-r test-rescan-nr test-basic-nr test-basic-r test-bison-yylloc test-bison-yylval test-bison-nr test-multiple-scanners-nr test-multiple-scanners-r test-header-nr test-header-r test-reject test-c++-multiple-scanners test-c++-basic test-posixly-correct test-posix test-mem-r test-mem-nr test-debug-nr test-debug-r test-lineno-r test-lineno-nr test-linedir-r test-array-nr test-array-r test-c-cpp-nr test-c-cpp-r test-include-by-buffer test-include-by-push test-include-by-reentrant test-prefix-nr test-prefix-r test-pthread test-string-nr test-string-r test-yyextra test-alloc-extra test-noansi-nr test-noansi-r test-top test-table-opts ; do \
		echo Executing test "$dir" ; \
		( cd "$dir" && /usr/bin/make test  > OUTPUT 2>&1 ) ; \
		case $? in \
			0 )  echo Test "$dir" succeeded.; \
				NOK=0$NOK;\
				;; \
			* )  echo Test "$dir" FAILED. See "$dir"/OUTPUT for details. ; \
				NFAIL=0$NFAIL; \
				;; \
		esac; \
	done ; \
	echo Results: ; \
	echo Tests succeeded: `echo -n "$NOK"|wc -c`; \
	echo Tests FAILED: `echo -n "$NFAIL"|wc -c` ; \
	test "$NFAIL" = ""
Executing test test-concatenated-options
Test test-concatenated-options succeeded.
Executing test test-c++-yywrap
Test test-c++-yywrap succeeded.
Executing test test-extended
Test test-extended succeeded.
Executing test test-ccl
Test test-ccl succeeded.
Executing test test-quotes
Test test-quotes succeeded.
Executing test test-rescan-r
Test test-rescan-r succeeded.
Executing test test-rescan-nr
Test test-rescan-nr succeeded.
Executing test test-basic-nr
Test test-basic-nr succeeded.
Executing test test-basic-r
Test test-basic-r succeeded.
Executing test test-bison-yylloc
Test test-bison-yylloc succeeded.
Executing test test-bison-yylval
Test test-bison-yylval succeeded.
Executing test test-bison-nr
Test test-bison-nr FAILED. See test-bison-nr/OUTPUT for details.
Executing test test-multiple-scanners-nr
Test test-multiple-scanners-nr succeeded.
Executing test test-multiple-scanners-r
Test test-multiple-scanners-r succeeded.
Executing test test-header-nr
Test test-header-nr succeeded.
Executing test test-header-r
Test test-header-r succeeded.
Executing test test-reject
Test test-reject succeeded.
Executing test test-c++-multiple-scanners
Test test-c++-multiple-scanners succeeded.
Executing test test-c++-basic
Test test-c++-basic succeeded.
Executing test test-posixly-correct
Test test-posixly-correct succeeded.
Executing test test-posix
Test test-posix succeeded.
Executing test test-mem-r
Test test-mem-r succeeded.
Executing test test-mem-nr
Test test-mem-nr succeeded.
Executing test test-debug-nr
Test test-debug-nr succeeded.
Executing test test-debug-r
Test test-debug-r succeeded.
Executing test test-lineno-r
Test test-lineno-r succeeded.
Executing test test-lineno-nr
Test test-lineno-nr succeeded.
Executing test test-linedir-r
Test test-linedir-r succeeded.
Executing test test-array-nr
Test test-array-nr succeeded.
Executing test test-array-r
Test test-array-r succeeded.
Executing test test-c-cpp-nr
Test test-c-cpp-nr succeeded.
Executing test test-c-cpp-r
Test test-c-cpp-r succeeded.
Executing test test-include-by-buffer
Test test-include-by-buffer succeeded.
Executing test test-include-by-push
Test test-include-by-push succeeded.
Executing test test-include-by-reentrant
Test test-include-by-reentrant succeeded.
Executing test test-prefix-nr
Test test-prefix-nr succeeded.
Executing test test-prefix-r
Test test-prefix-r succeeded.
Executing test test-pthread
Test test-pthread succeeded.
Executing test test-string-nr
Test test-string-nr succeeded.
Executing test test-string-r
Test test-string-r succeeded.
Executing test test-yyextra
Test test-yyextra succeeded.
Executing test test-alloc-extra
Test test-alloc-extra succeeded.
Executing test test-noansi-nr
Test test-noansi-nr succeeded.
Executing test test-noansi-r
Test test-noansi-r succeeded.
Executing test test-top
Test test-top succeeded.
Executing test test-table-opts
Test test-table-opts succeeded.
Results:
Tests succeeded: 45
Tests FAILED: 1
make[6]: *** [check-local] Error 1
make[6]: Leaving directory `/build/buildd/flex-2.5.35/tests'
make[5]: *** [check-am] Error 2
make[5]: Leaving directory `/build/buildd/flex-2.5.35/tests'
make[4]: *** [check-recursive] Error 1
make[4]: Leaving directory `/build/buildd/flex-2.5.35/tests'
make[3]: *** [check-recursive] Error 1
make[3]: Leaving directory `/build/buildd/flex-2.5.35'
make[2]: *** [check] Error 2
make[2]: Leaving directory `/build/buildd/flex-2.5.35'
make[1]: *** [debian/stamp/build/flex] Error 2
make[1]: Leaving directory `/build/buildd/flex-2.5.35'
make: *** [debian/stamp/do-build-arch] Error 2
dpkg-buildpackage: failure: debian/rules build gave error exit status 2
******************************************************************************
Build finished at 20090723-1511
FAILED [dpkg-buildpackage died]
Purging chroot-karmic-autotest/build/buildd/flex-2.5.35
------------------------------------------------------------------------------
  /usr/bin/sudo dpkg --root=/home/buildd/build-karmic-autotest/chroot-karmic-autotest --purge po-debconf intltool-debian libmagic1 file automake help2man update-inetd texinfo bison cvs
(Reading database ... 17157 files and directories currently installed.)
Removing po-debconf ...
Removing intltool-debian ...
Removing file ...
Purging configuration files for file ...
Removing automake ...
Removing help2man ...
Removing texinfo ...
Running update-fmtutil. This may take some time. ...
update-fmtutil failed. Output has been stored in
/tmp/checkrun.oF2RVbq5
If tex-common is not configured you can ignore this error message!
Otherwise please include this file if you report a bug.

Purging configuration files for texinfo ...
dpkg - warning: while removing texinfo, directory `/usr/share/texmf' not empty so not removed.
Removing bison ...
Removing cvs ...
Purging configuration files for cvs ...
Removing libmagic1 ...
Purging configuration files for libmagic1 ...
Removing update-inetd ...
Purging configuration files for update-inetd ...
Processing triggers for libc6 ...
ldconfig deferred processing now taking place
******************************************************************************
Finished at 20090723-1511
Build needed 00:01:31, 27028k disk space




More information about the ubuntu-autotest mailing list