Log for failed build of ruby1.9_1.9.0.2-9.1ubuntu1 (dist=karmic-autotest)
Build Daemon user
noreply at buildd.ubuntu.com
Mon Jul 6 07:34:58 BST 2009
Automatic build of ruby1.9_1.9.0.2-9.1ubuntu1 on terranova by sbuild/i386 1.170.5
Build started at 20090706-0732
******************************************************************************
Checking available source versions...
Fetching source files...
Reading package lists...
Building dependency tree...
Reading state information...
NOTICE: 'ruby1.9' packaging is maintained in the 'Svn' version control system at:
svn://svn.debian.org/pkg-ruby/ruby1.9/trunk/
Need to get 6461kB of source archives.
Get:1 http://archive.internal karmic-autotest/main ruby1.9 1.9.0.2-9.1ubuntu1 (dsc) [1763B]
Get:2 http://archive.internal karmic-autotest/main ruby1.9 1.9.0.2-9.1ubuntu1 (tar) [6408kB]
Get:3 http://archive.internal karmic-autotest/main ruby1.9 1.9.0.2-9.1ubuntu1 (diff) [50.9kB]
Fetched 6461kB in 0s (15.2MB/s)
Download complete and in download only mode
** Using build dependencies supplied by package:
Build-Depends: debhelper (>= 4.1.0), cdbs, dpatch, patch, autoconf, m4, bison, binutils (>= 2.14.90.0.7), libgdbm-dev, libncurses5-dev, libreadline5-dev, tcl8.4-dev, tk8.4-dev, zlib1g-dev, libssl-dev (>= 0.9.6b)
Build-Conflicts: gcc-3.3 (<< 1:3.3.2-0pre1)
Checking for already installed source dependencies...
debhelper: missing
cdbs: missing
dpatch: missing
patch: already installed (2.5.9-5)
autoconf: already installed (2.63-3ubuntu1)
m4: already installed (1.4.13-1)
bison: missing
binutils: already installed (2.19.51.20090515-0ubuntu1 >= 2.14.90.0.7 is satisfied)
libgdbm-dev: missing
libncurses5-dev: missing
libreadline5-dev: missing
tcl8.4-dev: missing
tk8.4-dev: missing
zlib1g-dev: missing
libssl-dev: missing
gcc-3.3: already deinstalled
Checking for source dependency conflicts...
/usr/bin/sudo /usr/bin/apt-get --purge $CHROOT_OPTIONS -q -y install debhelper cdbs dpatch bison libgdbm-dev libncurses5-dev libreadline5-dev tcl8.4-dev tk8.4-dev zlib1g-dev libssl-dev
Reading package lists...
Building dependency tree...
Reading state information...
The following packages were automatically installed and are no longer required:
libvolume-id1
Use 'apt-get autoremove' to remove them.
The following extra packages will be installed:
bsdmainutils fdupes file groff-base html2text intltool intltool-debian
libexpat1 libhtml-parser-perl libhtml-tagset-perl libhtml-tree-perl
libice-dev libice6 libmagic1 libpthread-stubs0 libpthread-stubs0-dev
libsm-dev libsm6 liburi-perl libwww-perl libx11-6 libx11-data libx11-dev
libxau-dev libxau6 libxcb1 libxcb1-dev libxdmcp-dev libxdmcp6
libxml-parser-perl libxt-dev libxt6 man-db netbase po-debconf tcl8.4 tk8.4
x11-common x11proto-core-dev x11proto-input-dev x11proto-kb-dev xtrans-dev
Suggested packages:
bison-doc wamerican wordlist whois vacation devscripts doc-base dh-make curl
groff libdata-dump-perl libcrypt-ssleay-perl libio-socket-ssl-perl less
www-browser libmail-box-perl tclreadline tcl8.4-doc tk8.4-doc
Recommended packages:
libmailtools-perl libhtml-format-perl ifupdown libmail-sendmail-perl xterm
x-terminal-emulator
The following NEW packages will be installed:
bison bsdmainutils cdbs debhelper dpatch fdupes file groff-base html2text
intltool intltool-debian libexpat1 libgdbm-dev libhtml-parser-perl
libhtml-tagset-perl libhtml-tree-perl libice-dev libice6 libmagic1
libncurses5-dev libpthread-stubs0 libpthread-stubs0-dev libreadline5-dev
libsm-dev libsm6 libssl-dev liburi-perl libwww-perl libx11-6 libx11-data
libx11-dev libxau-dev libxau6 libxcb1 libxcb1-dev libxdmcp-dev libxdmcp6
libxml-parser-perl libxt-dev libxt6 man-db netbase po-debconf tcl8.4
tcl8.4-dev tk8.4 tk8.4-dev x11-common x11proto-core-dev x11proto-input-dev
x11proto-kb-dev xtrans-dev zlib1g-dev
0 upgraded, 53 newly installed, 0 to remove and 0 not upgraded.
Need to get 0B/18.8MB of archives.
After this operation, 57.6MB of additional disk space will be used.
WARNING: The following packages cannot be authenticated!
x11-common libice6 x11proto-core-dev libice-dev libsm6 libsm-dev libxau6
libxdmcp6 libxcb1 libx11-data libx11-6 libxau-dev libxdmcp-dev
x11proto-input-dev x11proto-kb-dev xtrans-dev libpthread-stubs0
libpthread-stubs0-dev libxcb1-dev libx11-dev libxt6 libxt-dev libmagic1 file
netbase bsdmainutils groff-base libexpat1 libhtml-tagset-perl liburi-perl
libhtml-parser-perl libhtml-tree-perl libwww-perl libxml-parser-perl man-db
bison html2text intltool-debian po-debconf debhelper fdupes intltool cdbs
dpatch libgdbm-dev libncurses5-dev libreadline5-dev zlib1g-dev libssl-dev
tcl8.4 tcl8.4-dev tk8.4 tk8.4-dev
debconf: unable to initialize frontend: Dialog
debconf: (Dialog frontend will not work on a dumb terminal, an emacs shell buffer, or without a controlling terminal.)
debconf: falling back to frontend: Readline
debconf: unable to initialize frontend: Readline
debconf: (This frontend requires a controlling tty.)
debconf: falling back to frontend: Teletype
dpkg-preconfigure: unable to re-open stdin:
Authentication warning overridden.
Selecting previously deselected package x11-common.
(Reading database ... 16851 files and directories currently installed.)
Unpacking x11-common (from .../x11-common_1%3a7.4~5ubuntu21_all.deb) ...
Selecting previously deselected package libice6.
Unpacking libice6 (from .../libice6_2%3a1.0.5-1_i386.deb) ...
Setting up x11-common (1:7.4~5ubuntu21) ...
Selecting previously deselected package x11proto-core-dev.
(Reading database ... 16933 files and directories currently installed.)
Unpacking x11proto-core-dev (from .../x11proto-core-dev_7.0.15-1_all.deb) ...
Selecting previously deselected package libice-dev.
Unpacking libice-dev (from .../libice-dev_2%3a1.0.5-1_i386.deb) ...
Selecting previously deselected package libsm6.
Unpacking libsm6 (from .../libsm6_2%3a1.1.0-2_i386.deb) ...
Selecting previously deselected package libsm-dev.
Unpacking libsm-dev (from .../libsm-dev_2%3a1.1.0-2_i386.deb) ...
Selecting previously deselected package libxau6.
Unpacking libxau6 (from .../libxau6_1%3a1.0.4-2_i386.deb) ...
Selecting previously deselected package libxdmcp6.
Unpacking libxdmcp6 (from .../libxdmcp6_1%3a1.0.2-3_i386.deb) ...
Selecting previously deselected package libxcb1.
Unpacking libxcb1 (from .../libxcb1_1.3-2_i386.deb) ...
Selecting previously deselected package libx11-data.
Unpacking libx11-data (from .../libx11-data_2%3a1.2.1-1ubuntu1_all.deb) ...
Selecting previously deselected package libx11-6.
Unpacking libx11-6 (from .../libx11-6_2%3a1.2.1-1ubuntu1_i386.deb) ...
Selecting previously deselected package libxau-dev.
Unpacking libxau-dev (from .../libxau-dev_1%3a1.0.4-2_i386.deb) ...
Selecting previously deselected package libxdmcp-dev.
Unpacking libxdmcp-dev (from .../libxdmcp-dev_1%3a1.0.2-3_i386.deb) ...
Selecting previously deselected package x11proto-input-dev.
Unpacking x11proto-input-dev (from .../x11proto-input-dev_1.5.0-2ubuntu1_all.deb) ...
Selecting previously deselected package x11proto-kb-dev.
Unpacking x11proto-kb-dev (from .../x11proto-kb-dev_1.0.3-3ubuntu1_all.deb) ...
Selecting previously deselected package xtrans-dev.
Unpacking xtrans-dev (from .../xtrans-dev_1.2.3-3_all.deb) ...
Selecting previously deselected package libpthread-stubs0.
Unpacking libpthread-stubs0 (from .../libpthread-stubs0_0.1-2_i386.deb) ...
Selecting previously deselected package libpthread-stubs0-dev.
Unpacking libpthread-stubs0-dev (from .../libpthread-stubs0-dev_0.1-2_i386.deb) ...
Selecting previously deselected package libxcb1-dev.
Unpacking libxcb1-dev (from .../libxcb1-dev_1.3-2_i386.deb) ...
Selecting previously deselected package libx11-dev.
Unpacking libx11-dev (from .../libx11-dev_2%3a1.2.1-1ubuntu1_i386.deb) ...
Selecting previously deselected package libxt6.
Unpacking libxt6 (from .../libxt6_1%3a1.0.5-3ubuntu1_i386.deb) ...
Selecting previously deselected package libxt-dev.
Unpacking libxt-dev (from .../libxt-dev_1%3a1.0.5-3ubuntu1_i386.deb) ...
Selecting previously deselected package libmagic1.
Unpacking libmagic1 (from .../libmagic1_5.03-1ubuntu1_i386.deb) ...
Selecting previously deselected package file.
Unpacking file (from .../file_5.03-1ubuntu1_i386.deb) ...
Selecting previously deselected package netbase.
Unpacking netbase (from .../netbase_4.34ubuntu2_all.deb) ...
Selecting previously deselected package bsdmainutils.
Unpacking bsdmainutils (from .../bsdmainutils_6.1.10ubuntu4_i386.deb) ...
Selecting previously deselected package groff-base.
Unpacking groff-base (from .../groff-base_1.18.1.1-22build1_i386.deb) ...
Selecting previously deselected package libexpat1.
Unpacking libexpat1 (from .../libexpat1_2.0.1-4_i386.deb) ...
Selecting previously deselected package libhtml-tagset-perl.
Unpacking libhtml-tagset-perl (from .../libhtml-tagset-perl_3.20-2_all.deb) ...
Selecting previously deselected package liburi-perl.
Unpacking liburi-perl (from .../liburi-perl_1.37+dfsg-1ubuntu1_all.deb) ...
Selecting previously deselected package libhtml-parser-perl.
Unpacking libhtml-parser-perl (from .../libhtml-parser-perl_3.60-1_i386.deb) ...
Selecting previously deselected package libhtml-tree-perl.
Unpacking libhtml-tree-perl (from .../libhtml-tree-perl_3.23-1_all.deb) ...
Selecting previously deselected package libwww-perl.
Unpacking libwww-perl (from .../libwww-perl_5.826-1_all.deb) ...
Selecting previously deselected package libxml-parser-perl.
Unpacking libxml-parser-perl (from .../libxml-parser-perl_2.36-1.1build2_i386.deb) ...
Selecting previously deselected package man-db.
Unpacking man-db (from .../man-db_2.5.5-2_i386.deb) ...
Selecting previously deselected package bison.
Unpacking bison (from .../bison_1%3a2.4.1.dfsg-1_i386.deb) ...
Selecting previously deselected package html2text.
Unpacking html2text (from .../html2text_1.3.2a-14_i386.deb) ...
Selecting previously deselected package intltool-debian.
Unpacking intltool-debian (from .../intltool-debian_0.35.0+20060710.1_all.deb) ...
Selecting previously deselected package po-debconf.
Unpacking po-debconf (from .../po-debconf_1.0.16_all.deb) ...
Selecting previously deselected package debhelper.
Unpacking debhelper (from .../debhelper_7.2.14ubuntu1_all.deb) ...
Selecting previously deselected package fdupes.
Unpacking fdupes (from .../fdupes_1.50-PR2-2_i386.deb) ...
Selecting previously deselected package intltool.
Unpacking intltool (from .../intltool_0.40.6-2_all.deb) ...
Selecting previously deselected package cdbs.
Unpacking cdbs (from .../cdbs_0.4.56ubuntu5_all.deb) ...
Selecting previously deselected package dpatch.
Unpacking dpatch (from .../archives/dpatch_2.0.31_all.deb) ...
Selecting previously deselected package libgdbm-dev.
Unpacking libgdbm-dev (from .../libgdbm-dev_1.8.3-4_i386.deb) ...
Selecting previously deselected package libncurses5-dev.
Unpacking libncurses5-dev (from .../libncurses5-dev_5.7+20090523-1ubuntu1_i386.deb) ...
Selecting previously deselected package libreadline5-dev.
Unpacking libreadline5-dev (from .../libreadline5-dev_5.2-4_i386.deb) ...
Selecting previously deselected package zlib1g-dev.
Unpacking zlib1g-dev (from .../zlib1g-dev_1%3a1.2.3.3.dfsg-13ubuntu1_i386.deb) ...
Selecting previously deselected package libssl-dev.
Unpacking libssl-dev (from .../libssl-dev_0.9.8g-16ubuntu1_i386.deb) ...
Selecting previously deselected package tcl8.4.
Unpacking tcl8.4 (from .../tcl8.4_8.4.19-3_i386.deb) ...
Selecting previously deselected package tcl8.4-dev.
Unpacking tcl8.4-dev (from .../tcl8.4-dev_8.4.19-3_i386.deb) ...
Selecting previously deselected package tk8.4.
Unpacking tk8.4 (from .../tk8.4_8.4.19-3_i386.deb) ...
Selecting previously deselected package tk8.4-dev.
Unpacking tk8.4-dev (from .../tk8.4-dev_8.4.19-3_i386.deb) ...
Setting up libice6 (2:1.0.5-1) ...
Setting up x11proto-core-dev (7.0.15-1) ...
Setting up libice-dev (2:1.0.5-1) ...
Setting up libsm6 (2:1.1.0-2) ...
Setting up libsm-dev (2:1.1.0-2) ...
Setting up libxau6 (1:1.0.4-2) ...
Setting up libxdmcp6 (1:1.0.2-3) ...
Setting up libxcb1 (1.3-2) ...
Setting up libx11-data (2:1.2.1-1ubuntu1) ...
Setting up libx11-6 (2:1.2.1-1ubuntu1) ...
Setting up libxau-dev (1:1.0.4-2) ...
Setting up libxdmcp-dev (1:1.0.2-3) ...
Setting up x11proto-input-dev (1.5.0-2ubuntu1) ...
Setting up x11proto-kb-dev (1.0.3-3ubuntu1) ...
Setting up xtrans-dev (1.2.3-3) ...
Setting up libpthread-stubs0 (0.1-2) ...
Setting up libpthread-stubs0-dev (0.1-2) ...
Setting up libxcb1-dev (1.3-2) ...
Setting up libx11-dev (2:1.2.1-1ubuntu1) ...
Setting up libxt6 (1:1.0.5-3ubuntu1) ...
Setting up libxt-dev (1:1.0.5-3ubuntu1) ...
Setting up libmagic1 (5.03-1ubuntu1) ...
Setting up file (5.03-1ubuntu1) ...
Setting up netbase (4.34ubuntu2) ...
Setting up bsdmainutils (6.1.10ubuntu4) ...
Setting up groff-base (1.18.1.1-22build1) ...
Setting up libexpat1 (2.0.1-4) ...
Setting up libhtml-tagset-perl (3.20-2) ...
Setting up liburi-perl (1.37+dfsg-1ubuntu1) ...
Setting up libhtml-parser-perl (3.60-1) ...
Setting up libhtml-tree-perl (3.23-1) ...
Setting up libwww-perl (5.826-1) ...
Setting up libxml-parser-perl (2.36-1.1build2) ...
Setting up man-db (2.5.5-2) ...
Building database of manual pages ...
... skipping, since this is a buildd
Setting up bison (1:2.4.1.dfsg-1) ...
Setting up html2text (1.3.2a-14) ...
Setting up intltool-debian (0.35.0+20060710.1) ...
Setting up po-debconf (1.0.16) ...
Setting up debhelper (7.2.14ubuntu1) ...
Setting up fdupes (1.50-PR2-2) ...
Setting up intltool (0.40.6-2) ...
Setting up cdbs (0.4.56ubuntu5) ...
Setting up dpatch (2.0.31) ...
Setting up libgdbm-dev (1.8.3-4) ...
Setting up libncurses5-dev (5.7+20090523-1ubuntu1) ...
Setting up libreadline5-dev (5.2-4) ...
Setting up zlib1g-dev (1:1.2.3.3.dfsg-13ubuntu1) ...
Setting up libssl-dev (0.9.8g-16ubuntu1) ...
Setting up tcl8.4 (8.4.19-3) ...
Setting up tcl8.4-dev (8.4.19-3) ...
Setting up tk8.4 (8.4.19-3) ...
Setting up tk8.4-dev (8.4.19-3) ...
Processing triggers for libc6 ...
ldconfig deferred processing now taking place
Checking correctness of source dependencies...
Toolchain package versions: libc6-dev_2.9-9ubuntu2 make_3.81-5 dpkg-dev_1.14.24ubuntu2 linux-libc-dev_2.6.30-8.9 g++-4.4_4.4.0-5ubuntu1.1 gcc-4.4_4.4.0-5ubuntu1.1 binutils_2.19.51.20090515-0ubuntu1 libstdc++6_4.4.0-5ubuntu1.1 libstdc++6-4.4-dev_4.4.0-5ubuntu1.1
------------------------------------------------------------------------------
sh: gcc: not found
dpkg-source: warning: Couldn't determine gcc system type, falling back to default (native compilation)
gpg: Signature made Sat Jun 6 04:09:09 2009 BST using DSA key ID 29982E5A
gpg: Can't check signature: public key not found
dpkg-source: extracting ruby1.9 in ruby1.9-1.9.0.2
dpkg-source: unpacking ruby1.9_1.9.0.2.orig.tar.gz
dpkg-source: applying /home/buildd/build-karmic-autotest/ruby1.9_1.9.0.2-9.1ubuntu1.diff.gz
dpkg-buildpackage: set CFLAGS to default value: -g -O2
dpkg-buildpackage: set CPPFLAGS to default value:
dpkg-buildpackage: set LDFLAGS to default value: -Wl,-Bsymbolic-functions
dpkg-buildpackage: set FFLAGS to default value: -g -O2
dpkg-buildpackage: set CXXFLAGS to default value: -g -O2
dpkg-buildpackage: source package ruby1.9
dpkg-buildpackage: source version 1.9.0.2-9.1ubuntu1
dpkg-buildpackage: host architecture i386
/usr/bin/fakeroot debian/rules clean
test -x debian/rules
for i in ./config.guess ./config.sub ; do \
if test -e $i.cdbs-orig ; then \
mv $i.cdbs-orig $i ; \
fi ; \
done
dh_clean
/usr/bin/make -C . -k distclean
make[1]: Entering directory `/build/buildd/ruby1.9-1.9.0.2'
make[1]: *** No rule to make target `distclean'.
make[1]: Leaving directory `/build/buildd/ruby1.9-1.9.0.2'
make: [makefile-clean] Error 2 (ignored)
rm -f debian/stamp-makefile-build
rm -f debian/stamp-autotools-files
/usr/bin/make -f debian/rules reverse-config
make[1]: Entering directory `/build/buildd/ruby1.9-1.9.0.2'
for i in ./config.guess ./config.sub ; do \
if test -e $i.cdbs-orig ; then \
mv $i.cdbs-orig $i ; \
fi ; \
done
make[1]: Leaving directory `/build/buildd/ruby1.9-1.9.0.2'
dpatch deapply-all
931_CVE-2009-0642 not applied to ./ .
930_zero_tainted not applied to ./ .
920_rexml_document_transitive not applied to ./ .
919_common.mk_tweaks not applied to ./ .
909_update_lib_README not applied to ./ .
904_linux_target_os not applied to ./ .
903_skip_base_ruby_check not applied to ./ .
902_define_YAML_in_yaml_stringio.rb not applied to ./ .
901_extra_search_path not applied to ./ .
900_ri_pager not applied to ./ .
308_regexp_segv not applied to ./ .
307_r19033_rexml_DoS not applied to ./ .
306_r17586_methods_called_safelevel13 not applied to ./ .
305_r18496_dl_tain not applied to ./ .
304_r17577_trace_var_safeleve4 not applied to ./ .
303_r17726_syslog_safeleve4 not applied to ./ .
302_r18220_webrick_DoS not applied to ./ .
301_dns_spoofing_r18424 not applied to ./ .
201_gem_prelude not applied to ./ .
103_array_c_r17570_to_r17756 not applied to ./ .
102_skip_test_copy_stream not applied to ./ .
101_parse_rb not applied to ./ .
rm -rf debian/patched
rm -f debian/stamp-patched
rm -f \
.installed.list \
parse.c \
prelude.c \
largefile.h enc.mk \
enc/*.o enc/trans/*.o \
debian/libruby1.9.postinst \
debian/libruby1.9.prerm \
debian/libruby1.9.postrm
cp debian/generated-incs/*.inc .
if [ -f ./config.guess.cdbs-orig ]; \
then \
mv ./config.guess.cdbs-orig \
./config.guess; \
fi
if [ -f ./config.sub.cdbs-orig ]; \
then \
mv ./config.sub.cdbs-orig \
./config.sub; \
fi
debian/rules build
test -x debian/rules
mkdir -p "."
cp debian/generated-incs/*.inc .
echo -n "uname -a: "
uname -a: uname -a
Linux terranova 2.6.24-23-server #1 SMP Mon Jan 26 00:55:21 UTC 2009 i686 GNU/Linux
echo "/proc/cpuinfo: ----------"
/proc/cpuinfo: ----------
cat /proc/cpuinfo
processor : 0
vendor_id : GenuineIntel
cpu family : 15
model : 2
model name : Intel(R) Xeon(TM) CPU 3.06GHz
stepping : 5
cpu MHz : 3060.151
cache size : 1024 KB
fdiv_bug : no
hlt_bug : no
f00f_bug : no
coma_bug : no
fpu : yes
fpu_exception : yes
cpuid level : 2
wp : yes
flags : fpu vme de pse tsc msr pae mce cx8 apic sep mtrr pge mca cmov pat pse36 clflush dts acpi mmx fxsr sse sse2 ss ht tm pbe pebs bts cid xtpr
bogomips : 6123.84
clflush size : 64
processor : 1
vendor_id : GenuineIntel
cpu family : 15
model : 2
model name : Intel(R) Xeon(TM) CPU 3.06GHz
stepping : 5
cpu MHz : 3060.151
cache size : 1024 KB
fdiv_bug : no
hlt_bug : no
f00f_bug : no
coma_bug : no
fpu : yes
fpu_exception : yes
cpuid level : 2
wp : yes
flags : fpu vme de pse tsc msr pae mce cx8 apic sep mtrr pge mca cmov pat pse36 clflush dts acpi mmx fxsr sse sse2 ss ht tm pbe pebs bts cid xtpr
bogomips : 6120.06
clflush size : 64
echo "-------------------------"
-------------------------
if test -e /usr/share/misc/config.guess ; then \
for i in ./config.guess ; do \
if ! test -e $i.cdbs-orig ; then \
mv $i $i.cdbs-orig ; \
cp --remove-destination /usr/share/misc/config.guess $i ; \
fi ; \
done ; \
fi
if test -e /usr/share/misc/config.sub ; then \
for i in ./config.sub ; do \
if ! test -e $i.cdbs-orig ; then \
mv $i $i.cdbs-orig ; \
cp --remove-destination /usr/share/misc/config.sub $i ; \
fi ; \
done ; \
fi
/usr/bin/make -f debian/rules reverse-config
make[1]: Entering directory `/build/buildd/ruby1.9-1.9.0.2'
for i in ./config.guess ./config.sub ; do \
if test -e $i.cdbs-orig ; then \
mv $i.cdbs-orig $i ; \
fi ; \
done
make[1]: Leaving directory `/build/buildd/ruby1.9-1.9.0.2'
dpatch apply-all
applying patch 101_parse_rb to ./ ... ok.
applying patch 102_skip_test_copy_stream to ./ ... ok.
applying patch 103_array_c_r17570_to_r17756 to ./ ... ok.
applying patch 201_gem_prelude to ./ ... ok.
applying patch 301_dns_spoofing_r18424 to ./ ... ok.
applying patch 302_r18220_webrick_DoS to ./ ... ok.
applying patch 303_r17726_syslog_safeleve4 to ./ ... ok.
applying patch 304_r17577_trace_var_safeleve4 to ./ ... ok.
applying patch 305_r18496_dl_tain to ./ ... ok.
applying patch 306_r17586_methods_called_safelevel13 to ./ ... ok.
applying patch 307_r19033_rexml_DoS to ./ ... ok.
applying patch 308_regexp_segv to ./ ... ok.
applying patch 900_ri_pager to ./ ... ok.
applying patch 901_extra_search_path to ./ ... ok.
applying patch 902_define_YAML_in_yaml_stringio.rb to ./ ... ok.
applying patch 903_skip_base_ruby_check to ./ ... ok.
applying patch 904_linux_target_os to ./ ... ok.
applying patch 909_update_lib_README to ./ ... ok.
applying patch 919_common.mk_tweaks to ./ ... ok.
applying patch 920_rexml_document_transitive to ./ ... ok.
applying patch 930_zero_tainted to ./ ... ok.
applying patch 931_CVE-2009-0642 to ./ ... ok.
/usr/bin/make -f debian/rules update-config
make[1]: Entering directory `/build/buildd/ruby1.9-1.9.0.2'
if test -e /usr/share/misc/config.guess ; then \
for i in ./config.guess ; do \
if ! test -e $i.cdbs-orig ; then \
mv $i $i.cdbs-orig ; \
cp --remove-destination /usr/share/misc/config.guess $i ; \
fi ; \
done ; \
fi
if test -e /usr/share/misc/config.sub ; then \
for i in ./config.sub ; do \
if ! test -e $i.cdbs-orig ; then \
mv $i $i.cdbs-orig ; \
cp --remove-destination /usr/share/misc/config.sub $i ; \
fi ; \
done ; \
fi
make[1]: Leaving directory `/build/buildd/ruby1.9-1.9.0.2'
touch debian/stamp-patched
if [ -e ./configure.ac ] || [ -e ./configure.in ]; then cd . && `which autoconfYES || which autoconf`; fi
touch debian/stamp-autotools-files
chmod a+x /build/buildd/ruby1.9-1.9.0.2/./configure
cd . && CC="cc" CXX="g++" CFLAGS="-fno-strict-aliasing -g -g -O2" CXXFLAGS="-fno-strict-aliasing -g" CPPFLAGS="" LDFLAGS="-Wl,-Bsymbolic-functions" /build/buildd/ruby1.9-1.9.0.2/./configure --build=i486-linux-gnu --prefix=/usr --includedir="\${prefix}/include" --mandir="\${prefix}/share/man" --infodir="\${prefix}/share/info" --sysconfdir=/etc --localstatedir=/var --libexecdir="\${prefix}/lib/ruby1.9" --disable-maintainer-mode --disable-dependency-tracking --srcdir=. --enable-frame-address --with-extra-site-search-path='/usr/local/lib/site_ruby/1.9/i386-linux' --with-extra-search-path='/usr/lib/ruby/1.9/i386-linux' --program-suffix=1.9 --enable-pthread --enable-shared --enable-ipv6 --with-lookup-order-hack=INET --disable-rpath --disable-install-doc --with-sitedir='/usr/local/lib/site_ruby' --with-default-kcode=none --with-dbm-type=gdbm_compat --with-tklib=tk8.4 --with-tcllib=tcl8.4 --with-tcl-include=/usr/include/tcl8.4 --with-bundled-sha1 --with-bundled-md5 --with-bundled-r
md160
configure: WARNING: unrecognized options: --disable-maintainer-mode, --disable-dependency-tracking, --enable-ipv6, --with-lookup-order-hack, --with-default-kcode, --with-dbm-type, --with-tklib, --with-tcllib, --with-tcl-include, --with-bundled-sha1, --with-bundled-md5, --with-bundled-rmd160
checking build system type... i486-pc-linux-gnu
checking host system type... i486-pc-linux-gnu
checking target system type... i486-pc-linux-gnu
checking for gcc... cc
checking for C compiler default output file name... a.out
checking whether the C compiler works... yes
checking whether we are cross compiling... no
checking for suffix of executables...
checking for suffix of object files... o
checking whether we are using the GNU C compiler... yes
checking whether cc accepts -g... yes
checking for cc option to accept ISO C89... none needed
checking whether we are using the GNU C++ compiler... yes
checking whether g++ accepts -g... yes
checking how to run the C preprocessor... cc -E
checking for grep that handles long lines and -e... /bin/grep
checking for egrep... /bin/grep -E
checking whether cc needs -traditional... no
checking whether the linker is GNU ld... yes
checking whether cc -E accepts -o... yes
checking for ranlib... ranlib
checking for ar... ar
checking for as... as
checking whether ln -s works... yes
checking whether make sets $(MAKE)... yes
checking for a BSD-compatible install... /usr/bin/install -c
checking for ANSI C header files... yes
checking for sys/types.h... yes
checking for sys/stat.h... yes
checking for stdlib.h... yes
checking for string.h... yes
checking for memory.h... yes
checking for strings.h... yes
checking for inttypes.h... yes
checking for stdint.h... yes
checking for unistd.h... yes
checking minix/config.h usability... no
checking minix/config.h presence... no
checking for minix/config.h... no
checking whether it is safe to define __EXTENSIONS__... yes
checking for special C compiler options needed for large files... no
checking for _FILE_OFFSET_BITS value needed for large files... 64
checking for long long... yes
checking for off_t... yes
checking size of int... 4
checking size of short... 2
checking size of long... 4
checking size of long long... 8
checking size of __int64... 0
checking size of off_t... 8
checking size of void*... 4
checking size of float... 4
checking size of double... 8
checking size of time_t... 4
checking for pid_t... yes
checking for convertible type of pid_t... LONG
checking for uid_t... yes
checking for convertible type of uid_t... ULONG
checking for gid_t... yes
checking for convertible type of gid_t... ULONG
checking for prototypes... yes
checking token paste string... ansi
checking stringization... #expr
checking string literal concatenation... yes
checking for variable length prototypes and stdarg.h... yes
checking for noreturn function attribute... __attribute__ ((noreturn)) x
checking for deprecated function attribute... __attribute__ ((deprecated)) x
checking for noinline function attribute... __attribute__ ((noinline)) x
checking for stdcall function attribute... __attribute__ ((stdcall)) x
checking for cdecl function attribute... __attribute__ ((cdecl)) x
checking for fastcall function attribute... __attribute__ ((fastcall)) x
checking for RUBY_EXTERN... no
checking whether sys_nerr is declared... yes
checking for crypt in -lcrypt... yes
checking for dlopen in -ldl... yes
checking for shl_load in -ldld... no
checking for socketpair in -lsocket... no
checking for clock_gettime in -lrt... yes
checking for dirent.h that defines DIR... yes
checking for library containing opendir... none required
checking for ANSI C header files... (cached) yes
checking for sys/wait.h that is POSIX.1 compatible... yes
checking for stdlib.h... (cached) yes
checking for string.h... (cached) yes
checking for unistd.h... (cached) yes
checking limits.h usability... yes
checking limits.h presence... yes
checking for limits.h... yes
checking sys/file.h usability... yes
checking sys/file.h presence... yes
checking for sys/file.h... yes
checking sys/ioctl.h usability... yes
checking sys/ioctl.h presence... yes
checking for sys/ioctl.h... yes
checking sys/syscall.h usability... yes
checking sys/syscall.h presence... yes
checking for sys/syscall.h... yes
checking fcntl.h usability... yes
checking fcntl.h presence... yes
checking for fcntl.h... yes
checking sys/fcntl.h usability... yes
checking sys/fcntl.h presence... yes
checking for sys/fcntl.h... yes
checking sys/select.h usability... yes
checking sys/select.h presence... yes
checking for sys/select.h... yes
checking sys/time.h usability... yes
checking sys/time.h presence... yes
checking for sys/time.h... yes
checking sys/times.h usability... yes
checking sys/times.h presence... yes
checking for sys/times.h... yes
checking sys/param.h usability... yes
checking sys/param.h presence... yes
checking for sys/param.h... yes
checking syscall.h usability... yes
checking syscall.h presence... yes
checking for syscall.h... yes
checking pwd.h usability... yes
checking pwd.h presence... yes
checking for pwd.h... yes
checking grp.h usability... yes
checking grp.h presence... yes
checking for grp.h... yes
checking a.out.h usability... yes
checking a.out.h presence... yes
checking for a.out.h... yes
checking utime.h usability... yes
checking utime.h presence... yes
checking for utime.h... yes
checking for memory.h... (cached) yes
checking direct.h usability... no
checking direct.h presence... no
checking for direct.h... no
checking sys/resource.h usability... yes
checking sys/resource.h presence... yes
checking for sys/resource.h... yes
checking sys/mkdev.h usability... no
checking sys/mkdev.h presence... no
checking for sys/mkdev.h... no
checking sys/utime.h usability... no
checking sys/utime.h presence... no
checking for sys/utime.h... no
checking xti.h usability... no
checking xti.h presence... no
checking for xti.h... no
checking netinet/in_systm.h usability... yes
checking netinet/in_systm.h presence... yes
checking for netinet/in_systm.h... yes
checking float.h usability... yes
checking float.h presence... yes
checking for float.h... yes
checking ieeefp.h usability... no
checking ieeefp.h presence... no
checking for ieeefp.h... no
checking pthread.h usability... yes
checking pthread.h presence... yes
checking for pthread.h... yes
checking ucontext.h usability... yes
checking ucontext.h presence... yes
checking for ucontext.h... yes
checking intrinsics.h usability... no
checking intrinsics.h presence... no
checking for intrinsics.h... no
checking langinfo.h usability... yes
checking langinfo.h presence... yes
checking for langinfo.h... yes
checking locale.h usability... yes
checking locale.h presence... yes
checking for locale.h... yes
checking sys/sendfile.h usability... yes
checking sys/sendfile.h presence... yes
checking for sys/sendfile.h... yes
checking time.h usability... yes
checking time.h presence... yes
checking for time.h... yes
checking size of rlim_t... 8
checking for size_t... yes
checking size of size_t... 4
checking for struct stat.st_blksize... yes
checking for struct stat.st_blocks... yes
checking for struct stat.st_rdev... yes
checking for struct stat.st_atim... yes
checking for struct stat.st_atimespec... no
checking for struct stat.st_atimensec... no
checking for struct stat.st_mtim... yes
checking for struct stat.st_mtimespec... no
checking for struct stat.st_mtimensec... no
checking for struct stat.st_ctim... yes
checking for struct stat.st_ctimespec... no
checking for struct stat.st_ctimensec... no
checking for struct timespec... yes
checking for fd_mask... yes
checking for int8_t... yes
checking for uint8_t... yes
checking for int16_t... yes
checking for uint16_t... yes
checking for int32_t... yes
checking for uint32_t... yes
checking for int64_t... yes
checking for uint64_t... yes
checking for int128_t... no
checking for uint128_t... no
checking for intptr_t... yes
checking for uintptr_t... yes
checking for ssize_t... yes
checking for stack end address... __libc_stack_end
checking for uid_t in sys/types.h... (cached) yes
checking type of array argument to getgroups... gid_t
checking return type of signal handlers... void
checking for working alloca.h... yes
checking for alloca... yes
checking for working memcmp... yes
checking for dup2... yes
checking for memmove... yes
checking for strerror... yes
checking for strftime... yes
checking for strchr... yes
checking for strstr... yes
checking for crypt... yes
checking for flock... yes
checking for vsnprintf... yes
checking for isnan... yes
checking for finite... yes
checking for isinf... yes
checking for hypot... yes
checking for acosh... yes
checking for erf... yes
checking for tgamma... yes
checking for lgamma_r... yes
checking for cbrt... yes
checking for strlcpy... no
checking for strlcat... no
checking for fmod... yes
checking for killpg... yes
checking for wait4... yes
checking for waitpid... yes
checking for fork... yes
checking for spawnv... no
checking for syscall... yes
checking for chroot... yes
checking for fsync... yes
checking for getcwd... yes
checking for eaccess... yes
checking for truncate... yes
checking for ftruncate... yes
checking for chsize... no
checking for times... yes
checking for utimes... yes
checking for utimensat... yes
checking for fcntl... yes
checking for lockf... yes
checking for lstat... yes
checking for link... yes
checking for symlink... yes
checking for readlink... yes
checking for setitimer... yes
checking for setruid... no
checking for seteuid... yes
checking for setreuid... yes
checking for setresuid... yes
checking for setproctitle... no
checking for socketpair... yes
checking for setrgid... no
checking for setegid... yes
checking for setregid... yes
checking for setresgid... yes
checking for issetugid... no
checking for pause... yes
checking for lchown... yes
checking for lchmod... no
checking for getpgrp... yes
checking for setpgrp... yes
checking for getpgid... yes
checking for setpgid... yes
checking for initgroups... yes
checking for getgroups... yes
checking for setgroups... yes
checking for getpriority... yes
checking for getrlimit... yes
checking for setrlimit... yes
checking for sysconf... yes
checking for group_member... yes
checking for dlopen... yes
checking for sigprocmask... yes
checking for sigaction... yes
checking for sigsetjmp... no
checking for _setjmp... yes
checking for _longjmp... yes
checking for vsnprintf... (cached) yes
checking for snprintf... yes
checking for setsid... yes
checking for telldir... yes
checking for seekdir... yes
checking for fchmod... yes
checking for cosh... yes
checking for sinh... yes
checking for tanh... yes
checking for log2... yes
checking for round... yes
checking for signbit... no
checking for setuid... yes
checking for setgid... yes
checking for daemon... yes
checking for select_large_fdset... no
checking for setenv... yes
checking for unsetenv... yes
checking for mktime... yes
checking for timegm... yes
checking for clock_gettime... yes
checking for gettimeofday... yes
checking for pread... yes
checking for sendfile... yes
checking for __builtin_setjmp... no
checking for setjmp type... _setjmp
checking whether struct tm is in sys/time.h or time.h... time.h
checking for struct tm.tm_zone... yes
checking for struct tm.tm_gmtoff... yes
checking for external int daylight... yes
checking for external timezone... long
checking for external altzone... no
checking for negative time_t for gmtime(3)... yes
checking whether getpgrp requires zero arguments... yes
checking whether setpgrp takes no argument... yes
checking whether byte ordering is bigendian... no
checking for an ANSI C-conforming const... yes
checking whether char is unsigned... no
checking for inline... inline
checking for working volatile... yes
checking whether right shift preserve sign bit... yes
checking read count field in FILE structures... not found(OK if using GNU libc)
checking read buffer ptr field in FILE structures... _IO_read_ptr
checking read buffer end field in FILE structures... _IO_read_end
checking whether st_ino is huge... yes
checking whether _SC_CLK_TCK is supported... yes
checking stack growing direction... (cached) -1
checking for pthread_kill in -lthr... no
checking for pthread_kill in -lpthread... yes
checking for nanosleep... yes
checking for getcontext... yes
checking for setcontext... yes
checking for backtrace... yes
checking whether ELF binaries are produced... yes
checking whether OS depend dynamic link works... yes
checking for nroff... /usr/bin/nroff
creating config.h
configure: creating ./config.status
config.status: creating Makefile
configure: WARNING: unrecognized options: --disable-maintainer-mode, --disable-dependency-tracking, --enable-ipv6, --with-lookup-order-hack, --with-default-kcode, --with-dbm-type, --with-tklib, --with-tcllib, --with-tcl-include, --with-bundled-sha1, --with-bundled-md5, --with-bundled-rmd160
/usr/bin/make -C . all
make[1]: Entering directory `/build/buildd/ruby1.9-1.9.0.2'
cc -fno-strict-aliasing -g -g -O2 -O2 -g -Wall -Wno-parentheses -fPIC -I. -I.ext/include/i486-linux -I./include -I. -DRUBY_EXPORT -o main.o -c main.c
cc -fno-strict-aliasing -g -g -O2 -O2 -g -Wall -Wno-parentheses -fPIC -I. -I.ext/include/i486-linux -I./include -I. -DRUBY_EXPORT -o dln.o -c dln.c
cc -fno-strict-aliasing -g -g -O2 -O2 -g -Wall -Wno-parentheses -fPIC -I. -I.ext/include/i486-linux -I./include -I. -DRUBY_EXPORT -o dmyencoding.o -c dmyencoding.c
cc -fno-strict-aliasing -g -g -O2 -O2 -g -Wall -Wno-parentheses -fPIC -I. -I.ext/include/i486-linux -I./include -I. -DRUBY_EXPORT -o miniprelude.o -c miniprelude.c
cc -fno-strict-aliasing -g -g -O2 -O2 -g -Wall -Wno-parentheses -fPIC -I. -I.ext/include/i486-linux -I./include -I. -DRUBY_EXPORT -o array.o -c array.c
cc -fno-strict-aliasing -g -g -O2 -O2 -g -Wall -Wno-parentheses -fPIC -I. -I.ext/include/i486-linux -I./include -I. -DRUBY_EXPORT -o bignum.o -c bignum.c
cc -fno-strict-aliasing -g -g -O2 -O2 -g -Wall -Wno-parentheses -fPIC -I. -I.ext/include/i486-linux -I./include -I. -DRUBY_EXPORT -o class.o -c class.c
cc -fno-strict-aliasing -g -g -O2 -O2 -g -Wall -Wno-parentheses -fPIC -I. -I.ext/include/i486-linux -I./include -I. -DRUBY_EXPORT -o compar.o -c compar.c
cc -fno-strict-aliasing -g -g -O2 -O2 -g -Wall -Wno-parentheses -fPIC -I. -I.ext/include/i486-linux -I./include -I. -DRUBY_EXPORT -o complex.o -c complex.c
complex.c:498: warning: 'm_sqrt' defined but not used
cc -fno-strict-aliasing -g -g -O2 -O2 -g -Wall -Wno-parentheses -fPIC -I. -I.ext/include/i486-linux -I./include -I. -DRUBY_EXPORT -o dir.o -c dir.c
cc -fno-strict-aliasing -g -g -O2 -O2 -g -Wall -Wno-parentheses -fPIC -I. -I.ext/include/i486-linux -I./include -I. -DRUBY_EXPORT -o enum.o -c enum.c
cc -fno-strict-aliasing -g -g -O2 -O2 -g -Wall -Wno-parentheses -fPIC -I. -I.ext/include/i486-linux -I./include -I. -DRUBY_EXPORT -o enumerator.o -c enumerator.c
enumerator.c:377: warning: 'enumerator_with_object' defined but not used
cc -fno-strict-aliasing -g -g -O2 -O2 -g -Wall -Wno-parentheses -fPIC -I. -I.ext/include/i486-linux -I./include -I. -DRUBY_EXPORT -o error.o -c error.c
cc -fno-strict-aliasing -g -g -O2 -O2 -g -Wall -Wno-parentheses -fPIC -I. -I.ext/include/i486-linux -I./include -I. -DRUBY_EXPORT -o eval.o -c eval.c
eval.c: In function 'rb_interrupt':
eval.c:439: warning: format not a string literal and no format arguments
cc -fno-strict-aliasing -g -g -O2 -O2 -g -Wall -Wno-parentheses -fPIC -I. -I.ext/include/i486-linux -I./include -I. -DRUBY_EXPORT -o load.o -c load.c
cc -fno-strict-aliasing -g -g -O2 -O2 -g -Wall -Wno-parentheses -fPIC -I. -I.ext/include/i486-linux -I./include -I. -DRUBY_EXPORT -o proc.o -c proc.c
cc -fno-strict-aliasing -g -g -O2 -O2 -g -Wall -Wno-parentheses -fPIC -I. -I.ext/include/i486-linux -I./include -I. -DRUBY_EXPORT -o file.o -c file.c
cc -fno-strict-aliasing -g -g -O2 -O2 -g -Wall -Wno-parentheses -fPIC -I. -I.ext/include/i486-linux -I./include -I. -DRUBY_EXPORT -o gc.o -c gc.c
cc -fno-strict-aliasing -g -g -O2 -O2 -g -Wall -Wno-parentheses -fPIC -I. -I.ext/include/i486-linux -I./include -I. -DRUBY_EXPORT -o hash.o -c hash.c
cc -fno-strict-aliasing -g -g -O2 -O2 -g -Wall -Wno-parentheses -fPIC -I. -I.ext/include/i486-linux -I./include -I. -DRUBY_EXPORT -o inits.o -c inits.c
cc -fno-strict-aliasing -g -g -O2 -O2 -g -Wall -Wno-parentheses -fPIC -I. -I.ext/include/i486-linux -I./include -I. -DRUBY_EXPORT -o io.o -c io.c
io.c: In function 'argf_next_argv':
io.c:5394: warning: ignoring return value of 'fchown', declared with attribute warn_unused_result
cc -fno-strict-aliasing -g -g -O2 -O2 -g -Wall -Wno-parentheses -fPIC -I. -I.ext/include/i486-linux -I./include -I. -DRUBY_EXPORT -o marshal.o -c marshal.c
cc -fno-strict-aliasing -g -g -O2 -O2 -g -Wall -Wno-parentheses -fPIC -I. -I.ext/include/i486-linux -I./include -I. -DRUBY_EXPORT -o math.o -c math.c
cc -fno-strict-aliasing -g -g -O2 -O2 -g -Wall -Wno-parentheses -fPIC -I. -I.ext/include/i486-linux -I./include -I. -DRUBY_EXPORT -o numeric.o -c numeric.c
cc -fno-strict-aliasing -g -g -O2 -O2 -g -Wall -Wno-parentheses -fPIC -I. -I.ext/include/i486-linux -I./include -I. -DRUBY_EXPORT -o object.o -c object.c
cc -fno-strict-aliasing -g -g -O2 -O2 -g -Wall -Wno-parentheses -fPIC -I. -I.ext/include/i486-linux -I./include -I. -DRUBY_EXPORT -o pack.o -c pack.c
bison -o y.tab.c parse.y
sed -f ./tool/ytab.sed -e "/^#/s!y\.tab\.c!parse.c!" y.tab.c > parse.c.new
( n=0 ;\
while [ $n -lt 10 ]; do \
[ $(ps aux | grep gcc | grep parse.o | grep -v grep | wc -l) -gt 0 ] && echo "# gcc parse.o started!" && break ;\
n=$(expr $n + 1) ;\
sleep 1 ;\
done ;\
[ $n -eq 60 ] && echo "# gcc never started, exiting." && exit 1 ;\
str="starting..." ;\
while [ "$str" != "" ]; do \
echo "# running... $str" ;\
sleep 5 ;\
str=$(ps aux | grep gcc | grep parse.o | grep -v grep) ;\
done ;\
echo "# watched finished." ; \
touch -d "1 hour ago" start-watcher.stamp ) &
/bin/sh: ps: not found
cc -fno-strict-aliasing -g -g -O2 -O2 -g -Wall -Wno-parentheses -fPIC -Q -I. -I.ext/include/i486-linux -I./include -I. -DRUBY_EXPORT -o parse.o -c parse.c
atof atoi atol atoll gnu_dev_major gnu_dev_minor gnu_dev_makedev realpath ptsname_r wctomb mbstowcs wcstombs __strcspn_c1 __strcspn_c2 __strcspn_c3 __strspn_c1 __strspn_c2 __strspn_c3 __strpbrk_c2 __strpbrk_c3 __strtok_r_1c __strsep_1c __strsep_2c __strsep_3c memcpy memmove mempcpy memset bcopy bzero strcpy stpcpy strncpy stpncpy strcat strncat strtoimax strtoumax wcstoimax wcstoumax getchar fgetc_unlocked getc_unlocked getchar_unlocked putchar fputc_unlocked putc_unlocked putchar_unlocked getline feof_unlocked ferror_unlocked sprintf vsprintf snprintf vsnprintf fprintf printf vprintf vfprintf asprintf __asprintf dprintf obstack_printf vasprintf vdprintf obstack_vprintf gets fgets fread fgets_unlocked fread_unlocked rb_class_of rb_type rb_special_const_p rb_enc_dummy_p tolower toupper vtable_size vtable_alloc vtable_free vtable_add vtable_included yy_symbol_value_print yy_symbol_print yy_stack_print yy_reduce_print yytnamerr yysyntax_error yydestruct ruby_yyparse parser_yyer
ror debug_lines yycompile0 yycompile lex_get_str lex_getline rb_compile_string rb_parser_compile_string rb_compile_cstr rb_parser_compile_cstr lex_io_gets rb_compile_file rb_parser_compile_file parser_str_new parser_nextc parser_pushback parser_newtok parser_tokspace parser_tokadd parser_tok_hex parser_tokadd_utf8 parser_read_escape parser_tokaddmbc parser_tokadd_escape parser_regx_options dispose_string parser_tokadd_mbchar parser_tokadd_string parser_parse_string parser_heredoc_identifier parser_heredoc_restore parser_whole_match_p parser_here_document hash rb_reserved_word arg_ambiguous_gen lvar_defined_gen parser_encode_length parser_set_encode magic_comment_encoding magic_comment_marker parser_magic_comment set_file_encoding parser_prepare parser_yylex yylex node_newnode nodetype nodeline newline_node fixpos parser_warning parser_warn block_append_gen list_append_gen list_concat_gen literal_concat0 literal_concat_gen evstr2dstr_gen new_evstr_gen call_bin_op_gen call_uni
_op_gen match_op_gen gettable_gen assignable_gen shadowing_lvar_gen new_bv_gen aryset_gen block_dup_check_gen rb_id_attrset attrset_gen rb_backref_error_gen arg_concat_gen arg_append_gen splat_array node_assign_gen value_expr_gen void_expr_gen void_stmts_gen remove_begin reduce_nodes_gen assign_in_cond e_option_supplied warn_unless_e_option warning_unless_e_option range_op literal_node cond0 cond_gen logop_gen no_blockarg ret_args_gen new_yield_gen negate_lit arg_blk_pass new_args_gen local_push_gen local_pop_gen vtable_tblcpy local_tbl_gen arg_var_gen local_var_gen local_id_gen dyna_push_gen dyna_pop_gen dyna_in_block_gen dvar_defined_gen dvar_curr_gen reg_fragment_setenc_gen reg_fragment_check_gen reg_named_capture_assign_iter reg_named_capture_assign_gen reg_compile_gen rb_gc_mark_parser rb_parser_append_print rb_parser_while_loop ivar2_cmp ivar2_hash Init_sym rb_gc_mark_symbols internal_id_gen is_special_global_name rb_symname_p rb_enc_symname_p rb_enc_symname2_p rb_inte
rn3 rb_intern2 rb_intern rb_intern_str rb_id2str rb_id2name symbols_i rb_sym_all_symbols rb_is_const_id rb_is_class_id rb_is_instance_id rb_is_local_id rb_is_junk_id parser_initialize parser_mark parser_free parser_new rb_parser_new rb_parser_end_seen_p rb_parser_encoding rb_parser_get_yydebug rb_parser_set_yydebug rb_parser_malloc rb_parser_calloc rb_parser_realloc rb_parser_free
Analyzing compilation unit
Performing interprocedural optimizations
<visibility> <early_local_cleanups> <summary generate> <cp> <inline> <static-var> <pure-const>Assembling functions:
magic_comment_marker nodetype nodeline rb_id_attrset rb_gc_mark_parser ivar2_cmp ivar2_hash rb_is_const_id/bin/sh: ps: not found
rb_is_class_id rb_is_instance_id rb_is_local_id rb_is_junk_id rb_parser_free parser_free dispose_string parser_heredoc_restore vtable_free dyna_pop_gen local_pop_gen node_newnode rb_parser_realloc attrset_gen arg_concat_gen reduce_nodes_gen new_args_gen list_append_gen arg_append_gen node_assign_gen rb_parser_calloc rb_parser_malloc rb_parser_set_yydebug rb_parser_get_yydebug rb_parser_end_seen_p rb_parser_encoding vtable_alloc local_push_gen dyna_push_gen local_tbl_gen rb_parser_new parser_mark rb_sym_all_symbols symbols_i parser_nextc rb_reserved_word is_special_global_name rb_enc_symname2_p rb_enc_symname_p rb_symname_p lex_get_str rb_intern3 rb_intern_str rb_id2str rb_id2name rb_intern2 rb_intern rb_gc_mark_symbols Init_sym block_append_gen rb_parser_while_loop rb_parser_append_print yycompile rb_parser_compile_file rb_compile_file evstr2dstr_gen parser_set_encode magic_comment_encoding lex_io_gets rb_parser_compile_string rb_parser_compile_cstr rb_compile_string rb_comp
ile_cstr void_expr_gen warn_unless_e_option parser_whole_match_p ret_args_gen new_yield_gen rb_backref_error_gen block_dup_check_gen parser_tokspace parser_newtok parser_tokadd parser_encode_length parser_str_new parser_tokaddmbc parser_tokadd_mbchar dvar_defined_gen vtable_add arg_var_gen reg_fragment_setenc_gen reg_compile_gen reg_fragment_check_gen literal_concat0 literal_concat_gen local_id_gen gettable_gen yytnamerr yy_symbol_print yy_stack_print yydestruct parser_yyerror parser_tok_hex assignable_gen shadowing_lvar_gen value_expr_gen call_uni_op_gen call_bin_op_gen logop_gen yysyntax_error negate_lit reg_named_capture_assign_iter/bin/sh: ps: not found
cond0 range_op cond_gen parser_tokadd_utf8 parser_read_escape parser_tokadd_string ruby_yyparse/bin/sh: ps: not found
/bin/sh: ps: not found
/bin/sh: ps: not found
/bin/sh: ps: not found
/bin/sh: ps: not found
/bin/sh: ps: not found
/bin/sh: ps: not found
# running... starting...
/bin/sh: ps: not found
# watched finished.
yycompile0
Execution times (seconds)
callgraph construction: 0.04 ( 0%) usr 0.00 ( 0%) sys 0.02 ( 0%) wall 468 kB ( 1%) ggc
callgraph optimization: 0.07 ( 0%) usr 0.00 ( 0%) sys 0.04 ( 0%) wall 161 kB ( 0%) ggc
ipa cp : 0.01 ( 0%) usr 0.00 ( 0%) sys 0.01 ( 0%) wall 0 kB ( 0%) ggc
cfg cleanup : 0.20 ( 1%) usr 0.00 ( 0%) sys 0.22 ( 1%) wall 102 kB ( 0%) ggc
trivially dead code : 0.04 ( 0%) usr 0.00 ( 0%) sys 0.02 ( 0%) wall 0 kB ( 0%) ggc
df reaching defs : 0.24 ( 1%) usr 0.00 ( 0%) sys 0.25 ( 1%) wall 0 kB ( 0%) ggc
df live regs : 0.63 ( 3%) usr 0.00 ( 0%) sys 0.66 ( 3%) wall 0 kB ( 0%) ggc
df live&initialized regs: 0.84 ( 4%) usr 0.00 ( 0%) sys 0.81 ( 4%) wall 0 kB ( 0%) ggc
df use-def / def-use chains: 0.09 ( 0%) usr 0.00 ( 0%) sys 0.06 ( 0%) wall 0 kB ( 0%) ggc
df reg dead/unused notes: 0.17 ( 1%) usr 0.01 ( 2%) sys 0.15 ( 1%) wall 214 kB ( 1%) ggc
register information : 0.05 ( 0%) usr 0.00 ( 0%) sys 0.07 ( 0%) wall 0 kB ( 0%) ggc
alias analysis : 0.06 ( 0%) usr 0.00 ( 0%) sys 0.05 ( 0%) wall 408 kB ( 1%) ggc
register scan : 0.01 ( 0%) usr 0.00 ( 0%) sys 0.03 ( 0%) wall 0 kB ( 0%) ggc
rebuild jump labels : 0.04 ( 0%) usr 0.00 ( 0%) sys 0.03 ( 0%) wall 0 kB ( 0%) ggc
preprocessing : 0.12 ( 1%) usr 0.06 (12%) sys 0.15 ( 1%) wall 1082 kB ( 3%) ggc
lexical analysis : 0.11 ( 1%) usr 0.11 (22%) sys 0.23 ( 1%) wall 0 kB ( 0%) ggc
parser : 0.17 ( 1%) usr 0.07 (14%) sys 0.24 ( 1%) wall 5519 kB (14%) ggc
inline heuristics : 0.01 ( 0%) usr 0.00 ( 0%) sys 0.03 ( 0%) wall 53 kB ( 0%) ggc
integration : 0.05 ( 0%) usr 0.02 ( 4%) sys 0.06 ( 0%) wall 3623 kB ( 9%) ggc
tree gimplify : 0.03 ( 0%) usr 0.00 ( 0%) sys 0.06 ( 0%) wall 2660 kB ( 7%) ggc
tree CFG construction : 0.00 ( 0%) usr 0.01 ( 2%) sys 0.00 ( 0%) wall 773 kB ( 2%) ggc
tree CFG cleanup : 0.09 ( 0%) usr 0.00 ( 0%) sys 0.20 ( 1%) wall 97 kB ( 0%) ggc
tree VRP : 0.23 ( 1%) usr 0.00 ( 0%) sys 0.22 ( 1%) wall 2608 kB ( 7%) ggc
tree copy propagation : 0.08 ( 0%) usr 0.01 ( 2%) sys 0.07 ( 0%) wall 118 kB ( 0%) ggc
tree find ref. vars : 0.00 ( 0%) usr 0.00 ( 0%) sys 0.01 ( 0%) wall 204 kB ( 1%) ggc
tree PTA : 0.09 ( 0%) usr 0.00 ( 0%) sys 0.02 ( 0%) wall 399 kB ( 1%) ggc
tree alias analysis : 0.04 ( 0%) usr 0.00 ( 0%) sys 0.03 ( 0%) wall 79 kB ( 0%) ggc
tree call clobbering : 0.01 ( 0%) usr 0.00 ( 0%) sys 0.00 ( 0%) wall 3 kB ( 0%) ggc
tree flow sensitive alias: 0.01 ( 0%) usr 0.00 ( 0%) sys 0.00 ( 0%) wall 3 kB ( 0%) ggc
tree memory partitioning: 0.00 ( 0%) usr 0.00 ( 0%) sys 0.01 ( 0%) wall 0 kB ( 0%) ggc
tree SSA rewrite : 0.08 ( 0%) usr 0.00 ( 0%) sys 0.08 ( 0%) wall 798 kB ( 2%) ggc
tree SSA other : 0.01 ( 0%) usr 0.01 ( 2%) sys 0.00 ( 0%) wall 0 kB ( 0%) ggc
tree SSA incremental : 0.14 ( 1%) usr 0.00 ( 0%) sys 0.14 ( 1%) wall 306 kB ( 1%) ggc
tree operand scan : 0.14 ( 1%) usr 0.02 ( 4%) sys 0.17 ( 1%) wall 2201 kB ( 6%) ggc
dominator optimization: 0.08 ( 0%) usr 0.00 ( 0%) sys 0.07 ( 0%) wall 797 kB ( 2%) ggc
tree CCP : 0.04 ( 0%) usr 0.00 ( 0%) sys 0.04 ( 0%) wall 191 kB ( 0%) ggc
tree PHI const/copy prop: 0.01 ( 0%) usr 0.00 ( 0%) sys 0.00 ( 0%) wall 9 kB ( 0%) ggc
tree split crit edges : 0.01 ( 0%) usr 0.00 ( 0%) sys 0.02 ( 0%) wall 439 kB ( 1%) ggc
tree reassociation : 0.02 ( 0%) usr 0.00 ( 0%) sys 0.01 ( 0%) wall 74 kB ( 0%) ggc
tree PRE : 10.69 (56%) usr 0.14 (27%) sys 10.87 (56%) wall 902 kB ( 2%) ggc
tree FRE : 0.13 ( 1%) usr 0.00 ( 0%) sys 0.12 ( 1%) wall 393 kB ( 1%) ggc
tree code sinking : 0.02 ( 0%) usr 0.00 ( 0%) sys 0.01 ( 0%) wall 38 kB ( 0%) ggc
tree linearize phis : 0.00 ( 0%) usr 0.00 ( 0%) sys 0.01 ( 0%) wall 1 kB ( 0%) ggc
tree forward propagate: 0.02 ( 0%) usr 0.00 ( 0%) sys 0.00 ( 0%) wall 183 kB ( 0%) ggc
tree conservative DCE : 0.01 ( 0%) usr 0.00 ( 0%) sys 0.01 ( 0%) wall 2 kB ( 0%) ggc
tree aggressive DCE : 0.02 ( 0%) usr 0.00 ( 0%) sys 0.01 ( 0%) wall 5 kB ( 0%) ggc
tree buildin call DCE : 0.00 ( 0%) usr 0.00 ( 0%) sys 0.01 ( 0%) wall 0 kB ( 0%) ggc
tree DSE : 0.00 ( 0%) usr 0.00 ( 0%) sys 0.01 ( 0%) wall 14 kB ( 0%) ggc
tree loop bounds : 0.02 ( 0%) usr 0.00 ( 0%) sys 0.01 ( 0%) wall 29 kB ( 0%) ggc
loop invariant motion : 0.03 ( 0%) usr 0.00 ( 0%) sys 0.02 ( 0%) wall 1 kB ( 0%) ggc
scev constant prop : 0.00 ( 0%) usr 0.00 ( 0%) sys 0.01 ( 0%) wall 104 kB ( 0%) ggc
complete unrolling : 0.01 ( 0%) usr 0.01 ( 2%) sys 0.00 ( 0%) wall 126 kB ( 0%) ggc
tree iv optimization : 0.01 ( 0%) usr 0.00 ( 0%) sys 0.00 ( 0%) wall 132 kB ( 0%) ggc
tree loop init : 0.01 ( 0%) usr 0.00 ( 0%) sys 0.01 ( 0%) wall 92 kB ( 0%) ggc
tree copy headers : 0.00 ( 0%) usr 0.00 ( 0%) sys 0.02 ( 0%) wall 177 kB ( 0%) ggc
tree SSA uncprop : 0.01 ( 0%) usr 0.00 ( 0%) sys 0.01 ( 0%) wall 0 kB ( 0%) ggc
tree SSA to normal : 0.05 ( 0%) usr 0.00 ( 0%) sys 0.05 ( 0%) wall 956 kB ( 2%) ggc
tree rename SSA copies: 0.00 ( 0%) usr 0.00 ( 0%) sys 0.01 ( 0%) wall 0 kB ( 0%) ggc
dominance frontiers : 0.07 ( 0%) usr 0.00 ( 0%) sys 0.04 ( 0%) wall 0 kB ( 0%) ggc
dominance computation : 0.12 ( 1%) usr 0.00 ( 0%) sys 0.11 ( 1%) wall 0 kB ( 0%) ggc
control dependences : 0.00 ( 0%) usr 0.00 ( 0%) sys 0.01 ( 0%) wall 0 kB ( 0%) ggc
expand : 0.48 ( 3%) usr 0.00 ( 0%) sys 0.48 ( 2%) wall 4710 kB (12%) ggc
varconst : 0.00 ( 0%) usr 0.00 ( 0%) sys 0.01 ( 0%) wall 0 kB ( 0%) ggc
lower subreg : 0.00 ( 0%) usr 0.00 ( 0%) sys 0.01 ( 0%) wall 0 kB ( 0%) ggc
forward prop : 0.03 ( 0%) usr 0.00 ( 0%) sys 0.03 ( 0%) wall 257 kB ( 1%) ggc
CSE : 0.12 ( 1%) usr 0.01 ( 2%) sys 0.15 ( 1%) wall 60 kB ( 0%) ggc
dead code elimination : 0.05 ( 0%) usr 0.01 ( 2%) sys 0.04 ( 0%) wall 0 kB ( 0%) ggc
dead store elim1 : 0.07 ( 0%) usr 0.00 ( 0%) sys 0.06 ( 0%) wall 253 kB ( 1%) ggc
dead store elim2 : 0.07 ( 0%) usr 0.00 ( 0%) sys 0.10 ( 1%) wall 344 kB ( 1%) ggc
loop analysis : 0.12 ( 1%) usr 0.01 ( 2%) sys 0.15 ( 1%) wall 73 kB ( 0%) ggc
global CSE : 0.02 ( 0%) usr 0.00 ( 0%) sys 0.00 ( 0%) wall 0 kB ( 0%) ggc
CPROP 1 : 0.03 ( 0%) usr 0.00 ( 0%) sys 0.04 ( 0%) wall 201 kB ( 1%) ggc
PRE : 0.22 ( 1%) usr 0.00 ( 0%) sys 0.22 ( 1%) wall 48 kB ( 0%) ggc
CPROP 2 : 0.04 ( 0%) usr 0.00 ( 0%) sys 0.07 ( 0%) wall 150 kB ( 0%) ggc
bypass jumps : 0.05 ( 0%) usr 0.00 ( 0%) sys 0.04 ( 0%) wall 111 kB ( 0%) ggc
CSE 2 : 0.07 ( 0%) usr 0.00 ( 0%) sys 0.09 ( 0%) wall 35 kB ( 0%) ggc
branch prediction : 0.02 ( 0%) usr 0.00 ( 0%) sys 0.03 ( 0%) wall 147 kB ( 0%) ggc
combiner : 0.14 ( 1%) usr 0.00 ( 0%) sys 0.13 ( 1%) wall 483 kB ( 1%) ggc
if-conversion : 0.01 ( 0%) usr 0.00 ( 0%) sys 0.04 ( 0%) wall 130 kB ( 0%) ggc
regmove : 0.05 ( 0%) usr 0.00 ( 0%) sys 0.03 ( 0%) wall 0 kB ( 0%) ggc
integrated RA : 0.84 ( 4%) usr 0.00 ( 0%) sys 0.88 ( 5%) wall 462 kB ( 1%) ggc
reload : 0.39 ( 2%) usr 0.00 ( 0%) sys 0.41 ( 2%) wall 597 kB ( 2%) ggc
reload CSE regs : 0.14 ( 1%) usr 0.00 ( 0%) sys 0.15 ( 1%) wall 658 kB ( 2%) ggc
thread pro- & epilogue: 0.02 ( 0%) usr 0.00 ( 0%) sys 0.02 ( 0%) wall 125 kB ( 0%) ggc
if-conversion 2 : 0.01 ( 0%) usr 0.00 ( 0%) sys 0.01 ( 0%) wall 38 kB ( 0%) ggc
peephole 2 : 0.02 ( 0%) usr 0.00 ( 0%) sys 0.02 ( 0%) wall 22 kB ( 0%) ggc
rename registers : 0.04 ( 0%) usr 0.00 ( 0%) sys 0.02 ( 0%) wall 5 kB ( 0%) ggc
scheduling 2 : 0.18 ( 1%) usr 0.01 ( 2%) sys 0.17 ( 1%) wall 27 kB ( 0%) ggc
machine dep reorg : 0.03 ( 0%) usr 0.00 ( 0%) sys 0.02 ( 0%) wall 26 kB ( 0%) ggc
reorder blocks : 0.06 ( 0%) usr 0.00 ( 0%) sys 0.05 ( 0%) wall 428 kB ( 1%) ggc
reg stack : 0.02 ( 0%) usr 0.00 ( 0%) sys 0.01 ( 0%) wall 2 kB ( 0%) ggc
final : 0.07 ( 0%) usr 0.00 ( 0%) sys 0.14 ( 1%) wall 391 kB ( 1%) ggc
symout : 0.06 ( 0%) usr 0.00 ( 0%) sys 0.04 ( 0%) wall 1781 kB ( 5%) ggc
variable tracking : 0.14 ( 1%) usr 0.00 ( 0%) sys 0.18 ( 1%) wall 246 kB ( 1%) ggc
tree if-combine : 0.01 ( 0%) usr 0.00 ( 0%) sys 0.00 ( 0%) wall 0 kB ( 0%) ggc
TOTAL : 18.93 0.51 19.50 39217 kB
cc -fno-strict-aliasing -g -g -O2 -O2 -g -Wall -Wno-parentheses -fPIC -I. -I.ext/include/i486-linux -I./include -I. -DRUBY_EXPORT -o process.o -c process.c
process.c: In function 'rb_fork':
process.c:2361: warning: ignoring return value of 'write', declared with attribute warn_unused_result
cc -fno-strict-aliasing -g -g -O2 -O2 -g -Wall -Wno-parentheses -fPIC -I. -I.ext/include/i486-linux -I./include -I. -DRUBY_EXPORT -o prec.o -c prec.c
cc -fno-strict-aliasing -g -g -O2 -O2 -g -Wall -Wno-parentheses -fPIC -I. -I.ext/include/i486-linux -I./include -I. -DRUBY_EXPORT -o random.o -c random.c
random.c: In function 'fill_random_seed':
random.c:292: warning: ignoring return value of 'read', declared with attribute warn_unused_result
cc -fno-strict-aliasing -g -g -O2 -O2 -g -Wall -Wno-parentheses -fPIC -I. -I.ext/include/i486-linux -I./include -I. -DRUBY_EXPORT -o range.o -c range.c
cc -fno-strict-aliasing -g -g -O2 -O2 -g -Wall -Wno-parentheses -fPIC -I. -I.ext/include/i486-linux -I./include -I. -DRUBY_EXPORT -o rational.o -c rational.c
cc -fno-strict-aliasing -g -g -O2 -O2 -g -Wall -Wno-parentheses -fPIC -I. -I.ext/include/i486-linux -I./include -I. -DRUBY_EXPORT -o re.o -c re.c
cc -fno-strict-aliasing -g -g -O2 -O2 -g -Wall -Wno-parentheses -fPIC -I. -I.ext/include/i486-linux -I./include -I. -DRUBY_EXPORT -o regcomp.o -c regcomp.c
cc -fno-strict-aliasing -g -g -O2 -O2 -g -Wall -Wno-parentheses -fPIC -I. -I.ext/include/i486-linux -I./include -I. -DRUBY_EXPORT -o regenc.o -c regenc.c
cc -fno-strict-aliasing -g -g -O2 -O2 -g -Wall -Wno-parentheses -fPIC -I. -I.ext/include/i486-linux -I./include -I. -DRUBY_EXPORT -o regerror.o -c regerror.c
cc -fno-strict-aliasing -g -g -O2 -O2 -g -Wall -Wno-parentheses -fPIC -I. -I.ext/include/i486-linux -I./include -I. -DRUBY_EXPORT -o regexec.o -c regexec.c
cc -fno-strict-aliasing -g -g -O2 -O2 -g -Wall -Wno-parentheses -fPIC -I. -I.ext/include/i486-linux -I./include -I. -DRUBY_EXPORT -o regparse.o -c regparse.c
cc -fno-strict-aliasing -g -g -O2 -O2 -g -Wall -Wno-parentheses -fPIC -I. -I.ext/include/i486-linux -I./include -I. -DRUBY_EXPORT -o regsyntax.o -c regsyntax.c
cc -fno-strict-aliasing -g -g -O2 -O2 -g -Wall -Wno-parentheses -fPIC -I. -I.ext/include/i486-linux -I./include -I. -DRUBY_EXPORT -o ruby.o -c ruby.c
cc -fno-strict-aliasing -g -g -O2 -O2 -g -Wall -Wno-parentheses -fPIC -I. -I.ext/include/i486-linux -I./include -I. -DRUBY_EXPORT -o signal.o -c signal.c
cc -fno-strict-aliasing -g -g -O2 -O2 -g -Wall -Wno-parentheses -fPIC -I. -I.ext/include/i486-linux -I./include -I. -DRUBY_EXPORT -o sprintf.o -c sprintf.c
sprintf.c: In function 'rb_str_format':
sprintf.c:982: warning: format not a string literal and no format arguments
sprintf.c:983: warning: format not a string literal and no format arguments
cc -fno-strict-aliasing -g -g -O2 -O2 -g -Wall -Wno-parentheses -fPIC -I. -I.ext/include/i486-linux -I./include -I. -DRUBY_EXPORT -o st.o -c st.c
cc -fno-strict-aliasing -g -g -O2 -O2 -g -Wall -Wno-parentheses -fPIC -I. -I.ext/include/i486-linux -I./include -I. -DRUBY_EXPORT -o string.o -c string.c
cc -fno-strict-aliasing -g -g -O2 -O2 -g -Wall -Wno-parentheses -fPIC -I. -I.ext/include/i486-linux -I./include -I. -DRUBY_EXPORT -o struct.o -c struct.c
cc -fno-strict-aliasing -g -g -O2 -O2 -g -Wall -Wno-parentheses -fPIC -I. -I.ext/include/i486-linux -I./include -I. -DRUBY_EXPORT -o time.o -c time.c
cc -fno-strict-aliasing -g -g -O2 -O2 -g -Wall -Wno-parentheses -fPIC -I. -I.ext/include/i486-linux -I./include -I. -DRUBY_EXPORT -o transcode.o -c transcode.c
cc -fno-strict-aliasing -g -g -O2 -O2 -g -Wall -Wno-parentheses -fPIC -I. -I.ext/include/i486-linux -I./include -I. -DRUBY_EXPORT -o util.o -c util.c
cc -fno-strict-aliasing -g -g -O2 -O2 -g -Wall -Wno-parentheses -fPIC -I. -I.ext/include/i486-linux -I./include -I. -DRUBY_EXPORT -o variable.o -c variable.c
cc -fno-strict-aliasing -g -g -O2 -O2 -g -Wall -Wno-parentheses -fPIC -I. -I.ext/include/i486-linux -I./include -I. -DRUBY_EXPORT -o version.o -c version.c
cc -fno-strict-aliasing -g -g -O2 -O2 -g -Wall -Wno-parentheses -fPIC -I. -I.ext/include/i486-linux -I./include -I. -DRUBY_EXPORT -o blockinlining.o -c blockinlining.c
cc -fno-strict-aliasing -g -g -O2 -O2 -g -Wall -Wno-parentheses -fPIC -I. -I.ext/include/i486-linux -I./include -I. -DRUBY_EXPORT -o compile.o -c compile.c
cc -fno-strict-aliasing -g -g -O2 -O2 -g -Wall -Wno-parentheses -fPIC -I. -I.ext/include/i486-linux -I./include -I. -DRUBY_EXPORT -o debug.o -c debug.c
cc -fno-strict-aliasing -g -g -O2 -O2 -g -Wall -Wno-parentheses -fPIC -I. -I.ext/include/i486-linux -I./include -I. -DRUBY_EXPORT -o iseq.o -c iseq.c
cc -fno-strict-aliasing -g -g -O2 -O2 -g -Wall -Wno-parentheses -fPIC -I. -I.ext/include/i486-linux -I./include -I. -DRUBY_EXPORT -o vm.o -c vm.c
cc -fno-strict-aliasing -g -g -O2 -O2 -g -Wall -Wno-parentheses -fPIC -I. -I.ext/include/i486-linux -I./include -I. -DRUBY_EXPORT -o vm_dump.o -c vm_dump.c
cc -fno-strict-aliasing -g -g -O2 -O2 -g -Wall -Wno-parentheses -fPIC -I. -I.ext/include/i486-linux -I./include -I. -DRUBY_EXPORT -o thread.o -c thread.c
thread.c: In function 'rb_mutex_unlock':
thread.c:2660: warning: format not a string literal and no format arguments
cc -fno-strict-aliasing -g -g -O2 -O2 -g -Wall -Wno-parentheses -fPIC -I. -I.ext/include/i486-linux -I./include -I. -DRUBY_EXPORT -o cont.o -c cont.c
cc -fno-strict-aliasing -g -g -O2 -O2 -g -Wall -Wno-parentheses -fPIC -I. -I.ext/include/i486-linux -I./include -I. -DRUBY_EXPORT -o id.o -c id.c
cc -fno-strict-aliasing -g -g -O2 -O2 -g -Wall -Wno-parentheses -fPIC -I. -I.ext/include/i486-linux -I./include -I. -DRUBY_EXPORT -o ascii.o -c ./enc/ascii.c
cc -fno-strict-aliasing -g -g -O2 -O2 -g -Wall -Wno-parentheses -fPIC -I. -I.ext/include/i486-linux -I./include -I. -DRUBY_EXPORT -o us_ascii.o -c ./enc/us_ascii.c
cc -fno-strict-aliasing -g -g -O2 -O2 -g -Wall -Wno-parentheses -fPIC -I. -I.ext/include/i486-linux -I./include -I. -DRUBY_EXPORT -o unicode.o -c ./enc/unicode.c
cc -fno-strict-aliasing -g -g -O2 -O2 -g -Wall -Wno-parentheses -fPIC -I. -I.ext/include/i486-linux -I./include -I. -DRUBY_EXPORT -o utf_8.o -c ./enc/utf_8.c
cc -fno-strict-aliasing -g -g -O2 -O2 -g -Wall -Wno-parentheses -fPIC -I. -I.ext/include/i486-linux -I./include -I. -DRUBY_EXPORT -o strlcpy.o -c ./missing/strlcpy.c
cc -fno-strict-aliasing -g -g -O2 -O2 -g -Wall -Wno-parentheses -fPIC -I. -I.ext/include/i486-linux -I./include -I. -DRUBY_EXPORT -o strlcat.o -c ./missing/strlcat.c
cc -fno-strict-aliasing -g -g -O2 -O2 -g -Wall -Wno-parentheses -fPIC -I. -I.ext/include/i486-linux -I./include -I. -DRUBY_EXPORT -o dmyext.o -c dmyext.c
cc -fno-strict-aliasing -g -g -O2 -O2 -g -Wall -Wno-parentheses -fPIC -L. -Wl,-Bsymbolic-functions -rdynamic -Wl,-export-dynamic main.o dln.o dmyencoding.o miniprelude.o array.o bignum.o class.o compar.o complex.o dir.o enum.o enumerator.o error.o eval.o load.o proc.o file.o gc.o hash.o inits.o io.o marshal.o math.o numeric.o object.o pack.o parse.o process.o prec.o random.o range.o rational.o re.o regcomp.o regenc.o regerror.o regexec.o regparse.o regsyntax.o ruby.o signal.o sprintf.o st.o string.o struct.o time.o transcode.o util.o variable.o version.o blockinlining.o compile.o debug.o iseq.o vm.o vm_dump.o thread.o cont.o id.o ascii.o us_ascii.o unicode.o utf_8.o strlcpy.o strlcat.o dmyext.o -lpthread -lrt -ldl -lcrypt -lm -o miniruby
./miniruby -I./lib -I.ext/common -I./- -r./ext/purelib.rb ./enc/make_encdb.rb ./enc encdb.h.new
./tool/ifchange "encdb.h" "encdb.h.new"
encdb.h unchanged
./miniruby -I./lib -I.ext/common -I./- -r./ext/purelib.rb ./enc/trans/make_transdb.rb ./enc/trans transdb.h.new
./tool/ifchange "transdb.h" "transdb.h.new"
transdb.h updated
rbconfig.rb updated
cc -fno-strict-aliasing -g -g -O2 -O2 -g -Wall -Wno-parentheses -fPIC -I. -I.ext/include/i486-linux -I./include -I. -DRUBY_EXPORT -o encoding.o -c encoding.c
./miniruby -I./lib -I.ext/common -I./- -r./ext/purelib.rb -I. -rrbconfig ./tool/compile_prelude.rb ./prelude.rb ./enc/prelude.rb ./gem_prelude.rb prelude.c
cc -fno-strict-aliasing -g -g -O2 -O2 -g -Wall -Wno-parentheses -fPIC -I. -I.ext/include/i486-linux -I./include -I. -DRUBY_EXPORT -o prelude.o -c prelude.c
ar rcu libruby1.9-static.a dln.o encoding.o prelude.o array.o bignum.o class.o compar.o complex.o dir.o enum.o enumerator.o error.o eval.o load.o proc.o file.o gc.o hash.o inits.o io.o marshal.o math.o numeric.o object.o pack.o parse.o process.o prec.o random.o range.o rational.o re.o regcomp.o regenc.o regerror.o regexec.o regparse.o regsyntax.o ruby.o signal.o sprintf.o st.o string.o struct.o time.o transcode.o util.o variable.o version.o blockinlining.o compile.o debug.o iseq.o vm.o vm_dump.o thread.o cont.o id.o ascii.o us_ascii.o unicode.o utf_8.o strlcpy.o strlcat.o dmyext.o
cc -shared -Wl,-soname,libruby1.9.so.1.9 dln.o encoding.o prelude.o array.o bignum.o class.o compar.o complex.o dir.o enum.o enumerator.o error.o eval.o load.o proc.o file.o gc.o hash.o inits.o io.o marshal.o math.o numeric.o object.o pack.o parse.o process.o prec.o random.o range.o rational.o re.o regcomp.o regenc.o regerror.o regexec.o regparse.o regsyntax.o ruby.o signal.o sprintf.o st.o string.o struct.o time.o transcode.o util.o variable.o version.o blockinlining.o compile.o debug.o iseq.o vm.o vm_dump.o thread.o cont.o id.o ascii.o us_ascii.o unicode.o utf_8.o strlcpy.o strlcat.o dmyext.o -lpthread -lrt -ldl -lcrypt -lm -o libruby1.9.so.1.9.0
./miniruby -I./lib -I.ext/common -I./- -r./ext/purelib.rb ./enc/make_encmake.rb --builtin-encs="ascii.o us_ascii.o unicode.o utf_8.o" enc.mk
./miniruby -I./lib -I.ext/common -I./- -r./ext/purelib.rb -run -e mkdir -- -p ".ext/i486-linux/enc/trans" enc/trans
/usr/bin/make -f enc.mk RUBY="./miniruby -I./lib -I.ext/common -I./- -r./ext/purelib.rb " -w
make[2]: Entering directory `/build/buildd/ruby1.9-1.9.0.2'
cc -I. -I.ext/include/i486-linux -I./include -I. -D_FILE_OFFSET_BITS=64 -DONIG_ENC_REGISTER=rb_enc_register -fPIC -fno-strict-aliasing -g -g -O2 -O2 -g -Wall -Wno-parentheses -fPIC -o enc/big5.o -c enc/big5.c
cc -shared -o .ext/i486-linux/enc/big5.so enc/big5.o -L. -L. -L. -Wl,-Bsymbolic-functions -rdynamic -Wl,-export-dynamic -lruby1.9 -lpthread -lrt -ldl -lcrypt -lm
cc -I. -I.ext/include/i486-linux -I./include -I. -D_FILE_OFFSET_BITS=64 -DONIG_ENC_REGISTER=rb_enc_register -fPIC -fno-strict-aliasing -g -g -O2 -O2 -g -Wall -Wno-parentheses -fPIC -o enc/cp949.o -c enc/cp949.c
cc -shared -o .ext/i486-linux/enc/cp949.so enc/cp949.o -L. -L. -L. -Wl,-Bsymbolic-functions -rdynamic -Wl,-export-dynamic -lruby1.9 -lpthread -lrt -ldl -lcrypt -lm
cc -I. -I.ext/include/i486-linux -I./include -I. -D_FILE_OFFSET_BITS=64 -DONIG_ENC_REGISTER=rb_enc_register -fPIC -fno-strict-aliasing -g -g -O2 -O2 -g -Wall -Wno-parentheses -fPIC -o enc/encdb.o -c enc/encdb.c
cc -shared -o .ext/i486-linux/enc/encdb.so enc/encdb.o -L. -L. -L. -Wl,-Bsymbolic-functions -rdynamic -Wl,-export-dynamic -lruby1.9 -lpthread -lrt -ldl -lcrypt -lm
cc -I. -I.ext/include/i486-linux -I./include -I. -D_FILE_OFFSET_BITS=64 -DONIG_ENC_REGISTER=rb_enc_register -fPIC -fno-strict-aliasing -g -g -O2 -O2 -g -Wall -Wno-parentheses -fPIC -o enc/euc_jp.o -c enc/euc_jp.c
cc -shared -o .ext/i486-linux/enc/euc_jp.so enc/euc_jp.o -L. -L. -L. -Wl,-Bsymbolic-functions -rdynamic -Wl,-export-dynamic -lruby1.9 -lpthread -lrt -ldl -lcrypt -lm
cc -I. -I.ext/include/i486-linux -I./include -I. -D_FILE_OFFSET_BITS=64 -DONIG_ENC_REGISTER=rb_enc_register -fPIC -fno-strict-aliasing -g -g -O2 -O2 -g -Wall -Wno-parentheses -fPIC -o enc/euc_kr.o -c enc/euc_kr.c
cc -shared -o .ext/i486-linux/enc/euc_kr.so enc/euc_kr.o -L. -L. -L. -Wl,-Bsymbolic-functions -rdynamic -Wl,-export-dynamic -lruby1.9 -lpthread -lrt -ldl -lcrypt -lm
cc -I. -I.ext/include/i486-linux -I./include -I. -D_FILE_OFFSET_BITS=64 -DONIG_ENC_REGISTER=rb_enc_register -fPIC -fno-strict-aliasing -g -g -O2 -O2 -g -Wall -Wno-parentheses -fPIC -o enc/euc_tw.o -c enc/euc_tw.c
cc -shared -o .ext/i486-linux/enc/euc_tw.so enc/euc_tw.o -L. -L. -L. -Wl,-Bsymbolic-functions -rdynamic -Wl,-export-dynamic -lruby1.9 -lpthread -lrt -ldl -lcrypt -lm
cc -I. -I.ext/include/i486-linux -I./include -I. -D_FILE_OFFSET_BITS=64 -DONIG_ENC_REGISTER=rb_enc_register -fPIC -fno-strict-aliasing -g -g -O2 -O2 -g -Wall -Wno-parentheses -fPIC -o enc/gb2312.o -c enc/gb2312.c
cc -shared -o .ext/i486-linux/enc/gb2312.so enc/gb2312.o -L. -L. -L. -Wl,-Bsymbolic-functions -rdynamic -Wl,-export-dynamic -lruby1.9 -lpthread -lrt -ldl -lcrypt -lm
cc -I. -I.ext/include/i486-linux -I./include -I. -D_FILE_OFFSET_BITS=64 -DONIG_ENC_REGISTER=rb_enc_register -fPIC -fno-strict-aliasing -g -g -O2 -O2 -g -Wall -Wno-parentheses -fPIC -o enc/gb18030.o -c enc/gb18030.c
cc -shared -o .ext/i486-linux/enc/gb18030.so enc/gb18030.o -L. -L. -L. -Wl,-Bsymbolic-functions -rdynamic -Wl,-export-dynamic -lruby1.9 -lpthread -lrt -ldl -lcrypt -lm
cc -I. -I.ext/include/i486-linux -I./include -I. -D_FILE_OFFSET_BITS=64 -DONIG_ENC_REGISTER=rb_enc_register -fPIC -fno-strict-aliasing -g -g -O2 -O2 -g -Wall -Wno-parentheses -fPIC -o enc/gbk.o -c enc/gbk.c
cc -shared -o .ext/i486-linux/enc/gbk.so enc/gbk.o -L. -L. -L. -Wl,-Bsymbolic-functions -rdynamic -Wl,-export-dynamic -lruby1.9 -lpthread -lrt -ldl -lcrypt -lm
cc -I. -I.ext/include/i486-linux -I./include -I. -D_FILE_OFFSET_BITS=64 -DONIG_ENC_REGISTER=rb_enc_register -fPIC -fno-strict-aliasing -g -g -O2 -O2 -g -Wall -Wno-parentheses -fPIC -o enc/iso_8859_1.o -c enc/iso_8859_1.c
cc -shared -o .ext/i486-linux/enc/iso_8859_1.so enc/iso_8859_1.o -L. -L. -L. -Wl,-Bsymbolic-functions -rdynamic -Wl,-export-dynamic -lruby1.9 -lpthread -lrt -ldl -lcrypt -lm
cc -I. -I.ext/include/i486-linux -I./include -I. -D_FILE_OFFSET_BITS=64 -DONIG_ENC_REGISTER=rb_enc_register -fPIC -fno-strict-aliasing -g -g -O2 -O2 -g -Wall -Wno-parentheses -fPIC -o enc/iso_8859_2.o -c enc/iso_8859_2.c
cc -shared -o .ext/i486-linux/enc/iso_8859_2.so enc/iso_8859_2.o -L. -L. -L. -Wl,-Bsymbolic-functions -rdynamic -Wl,-export-dynamic -lruby1.9 -lpthread -lrt -ldl -lcrypt -lm
cc -I. -I.ext/include/i486-linux -I./include -I. -D_FILE_OFFSET_BITS=64 -DONIG_ENC_REGISTER=rb_enc_register -fPIC -fno-strict-aliasing -g -g -O2 -O2 -g -Wall -Wno-parentheses -fPIC -o enc/iso_8859_3.o -c enc/iso_8859_3.c
cc -shared -o .ext/i486-linux/enc/iso_8859_3.so enc/iso_8859_3.o -L. -L. -L. -Wl,-Bsymbolic-functions -rdynamic -Wl,-export-dynamic -lruby1.9 -lpthread -lrt -ldl -lcrypt -lm
cc -I. -I.ext/include/i486-linux -I./include -I. -D_FILE_OFFSET_BITS=64 -DONIG_ENC_REGISTER=rb_enc_register -fPIC -fno-strict-aliasing -g -g -O2 -O2 -g -Wall -Wno-parentheses -fPIC -o enc/iso_8859_4.o -c enc/iso_8859_4.c
cc -shared -o .ext/i486-linux/enc/iso_8859_4.so enc/iso_8859_4.o -L. -L. -L. -Wl,-Bsymbolic-functions -rdynamic -Wl,-export-dynamic -lruby1.9 -lpthread -lrt -ldl -lcrypt -lm
cc -I. -I.ext/include/i486-linux -I./include -I. -D_FILE_OFFSET_BITS=64 -DONIG_ENC_REGISTER=rb_enc_register -fPIC -fno-strict-aliasing -g -g -O2 -O2 -g -Wall -Wno-parentheses -fPIC -o enc/iso_8859_5.o -c enc/iso_8859_5.c
cc -shared -o .ext/i486-linux/enc/iso_8859_5.so enc/iso_8859_5.o -L. -L. -L. -Wl,-Bsymbolic-functions -rdynamic -Wl,-export-dynamic -lruby1.9 -lpthread -lrt -ldl -lcrypt -lm
cc -I. -I.ext/include/i486-linux -I./include -I. -D_FILE_OFFSET_BITS=64 -DONIG_ENC_REGISTER=rb_enc_register -fPIC -fno-strict-aliasing -g -g -O2 -O2 -g -Wall -Wno-parentheses -fPIC -o enc/iso_8859_6.o -c enc/iso_8859_6.c
cc -shared -o .ext/i486-linux/enc/iso_8859_6.so enc/iso_8859_6.o -L. -L. -L. -Wl,-Bsymbolic-functions -rdynamic -Wl,-export-dynamic -lruby1.9 -lpthread -lrt -ldl -lcrypt -lm
cc -I. -I.ext/include/i486-linux -I./include -I. -D_FILE_OFFSET_BITS=64 -DONIG_ENC_REGISTER=rb_enc_register -fPIC -fno-strict-aliasing -g -g -O2 -O2 -g -Wall -Wno-parentheses -fPIC -o enc/iso_8859_7.o -c enc/iso_8859_7.c
cc -shared -o .ext/i486-linux/enc/iso_8859_7.so enc/iso_8859_7.o -L. -L. -L. -Wl,-Bsymbolic-functions -rdynamic -Wl,-export-dynamic -lruby1.9 -lpthread -lrt -ldl -lcrypt -lm
cc -I. -I.ext/include/i486-linux -I./include -I. -D_FILE_OFFSET_BITS=64 -DONIG_ENC_REGISTER=rb_enc_register -fPIC -fno-strict-aliasing -g -g -O2 -O2 -g -Wall -Wno-parentheses -fPIC -o enc/iso_8859_8.o -c enc/iso_8859_8.c
cc -shared -o .ext/i486-linux/enc/iso_8859_8.so enc/iso_8859_8.o -L. -L. -L. -Wl,-Bsymbolic-functions -rdynamic -Wl,-export-dynamic -lruby1.9 -lpthread -lrt -ldl -lcrypt -lm
cc -I. -I.ext/include/i486-linux -I./include -I. -D_FILE_OFFSET_BITS=64 -DONIG_ENC_REGISTER=rb_enc_register -fPIC -fno-strict-aliasing -g -g -O2 -O2 -g -Wall -Wno-parentheses -fPIC -o enc/iso_8859_9.o -c enc/iso_8859_9.c
cc -shared -o .ext/i486-linux/enc/iso_8859_9.so enc/iso_8859_9.o -L. -L. -L. -Wl,-Bsymbolic-functions -rdynamic -Wl,-export-dynamic -lruby1.9 -lpthread -lrt -ldl -lcrypt -lm
cc -I. -I.ext/include/i486-linux -I./include -I. -D_FILE_OFFSET_BITS=64 -DONIG_ENC_REGISTER=rb_enc_register -fPIC -fno-strict-aliasing -g -g -O2 -O2 -g -Wall -Wno-parentheses -fPIC -o enc/iso_8859_10.o -c enc/iso_8859_10.c
cc -shared -o .ext/i486-linux/enc/iso_8859_10.so enc/iso_8859_10.o -L. -L. -L. -Wl,-Bsymbolic-functions -rdynamic -Wl,-export-dynamic -lruby1.9 -lpthread -lrt -ldl -lcrypt -lm
cc -I. -I.ext/include/i486-linux -I./include -I. -D_FILE_OFFSET_BITS=64 -DONIG_ENC_REGISTER=rb_enc_register -fPIC -fno-strict-aliasing -g -g -O2 -O2 -g -Wall -Wno-parentheses -fPIC -o enc/iso_8859_11.o -c enc/iso_8859_11.c
cc -shared -o .ext/i486-linux/enc/iso_8859_11.so enc/iso_8859_11.o -L. -L. -L. -Wl,-Bsymbolic-functions -rdynamic -Wl,-export-dynamic -lruby1.9 -lpthread -lrt -ldl -lcrypt -lm
cc -I. -I.ext/include/i486-linux -I./include -I. -D_FILE_OFFSET_BITS=64 -DONIG_ENC_REGISTER=rb_enc_register -fPIC -fno-strict-aliasing -g -g -O2 -O2 -g -Wall -Wno-parentheses -fPIC -o enc/iso_8859_13.o -c enc/iso_8859_13.c
cc -shared -o .ext/i486-linux/enc/iso_8859_13.so enc/iso_8859_13.o -L. -L. -L. -Wl,-Bsymbolic-functions -rdynamic -Wl,-export-dynamic -lruby1.9 -lpthread -lrt -ldl -lcrypt -lm
cc -I. -I.ext/include/i486-linux -I./include -I. -D_FILE_OFFSET_BITS=64 -DONIG_ENC_REGISTER=rb_enc_register -fPIC -fno-strict-aliasing -g -g -O2 -O2 -g -Wall -Wno-parentheses -fPIC -o enc/iso_8859_14.o -c enc/iso_8859_14.c
cc -shared -o .ext/i486-linux/enc/iso_8859_14.so enc/iso_8859_14.o -L. -L. -L. -Wl,-Bsymbolic-functions -rdynamic -Wl,-export-dynamic -lruby1.9 -lpthread -lrt -ldl -lcrypt -lm
cc -I. -I.ext/include/i486-linux -I./include -I. -D_FILE_OFFSET_BITS=64 -DONIG_ENC_REGISTER=rb_enc_register -fPIC -fno-strict-aliasing -g -g -O2 -O2 -g -Wall -Wno-parentheses -fPIC -o enc/iso_8859_15.o -c enc/iso_8859_15.c
cc -shared -o .ext/i486-linux/enc/iso_8859_15.so enc/iso_8859_15.o -L. -L. -L. -Wl,-Bsymbolic-functions -rdynamic -Wl,-export-dynamic -lruby1.9 -lpthread -lrt -ldl -lcrypt -lm
cc -I. -I.ext/include/i486-linux -I./include -I. -D_FILE_OFFSET_BITS=64 -DONIG_ENC_REGISTER=rb_enc_register -fPIC -fno-strict-aliasing -g -g -O2 -O2 -g -Wall -Wno-parentheses -fPIC -o enc/iso_8859_16.o -c enc/iso_8859_16.c
cc -shared -o .ext/i486-linux/enc/iso_8859_16.so enc/iso_8859_16.o -L. -L. -L. -Wl,-Bsymbolic-functions -rdynamic -Wl,-export-dynamic -lruby1.9 -lpthread -lrt -ldl -lcrypt -lm
cc -I. -I.ext/include/i486-linux -I./include -I. -D_FILE_OFFSET_BITS=64 -DONIG_ENC_REGISTER=rb_enc_register -fPIC -fno-strict-aliasing -g -g -O2 -O2 -g -Wall -Wno-parentheses -fPIC -o enc/koi8_r.o -c enc/koi8_r.c
cc -shared -o .ext/i486-linux/enc/koi8_r.so enc/koi8_r.o -L. -L. -L. -Wl,-Bsymbolic-functions -rdynamic -Wl,-export-dynamic -lruby1.9 -lpthread -lrt -ldl -lcrypt -lm
cc -I. -I.ext/include/i486-linux -I./include -I. -D_FILE_OFFSET_BITS=64 -DONIG_ENC_REGISTER=rb_enc_register -fPIC -fno-strict-aliasing -g -g -O2 -O2 -g -Wall -Wno-parentheses -fPIC -o enc/koi8_u.o -c enc/koi8_u.c
cc -shared -o .ext/i486-linux/enc/koi8_u.so enc/koi8_u.o -L. -L. -L. -Wl,-Bsymbolic-functions -rdynamic -Wl,-export-dynamic -lruby1.9 -lpthread -lrt -ldl -lcrypt -lm
cc -I. -I.ext/include/i486-linux -I./include -I. -D_FILE_OFFSET_BITS=64 -DONIG_ENC_REGISTER=rb_enc_register -fPIC -fno-strict-aliasing -g -g -O2 -O2 -g -Wall -Wno-parentheses -fPIC -o enc/shift_jis.o -c enc/shift_jis.c
cc -shared -o .ext/i486-linux/enc/shift_jis.so enc/shift_jis.o -L. -L. -L. -Wl,-Bsymbolic-functions -rdynamic -Wl,-export-dynamic -lruby1.9 -lpthread -lrt -ldl -lcrypt -lm
cc -I. -I.ext/include/i486-linux -I./include -I. -D_FILE_OFFSET_BITS=64 -DONIG_ENC_REGISTER=rb_enc_register -fPIC -fno-strict-aliasing -g -g -O2 -O2 -g -Wall -Wno-parentheses -fPIC -o enc/utf_16be.o -c enc/utf_16be.c
cc -shared -o .ext/i486-linux/enc/utf_16be.so enc/utf_16be.o -L. -L. -L. -Wl,-Bsymbolic-functions -rdynamic -Wl,-export-dynamic -lruby1.9 -lpthread -lrt -ldl -lcrypt -lm
cc -I. -I.ext/include/i486-linux -I./include -I. -D_FILE_OFFSET_BITS=64 -DONIG_ENC_REGISTER=rb_enc_register -fPIC -fno-strict-aliasing -g -g -O2 -O2 -g -Wall -Wno-parentheses -fPIC -o enc/utf_16le.o -c enc/utf_16le.c
cc -shared -o .ext/i486-linux/enc/utf_16le.so enc/utf_16le.o -L. -L. -L. -Wl,-Bsymbolic-functions -rdynamic -Wl,-export-dynamic -lruby1.9 -lpthread -lrt -ldl -lcrypt -lm
cc -I. -I.ext/include/i486-linux -I./include -I. -D_FILE_OFFSET_BITS=64 -DONIG_ENC_REGISTER=rb_enc_register -fPIC -fno-strict-aliasing -g -g -O2 -O2 -g -Wall -Wno-parentheses -fPIC -o enc/utf_32be.o -c enc/utf_32be.c
cc -shared -o .ext/i486-linux/enc/utf_32be.so enc/utf_32be.o -L. -L. -L. -Wl,-Bsymbolic-functions -rdynamic -Wl,-export-dynamic -lruby1.9 -lpthread -lrt -ldl -lcrypt -lm
cc -I. -I.ext/include/i486-linux -I./include -I. -D_FILE_OFFSET_BITS=64 -DONIG_ENC_REGISTER=rb_enc_register -fPIC -fno-strict-aliasing -g -g -O2 -O2 -g -Wall -Wno-parentheses -fPIC -o enc/utf_32le.o -c enc/utf_32le.c
cc -shared -o .ext/i486-linux/enc/utf_32le.so enc/utf_32le.o -L. -L. -L. -Wl,-Bsymbolic-functions -rdynamic -Wl,-export-dynamic -lruby1.9 -lpthread -lrt -ldl -lcrypt -lm
cc -I. -I.ext/include/i486-linux -I./include -I. -D_FILE_OFFSET_BITS=64 -DONIG_ENC_REGISTER=rb_enc_register -fPIC -fno-strict-aliasing -g -g -O2 -O2 -g -Wall -Wno-parentheses -fPIC -o enc/windows_1251.o -c enc/windows_1251.c
cc -shared -o .ext/i486-linux/enc/windows_1251.so enc/windows_1251.o -L. -L. -L. -Wl,-Bsymbolic-functions -rdynamic -Wl,-export-dynamic -lruby1.9 -lpthread -lrt -ldl -lcrypt -lm
cc -I. -I.ext/include/i486-linux -I./include -I. -D_FILE_OFFSET_BITS=64 -DONIG_ENC_REGISTER=rb_enc_register -fPIC -fno-strict-aliasing -g -g -O2 -O2 -g -Wall -Wno-parentheses -fPIC -o enc/trans/japanese.o -c enc/trans/japanese.c
cc -shared -o .ext/i486-linux/enc/trans/japanese.so enc/trans/japanese.o -L. -L. -L. -Wl,-Bsymbolic-functions -rdynamic -Wl,-export-dynamic -lruby1.9 -lpthread -lrt -ldl -lcrypt -lm
cc -I. -I.ext/include/i486-linux -I./include -I. -D_FILE_OFFSET_BITS=64 -DONIG_ENC_REGISTER=rb_enc_register -fPIC -fno-strict-aliasing -g -g -O2 -O2 -g -Wall -Wno-parentheses -fPIC -o enc/trans/korean.o -c enc/trans/korean.c
cc -shared -o .ext/i486-linux/enc/trans/korean.so enc/trans/korean.o -L. -L. -L. -Wl,-Bsymbolic-functions -rdynamic -Wl,-export-dynamic -lruby1.9 -lpthread -lrt -ldl -lcrypt -lm
cc -I. -I.ext/include/i486-linux -I./include -I. -D_FILE_OFFSET_BITS=64 -DONIG_ENC_REGISTER=rb_enc_register -fPIC -fno-strict-aliasing -g -g -O2 -O2 -g -Wall -Wno-parentheses -fPIC -o enc/trans/single_byte.o -c enc/trans/single_byte.c
cc -shared -o .ext/i486-linux/enc/trans/single_byte.so enc/trans/single_byte.o -L. -L. -L. -Wl,-Bsymbolic-functions -rdynamic -Wl,-export-dynamic -lruby1.9 -lpthread -lrt -ldl -lcrypt -lm
cc -I. -I.ext/include/i486-linux -I./include -I. -D_FILE_OFFSET_BITS=64 -DONIG_ENC_REGISTER=rb_enc_register -fPIC -fno-strict-aliasing -g -g -O2 -O2 -g -Wall -Wno-parentheses -fPIC -o enc/trans/transdb.o -c enc/trans/transdb.c
cc -shared -o .ext/i486-linux/enc/trans/transdb.so enc/trans/transdb.o -L. -L. -L. -Wl,-Bsymbolic-functions -rdynamic -Wl,-export-dynamic -lruby1.9 -lpthread -lrt -ldl -lcrypt -lm
cc -I. -I.ext/include/i486-linux -I./include -I. -D_FILE_OFFSET_BITS=64 -DONIG_ENC_REGISTER=rb_enc_register -fPIC -fno-strict-aliasing -g -g -O2 -O2 -g -Wall -Wno-parentheses -fPIC -o enc/trans/utf_16_32.o -c enc/trans/utf_16_32.c
cc -shared -o .ext/i486-linux/enc/trans/utf_16_32.so enc/trans/utf_16_32.o -L. -L. -L. -Wl,-Bsymbolic-functions -rdynamic -Wl,-export-dynamic -lruby1.9 -lpthread -lrt -ldl -lcrypt -lm
make[2]: Leaving directory `/build/buildd/ruby1.9-1.9.0.2'
<dummy toplevel>:17: unexpected throw
make[1]: *** [all] Error 1
make[1]: Leaving directory `/build/buildd/ruby1.9-1.9.0.2'
make: *** [debian/stamp-makefile-build] Error 2
dpkg-buildpackage: failure: debian/rules build gave error exit status 2
******************************************************************************
Build finished at 20090706-0734
FAILED [dpkg-buildpackage died]
Purging chroot-karmic-autotest/build/buildd/ruby1.9-1.9.0.2
------------------------------------------------------------------------------
/usr/bin/sudo dpkg --root=/home/buildd/build-karmic-autotest/chroot-karmic-autotest --purge groff-base xtrans-dev libx11-data libxdmcp-dev x11proto-core-dev file zlib1g-dev libhtml-parser-perl intltool dpatch libxcb1-dev libxt6 libwww-perl liburi-perl libxdmcp6 x11-common libhtml-tree-perl bison po-debconf libxml-parser-perl libx11-dev libhtml-tagset-perl libxt-dev netbase libice-dev man-db libice6 x11proto-kb-dev intltool-debian libxcb1 x11proto-input-dev tk8.4 libgdbm-dev libpthread-stubs0-dev cdbs libxau-dev html2text debhelper libpthread-stubs0 tk8.4-dev libncurses5-dev libsm6 libmagic1 libreadline5-dev libexpat1 libssl-dev bsdmainutils libxau6 fdupes tcl8.4-dev libsm-dev libx11-6 tcl8.4
(Reading database ... 22434 files and directories currently installed.)
Removing dpatch ...
Purging configuration files for dpatch ...
Removing bison ...
Removing libgdbm-dev ...
Removing cdbs ...
Removing debhelper ...
Removing tk8.4-dev ...
Removing libreadline5-dev ...
Removing libssl-dev ...
Removing fdupes ...
Removing tcl8.4-dev ...
Removing zlib1g-dev ...
Removing intltool ...
Removing po-debconf ...
Removing libxml-parser-perl ...
Removing libxt-dev ...
Removing man-db ...
Purging configuration files for man-db ...
Removing catpages as well as /var/cache/man hierarchy.
dpkg - warning: while removing man-db, directory `/usr/share/doc/man-db/examples' not empty so not removed.
dpkg - warning: while removing man-db, directory `/usr/share/doc/man-db' not empty so not removed.
dpkg - warning: while removing man-db, directory `/usr/share/man/id/man5' not empty so not removed.
dpkg - warning: while removing man-db, directory `/usr/share/man-db' not empty so not removed.
dpkg - warning: while removing man-db, directory `/usr/share/bug/man-db' not empty so not removed.
dpkg - warning: while removing man-db, directory `/usr/lib/man-db' not empty so not removed.
Removing intltool-debian ...
Removing tk8.4 ...
Purging configuration files for tk8.4 ...
Removing html2text ...
Purging configuration files for html2text ...
Removing libncurses5-dev ...
Removing libexpat1 ...
Purging configuration files for libexpat1 ...
Removing bsdmainutils ...
Purging configuration files for bsdmainutils ...
Removing libsm-dev ...
Removing tcl8.4 ...
Purging configuration files for tcl8.4 ...
Removing groff-base ...
Purging configuration files for groff-base ...
Removing file ...
Purging configuration files for file ...
Removing libxt6 ...
Purging configuration files for libxt6 ...
Removing libwww-perl ...
Removing libhtml-tree-perl ...
Removing libx11-dev ...
Removing netbase ...
Purging configuration files for netbase ...
Removing libice-dev ...
Removing x11proto-kb-dev ...
Removing x11proto-input-dev ...
Removing libsm6 ...
Purging configuration files for libsm6 ...
Removing libmagic1 ...
Purging configuration files for libmagic1 ...
Removing libx11-6 ...
Purging configuration files for libx11-6 ...
Removing xtrans-dev ...
Removing libx11-data ...
Removing libhtml-parser-perl ...
Removing libxcb1-dev ...
Removing liburi-perl ...
Removing libhtml-tagset-perl ...
Removing libice6 ...
Purging configuration files for libice6 ...
Removing libxcb1 ...
Purging configuration files for libxcb1 ...
Removing libpthread-stubs0-dev ...
Removing libxau-dev ...
Removing libpthread-stubs0 ...
Removing libxau6 ...
Purging configuration files for libxau6 ...
Removing libxdmcp-dev ...
Removing x11proto-core-dev ...
Removing libxdmcp6 ...
Purging configuration files for libxdmcp6 ...
Removing x11-common ...
Purging configuration files for x11-common ...
dpkg - warning: while removing x11-common, directory `/usr/X11R6' not empty so not removed.
dpkg - warning: while removing x11-common, directory `/etc/X11' not empty so not removed.
Processing triggers for libc6 ...
ldconfig deferred processing now taking place
******************************************************************************
Finished at 20090706-0734
Build needed 00:02:17, 58668k disk space
More information about the ubuntu-autotest
mailing list