Log for failed build of linux-backports-modules-2.6.28_2.6.28-6.3 (dist=jaunty-autotest)
Build Daemon user
noreply at buildd.ubuntu.com
Wed Feb 4 21:25:07 GMT 2009
Automatic build of linux-backports-modules-2.6.28_2.6.28-6.3 on terranova by sbuild/i386 1.170.5
Build started at 20090204-2122
******************************************************************************
Checking available source versions...
Fetching source files...
Reading package lists...
Building dependency tree...
Reading state information...
Need to get 2390kB of source archives.
Get:1 http://archive.internal jaunty-autotest/main linux-backports-modules-2.6.28 2.6.28-6.3 (dsc) [1159B]
Get:2 http://archive.internal jaunty-autotest/main linux-backports-modules-2.6.28 2.6.28-6.3 (tar) [2389kB]
Fetched 2390kB in 0s (4761kB/s)
Download complete and in download only mode
** Using build dependencies supplied by package:
Build-Depends: debhelper (>= 3), module-init-tools, coreutils, git-core, kernel-wedge (>= 2.24ubuntu1), linux-headers-2.6.28-6-generic [i386 amd64], linux-headers-2.6.28-6-server [i386 amd64]
Checking for already installed source dependencies...
debhelper: missing
module-init-tools: missing
coreutils: already installed (6.10-6ubuntu1)
git-core: missing
kernel-wedge: missing
linux-headers-2.6.28-6-generic: missing
linux-headers-2.6.28-6-server: missing
Checking for source dependency conflicts...
/usr/bin/sudo /usr/bin/apt-get --purge $CHROOT_OPTIONS -q -y install debhelper module-init-tools git-core kernel-wedge linux-headers-2.6.28-6-generic linux-headers-2.6.28-6-server
Reading package lists...
Building dependency tree...
Reading state information...
The following packages were automatically installed and are no longer required:
dmsetup libdevmapper1.02.1 upstart-compat-sysv startup-tasks system-services
ucf sysvutils upstart perl-doc
Use 'apt-get autoremove' to remove them.
The following extra packages will be installed:
bsdmainutils ca-certificates file gettext gettext-base groff-base html2text
intltool-debian libcroco3 libcurl3-gnutls libdigest-sha1-perl liberror-perl
libexpat1 libgcrypt11 libglib2.0-0 libgnutls26 libgpg-error0 libidn11
libkeyutils1 libkrb53 libldap-2.4-2 libmagic1 libsasl2-2 libsasl2-modules
libssl0.9.8 libtasn1-3 libxml2 linux-headers-2.6.28-6 man-db openssl
po-debconf
Suggested packages:
wamerican wordlist whois vacation dh-make cvs gettext-doc git-doc git-arch
git-cvs git-svn git-email git-daemon-run git-gui gitk gitweb groff rng-tools
gnutls-bin krb5-doc krb5-user libsasl2-modules-otp libsasl2-modules-ldap
libsasl2-modules-sql libsasl2-modules-gssapi-mit
libsasl2-modules-gssapi-heimdal www-browser openssl-doc libmail-box-perl
Recommended packages:
curl wget lynx less rsync ssh-client libglib2.0-data xml-core
libmail-sendmail-perl libcompress-zlib-perl
The following NEW packages will be installed:
bsdmainutils ca-certificates debhelper file gettext gettext-base git-core
groff-base html2text intltool-debian kernel-wedge libcroco3 libcurl3-gnutls
libdigest-sha1-perl liberror-perl libexpat1 libgcrypt11 libglib2.0-0
libgnutls26 libgpg-error0 libidn11 libkeyutils1 libkrb53 libldap-2.4-2
libmagic1 libsasl2-2 libsasl2-modules libssl0.9.8 libtasn1-3 libxml2
linux-headers-2.6.28-6 linux-headers-2.6.28-6-generic
linux-headers-2.6.28-6-server man-db module-init-tools openssl po-debconf
0 upgraded, 37 newly installed, 0 to remove and 0 not upgraded.
Need to get 14.3MB/27.7MB of archives.
After unpacking 128MB of additional disk space will be used.
WARNING: The following packages cannot be authenticated!
libssl0.9.8 openssl ca-certificates libmagic1 file libgpg-error0 libgcrypt11
libtasn1-3 libgnutls26 libidn11 libkeyutils1 libkrb53 libsasl2-modules
libsasl2-2 libldap-2.4-2 libcurl3-gnutls module-init-tools bsdmainutils
gettext-base groff-base libexpat1 libxml2 man-db html2text libglib2.0-0
libcroco3 gettext intltool-debian po-debconf debhelper liberror-perl
libdigest-sha1-perl git-core kernel-wedge linux-headers-2.6.28-6
linux-headers-2.6.28-6-generic linux-headers-2.6.28-6-server
Authentication warning overridden.
Get:1 http://ftpmaster.internal jaunty/main liberror-perl 0.17-1 [23.8kB]
Get:2 http://archive.internal jaunty-autotest/main module-init-tools 3.3-pre11-4ubuntu19 [74.9kB]
Get:3 http://ftpmaster.internal jaunty/main libdigest-sha1-perl 2.11-2build2 [25.4kB]
Get:4 http://ftpmaster.internal jaunty/main git-core 1:1.6.0.4-1ubuntu1 [4315kB]
Get:5 http://ftpmaster.internal jaunty/main kernel-wedge 2.29ubuntu2 [40.0kB]
Get:6 http://ftpmaster.internal jaunty/main linux-headers-2.6.28-6 2.6.28-6.17 [8501kB]
Get:7 http://ftpmaster.internal jaunty/main linux-headers-2.6.28-6-generic 2.6.28-6.17 [651kB]
Get:8 http://ftpmaster.internal jaunty/main linux-headers-2.6.28-6-server 2.6.28-6.17 [652kB]
Fetched 14.3MB in 3s (4433kB/s)
Selecting previously deselected package libssl0.9.8.
(Reading database ... 10711 files and directories currently installed.)
Unpacking libssl0.9.8 (from .../libssl0.9.8_0.9.8g-15ubuntu1_i386.deb) ...
Selecting previously deselected package openssl.
Unpacking openssl (from .../openssl_0.9.8g-15ubuntu1_i386.deb) ...
Selecting previously deselected package ca-certificates.
Unpacking ca-certificates (from .../ca-certificates_20080809_all.deb) ...
Selecting previously deselected package libmagic1.
Unpacking libmagic1 (from .../libmagic1_4.26-2_i386.deb) ...
Selecting previously deselected package file.
Unpacking file (from .../archives/file_4.26-2_i386.deb) ...
Selecting previously deselected package libgpg-error0.
Unpacking libgpg-error0 (from .../libgpg-error0_1.4-2ubuntu7_i386.deb) ...
Selecting previously deselected package libgcrypt11.
Unpacking libgcrypt11 (from .../libgcrypt11_1.4.1-2ubuntu1_i386.deb) ...
Selecting previously deselected package libtasn1-3.
Unpacking libtasn1-3 (from .../libtasn1-3_1.5-1_i386.deb) ...
Selecting previously deselected package libgnutls26.
Unpacking libgnutls26 (from .../libgnutls26_2.4.2-4_i386.deb) ...
Selecting previously deselected package libidn11.
Unpacking libidn11 (from .../libidn11_1.10-3_i386.deb) ...
Selecting previously deselected package libkeyutils1.
Unpacking libkeyutils1 (from .../libkeyutils1_1.2-9_i386.deb) ...
Selecting previously deselected package libkrb53.
Unpacking libkrb53 (from .../libkrb53_1.6.dfsg.4~beta1-5_i386.deb) ...
Selecting previously deselected package libsasl2-modules.
Unpacking libsasl2-modules (from .../libsasl2-modules_2.1.22.dfsg1-23ubuntu2_i386.deb) ...
Selecting previously deselected package libsasl2-2.
Unpacking libsasl2-2 (from .../libsasl2-2_2.1.22.dfsg1-23ubuntu2_i386.deb) ...
Selecting previously deselected package libldap-2.4-2.
Unpacking libldap-2.4-2 (from .../libldap-2.4-2_2.4.11-0ubuntu7_i386.deb) ...
Selecting previously deselected package libcurl3-gnutls.
Unpacking libcurl3-gnutls (from .../libcurl3-gnutls_7.18.2-8ubuntu1_i386.deb) ...
Selecting previously deselected package module-init-tools.
Unpacking module-init-tools (from .../module-init-tools_3.3-pre11-4ubuntu19_i386.deb) ...
Selecting previously deselected package bsdmainutils.
Unpacking bsdmainutils (from .../bsdmainutils_6.1.10ubuntu3_i386.deb) ...
Selecting previously deselected package gettext-base.
Unpacking gettext-base (from .../gettext-base_0.17-6ubuntu1_i386.deb) ...
Selecting previously deselected package groff-base.
Unpacking groff-base (from .../groff-base_1.18.1.1-21_i386.deb) ...
Selecting previously deselected package libexpat1.
Unpacking libexpat1 (from .../libexpat1_2.0.1-4_i386.deb) ...
Selecting previously deselected package libxml2.
Unpacking libxml2 (from .../libxml2_2.6.32.dfsg-5ubuntu1_i386.deb) ...
Selecting previously deselected package man-db.
Unpacking man-db (from .../man-db_2.5.3-3_i386.deb) ...
Selecting previously deselected package html2text.
Unpacking html2text (from .../html2text_1.3.2a-5_i386.deb) ...
Selecting previously deselected package libglib2.0-0.
Unpacking libglib2.0-0 (from .../libglib2.0-0_2.19.6-0ubuntu1_i386.deb) ...
Selecting previously deselected package libcroco3.
Unpacking libcroco3 (from .../libcroco3_0.6.1-2_i386.deb) ...
Selecting previously deselected package gettext.
Unpacking gettext (from .../gettext_0.17-6ubuntu1_i386.deb) ...
Selecting previously deselected package intltool-debian.
Unpacking intltool-debian (from .../intltool-debian_0.35.0+20060710.1_all.deb) ...
Selecting previously deselected package po-debconf.
Unpacking po-debconf (from .../po-debconf_1.0.15ubuntu1_all.deb) ...
Selecting previously deselected package debhelper.
Unpacking debhelper (from .../debhelper_7.0.17ubuntu2_all.deb) ...
Selecting previously deselected package liberror-perl.
Unpacking liberror-perl (from .../liberror-perl_0.17-1_all.deb) ...
Selecting previously deselected package libdigest-sha1-perl.
Unpacking libdigest-sha1-perl (from .../libdigest-sha1-perl_2.11-2build2_i386.deb) ...
Selecting previously deselected package git-core.
Unpacking git-core (from .../git-core_1%3a1.6.0.4-1ubuntu1_i386.deb) ...
Selecting previously deselected package kernel-wedge.
Unpacking kernel-wedge (from .../kernel-wedge_2.29ubuntu2_all.deb) ...
Selecting previously deselected package linux-headers-2.6.28-6.
Unpacking linux-headers-2.6.28-6 (from .../linux-headers-2.6.28-6_2.6.28-6.17_all.deb) ...
Selecting previously deselected package linux-headers-2.6.28-6-generic.
Unpacking linux-headers-2.6.28-6-generic (from .../linux-headers-2.6.28-6-generic_2.6.28-6.17_i386.deb) ...
Selecting previously deselected package linux-headers-2.6.28-6-server.
Unpacking linux-headers-2.6.28-6-server (from .../linux-headers-2.6.28-6-server_2.6.28-6.17_i386.deb) ...
Setting up libssl0.9.8 (0.9.8g-15ubuntu1) ...
Setting up openssl (0.9.8g-15ubuntu1) ...
Setting up ca-certificates (20080809) ...
Updating certificates in /etc/ssl/certs....done.
Running hooks in /etc/ca-certificates/update.d....done.
Setting up libmagic1 (4.26-2) ...
Setting up file (4.26-2) ...
Setting up libgpg-error0 (1.4-2ubuntu7) ...
Setting up libgcrypt11 (1.4.1-2ubuntu1) ...
Setting up libtasn1-3 (1.5-1) ...
Setting up libgnutls26 (2.4.2-4) ...
Setting up libidn11 (1.10-3) ...
Setting up libkeyutils1 (1.2-9) ...
Setting up libkrb53 (1.6.dfsg.4~beta1-5) ...
Setting up module-init-tools (3.3-pre11-4ubuntu19) ...
Setting up bsdmainutils (6.1.10ubuntu3) ...
Setting up gettext-base (0.17-6ubuntu1) ...
Setting up groff-base (1.18.1.1-21) ...
Setting up libexpat1 (2.0.1-4) ...
Setting up libxml2 (2.6.32.dfsg-5ubuntu1) ...
Setting up man-db (2.5.3-3) ...
Building database of manual pages ...
... skipping, since this is a buildd
Setting up html2text (1.3.2a-5) ...
Setting up libglib2.0-0 (2.19.6-0ubuntu1) ...
Setting up libcroco3 (0.6.1-2) ...
Setting up gettext (0.17-6ubuntu1) ...
Setting up intltool-debian (0.35.0+20060710.1) ...
Setting up po-debconf (1.0.15ubuntu1) ...
Setting up debhelper (7.0.17ubuntu2) ...
Setting up liberror-perl (0.17-1) ...
Setting up libdigest-sha1-perl (2.11-2build2) ...
Setting up kernel-wedge (2.29ubuntu2) ...
Setting up linux-headers-2.6.28-6 (2.6.28-6.17) ...
Setting up linux-headers-2.6.28-6-generic (2.6.28-6.17) ...
Setting up linux-headers-2.6.28-6-server (2.6.28-6.17) ...
Setting up libsasl2-modules (2.1.22.dfsg1-23ubuntu2) ...
Setting up libsasl2-2 (2.1.22.dfsg1-23ubuntu2) ...
Setting up libldap-2.4-2 (2.4.11-0ubuntu7) ...
Setting up libcurl3-gnutls (7.18.2-8ubuntu1) ...
Setting up git-core (1.6.0.4-1ubuntu1) ...
Checking correctness of source dependencies...
Toolchain package versions: libc6-dev_2.9-0ubuntu9 make_3.81-5 dpkg-dev_1.14.24ubuntu1 linux-libc-dev_2.6.28-6.17 g++-4.3_4.3.3-3ubuntu1 gcc-4.3_4.3.3-3ubuntu1 binutils_2.19.0.20090110-0ubuntu1 libstdc++6_4.3.3-3ubuntu1 libstdc++6-4.3-dev_4.3.3-3ubuntu1
------------------------------------------------------------------------------
dpkg-source: extracting linux-backports-modules-2.6.28 in linux-backports-modules-2.6.28-2.6.28
dpkg-source: unpacking linux-backports-modules-2.6.28_2.6.28-6.3.tar.gz
dpkg-buildpackage: set CFLAGS to default value: -g -O2
dpkg-buildpackage: set CPPFLAGS to default value:
dpkg-buildpackage: set LDFLAGS to default value: -Wl,-Bsymbolic-functions
dpkg-buildpackage: set FFLAGS to default value: -g -O2
dpkg-buildpackage: set CXXFLAGS to default value: -g -O2
dpkg-buildpackage: source package linux-backports-modules-2.6.28
dpkg-buildpackage: source version 2.6.28-6.3
dpkg-buildpackage: host architecture i386
/usr/bin/fakeroot debian/rules clean
dh_testdir
dh_testroot
dh_clean
rm -rf /build/buildd/linux-backports-modules-2.6.28-2.6.28/debian/d-i-i386
rm -rf /build/buildd/linux-backports-modules-2.6.28-2.6.28/debian/build
rm -rf debian/linux-backports-modules*
rm -rf debian/linux-headers*
rm -f /build/buildd/linux-backports-modules-2.6.28-2.6.28/debian/stamps/stamp-*
# This gets rid of the d-i packages in control
cp -f debian/control.stub debian/control
debian/rules build
Preparing generic...
install -d /build/buildd/linux-backports-modules-2.6.28-2.6.28/debian/build/build-generic
cd updates; tar cf - * | tar -C /build/buildd/linux-backports-modules-2.6.28-2.6.28/debian/build/build-generic -xf -
mv /build/buildd/linux-backports-modules-2.6.28-2.6.28/debian/build/build-generic/MUNGE-CW /build/buildd/linux-backports-modules-2.6.28-2.6.28/debian/build/build-generic/compat-wireless-2.6
cd /build/buildd/linux-backports-modules-2.6.28-2.6.28/debian/build/build-generic/compat-wireless-2.6 && ./MUNGE-CW
cat /build/buildd/linux-backports-modules-2.6.28-2.6.28/debian/config/i386 > /build/buildd/linux-backports-modules-2.6.28-2.6.28/debian/build/build-generic/.config
# XXX: generate real config
touch /build/buildd/linux-backports-modules-2.6.28-2.6.28/debian/build/build-generic/ubuntu-config.h
touch /build/buildd/linux-backports-modules-2.6.28-2.6.28/debian/build/build-generic/ubuntu-build
touch /build/buildd/linux-backports-modules-2.6.28-2.6.28/debian/stamps/stamp-prepare-generic
Building generic...
cd /build/buildd/linux-backports-modules-2.6.28-2.6.28/debian/build/build-generic/compat-wireless-2.6 && make -j2 KLIB=/lib/modules/2.6.28-6-generic MADWIFI=
make[1]: Entering directory `/build/buildd/linux-backports-modules-2.6.28-2.6.28/debian/build/build-generic/compat-wireless-2.6'
FATAL: Could not load /lib/modules/2.6.15.7/modules.dep: No such file or directory
./scripts/gen-compat-autoconf.sh config.mk > include/linux/compat_autoconf.h
make[2]: warning: jobserver unavailable: using -j1. Add `+' to parent make rule.
FATAL: Could not load /lib/modules/2.6.15.7/modules.dep: No such file or directory
make -C /lib/modules/2.6.28-6-generic/build M=/build/buildd/linux-backports-modules-2.6.28-2.6.28/debian/build/build-generic/compat-wireless-2.6 modules
make[2]: Entering directory `/usr/src/linux-headers-2.6.28-6-generic'
FATAL: Could not load /lib/modules/2.6.15.7/modules.dep: No such file or directory
LD /build/buildd/linux-backports-modules-2.6.28-2.6.28/debian/build/build-generic/compat-wireless-2.6/drivers/misc/built-in.o
CC [M] /build/buildd/linux-backports-modules-2.6.28-2.6.28/debian/build/build-generic/compat-wireless-2.6/drivers/misc/eeprom_93cx6.o
FATAL: Could not load /lib/modules/2.6.15.7/modules.dep: No such file or directory
LD /build/buildd/linux-backports-modules-2.6.28-2.6.28/debian/build/build-generic/compat-wireless-2.6/drivers/net/usb/built-in.o
CC [M] /build/buildd/linux-backports-modules-2.6.28-2.6.28/debian/build/build-generic/compat-wireless-2.6/drivers/net/usb/cdc_ether.o
CC [M] /build/buildd/linux-backports-modules-2.6.28-2.6.28/debian/build/build-generic/compat-wireless-2.6/drivers/net/usb/rndis_host.o
FATAL: Could not load /lib/modules/2.6.15.7/modules.dep: No such file or directory
LD /build/buildd/linux-backports-modules-2.6.28-2.6.28/debian/build/build-generic/compat-wireless-2.6/drivers/net/wireless/built-in.o
CC [M] /build/buildd/linux-backports-modules-2.6.28-2.6.28/debian/build/build-generic/compat-wireless-2.6/drivers/net/wireless/rndis_wlan.o
CC [M] /build/buildd/linux-backports-modules-2.6.28-2.6.28/debian/build/build-generic/compat-wireless-2.6/drivers/net/usb/usbnet.o
CC [M] /build/buildd/linux-backports-modules-2.6.28-2.6.28/debian/build/build-generic/compat-wireless-2.6/drivers/net/wireless/adm8211.o
CC [M] /build/buildd/linux-backports-modules-2.6.28-2.6.28/debian/build/build-generic/compat-wireless-2.6/drivers/net/wireless/mac80211_hwsim.o
FATAL: Could not load /lib/modules/2.6.15.7/modules.dep: No such file or directory
LD /build/buildd/linux-backports-modules-2.6.28-2.6.28/debian/build/build-generic/compat-wireless-2.6/drivers/ssb/built-in.o
CC [M] /build/buildd/linux-backports-modules-2.6.28-2.6.28/debian/build/build-generic/compat-wireless-2.6/drivers/ssb/main.o
LD /build/buildd/linux-backports-modules-2.6.28-2.6.28/debian/build/build-generic/compat-wireless-2.6/drivers/net/wireless/ath5k/built-in.o
CC [M] /build/buildd/linux-backports-modules-2.6.28-2.6.28/debian/build/build-generic/compat-wireless-2.6/drivers/net/wireless/ath5k/caps.o
CC [M] /build/buildd/linux-backports-modules-2.6.28-2.6.28/debian/build/build-generic/compat-wireless-2.6/drivers/ssb/scan.o
CC [M] /build/buildd/linux-backports-modules-2.6.28-2.6.28/debian/build/build-generic/compat-wireless-2.6/drivers/net/wireless/ath5k/initvals.o
CC [M] /build/buildd/linux-backports-modules-2.6.28-2.6.28/debian/build/build-generic/compat-wireless-2.6/drivers/ssb/sprom.o
CC [M] /build/buildd/linux-backports-modules-2.6.28-2.6.28/debian/build/build-generic/compat-wireless-2.6/drivers/net/wireless/ath5k/eeprom.o
CC [M] /build/buildd/linux-backports-modules-2.6.28-2.6.28/debian/build/build-generic/compat-wireless-2.6/drivers/ssb/pci.o
CC [M] /build/buildd/linux-backports-modules-2.6.28-2.6.28/debian/build/build-generic/compat-wireless-2.6/drivers/ssb/pcihost_wrapper.o
CC [M] /build/buildd/linux-backports-modules-2.6.28-2.6.28/debian/build/build-generic/compat-wireless-2.6/drivers/ssb/pcmcia.o
CC [M] /build/buildd/linux-backports-modules-2.6.28-2.6.28/debian/build/build-generic/compat-wireless-2.6/drivers/net/wireless/ath5k/gpio.o
CC [M] /build/buildd/linux-backports-modules-2.6.28-2.6.28/debian/build/build-generic/compat-wireless-2.6/drivers/net/wireless/ath5k/desc.o
CC [M] /build/buildd/linux-backports-modules-2.6.28-2.6.28/debian/build/build-generic/compat-wireless-2.6/drivers/ssb/driver_chipcommon.o
CC [M] /build/buildd/linux-backports-modules-2.6.28-2.6.28/debian/build/build-generic/compat-wireless-2.6/drivers/net/wireless/ath5k/dma.o
CC [M] /build/buildd/linux-backports-modules-2.6.28-2.6.28/debian/build/build-generic/compat-wireless-2.6/drivers/ssb/driver_pcicore.o
CC [M] /build/buildd/linux-backports-modules-2.6.28-2.6.28/debian/build/build-generic/compat-wireless-2.6/drivers/ssb/b43_pci_bridge.o
CC [M] /build/buildd/linux-backports-modules-2.6.28-2.6.28/debian/build/build-generic/compat-wireless-2.6/drivers/net/wireless/ath5k/qcu.o
LD [M] /build/buildd/linux-backports-modules-2.6.28-2.6.28/debian/build/build-generic/compat-wireless-2.6/drivers/ssb/ssb.o
CC [M] /build/buildd/linux-backports-modules-2.6.28-2.6.28/debian/build/build-generic/compat-wireless-2.6/drivers/net/wireless/ath5k/pcu.o
FATAL: Could not load /lib/modules/2.6.15.7/modules.dep: No such file or directory
LD /build/buildd/linux-backports-modules-2.6.28-2.6.28/debian/build/build-generic/compat-wireless-2.6/net/mac80211/built-in.o
CC [M] /build/buildd/linux-backports-modules-2.6.28-2.6.28/debian/build/build-generic/compat-wireless-2.6/net/mac80211/main.o
CC [M] /build/buildd/linux-backports-modules-2.6.28-2.6.28/debian/build/build-generic/compat-wireless-2.6/drivers/net/wireless/ath5k/phy.o
CC [M] /build/buildd/linux-backports-modules-2.6.28-2.6.28/debian/build/build-generic/compat-wireless-2.6/net/mac80211/wext.o
CC [M] /build/buildd/linux-backports-modules-2.6.28-2.6.28/debian/build/build-generic/compat-wireless-2.6/drivers/net/wireless/ath5k/reset.o
CC [M] /build/buildd/linux-backports-modules-2.6.28-2.6.28/debian/build/build-generic/compat-wireless-2.6/net/mac80211/sta_info.o
CC [M] /build/buildd/linux-backports-modules-2.6.28-2.6.28/debian/build/build-generic/compat-wireless-2.6/drivers/net/wireless/ath5k/attach.o
CC [M] /build/buildd/linux-backports-modules-2.6.28-2.6.28/debian/build/build-generic/compat-wireless-2.6/drivers/net/wireless/ath5k/base.o
CC [M] /build/buildd/linux-backports-modules-2.6.28-2.6.28/debian/build/build-generic/compat-wireless-2.6/net/mac80211/wep.o
CC [M] /build/buildd/linux-backports-modules-2.6.28-2.6.28/debian/build/build-generic/compat-wireless-2.6/net/mac80211/wpa.o
LD [M] /build/buildd/linux-backports-modules-2.6.28-2.6.28/debian/build/build-generic/compat-wireless-2.6/drivers/net/wireless/ath5k/ath5k.o
LD /build/buildd/linux-backports-modules-2.6.28-2.6.28/debian/build/build-generic/compat-wireless-2.6/drivers/net/wireless/ath9k/built-in.o
CC [M] /build/buildd/linux-backports-modules-2.6.28-2.6.28/debian/build/build-generic/compat-wireless-2.6/drivers/net/wireless/ath9k/hw.o
CC [M] /build/buildd/linux-backports-modules-2.6.28-2.6.28/debian/build/build-generic/compat-wireless-2.6/net/mac80211/scan.o
CC [M] /build/buildd/linux-backports-modules-2.6.28-2.6.28/debian/build/build-generic/compat-wireless-2.6/net/mac80211/ht.o
CC [M] /build/buildd/linux-backports-modules-2.6.28-2.6.28/debian/build/build-generic/compat-wireless-2.6/drivers/net/wireless/ath9k/eeprom.o
CC [M] /build/buildd/linux-backports-modules-2.6.28-2.6.28/debian/build/build-generic/compat-wireless-2.6/net/mac80211/mlme.o
CC [M] /build/buildd/linux-backports-modules-2.6.28-2.6.28/debian/build/build-generic/compat-wireless-2.6/net/mac80211/iface.o
CC [M] /build/buildd/linux-backports-modules-2.6.28-2.6.28/debian/build/build-generic/compat-wireless-2.6/drivers/net/wireless/ath9k/mac.o
CC [M] /build/buildd/linux-backports-modules-2.6.28-2.6.28/debian/build/build-generic/compat-wireless-2.6/net/mac80211/rate.o
CC [M] /build/buildd/linux-backports-modules-2.6.28-2.6.28/debian/build/build-generic/compat-wireless-2.6/drivers/net/wireless/ath9k/calib.o
CC [M] /build/buildd/linux-backports-modules-2.6.28-2.6.28/debian/build/build-generic/compat-wireless-2.6/net/mac80211/michael.o
CC [M] /build/buildd/linux-backports-modules-2.6.28-2.6.28/debian/build/build-generic/compat-wireless-2.6/net/mac80211/tkip.o
CC [M] /build/buildd/linux-backports-modules-2.6.28-2.6.28/debian/build/build-generic/compat-wireless-2.6/drivers/net/wireless/ath9k/ani.o
CC [M] /build/buildd/linux-backports-modules-2.6.28-2.6.28/debian/build/build-generic/compat-wireless-2.6/net/mac80211/aes_ccm.o
CC [M] /build/buildd/linux-backports-modules-2.6.28-2.6.28/debian/build/build-generic/compat-wireless-2.6/drivers/net/wireless/ath9k/phy.o
CC [M] /build/buildd/linux-backports-modules-2.6.28-2.6.28/debian/build/build-generic/compat-wireless-2.6/net/mac80211/aes_cmac.o
CC [M] /build/buildd/linux-backports-modules-2.6.28-2.6.28/debian/build/build-generic/compat-wireless-2.6/drivers/net/wireless/ath9k/regd.o
CC [M] /build/buildd/linux-backports-modules-2.6.28-2.6.28/debian/build/build-generic/compat-wireless-2.6/net/mac80211/cfg.o
CC [M] /build/buildd/linux-backports-modules-2.6.28-2.6.28/debian/build/build-generic/compat-wireless-2.6/drivers/net/wireless/ath9k/beacon.o
CC [M] /build/buildd/linux-backports-modules-2.6.28-2.6.28/debian/build/build-generic/compat-wireless-2.6/net/mac80211/rx.o
CC [M] /build/buildd/linux-backports-modules-2.6.28-2.6.28/debian/build/build-generic/compat-wireless-2.6/drivers/net/wireless/ath9k/main.o
CC [M] /build/buildd/linux-backports-modules-2.6.28-2.6.28/debian/build/build-generic/compat-wireless-2.6/drivers/net/wireless/ath9k/recv.o
CC [M] /build/buildd/linux-backports-modules-2.6.28-2.6.28/debian/build/build-generic/compat-wireless-2.6/net/mac80211/spectmgmt.o
CC [M] /build/buildd/linux-backports-modules-2.6.28-2.6.28/debian/build/build-generic/compat-wireless-2.6/net/mac80211/tx.o
CC [M] /build/buildd/linux-backports-modules-2.6.28-2.6.28/debian/build/build-generic/compat-wireless-2.6/drivers/net/wireless/ath9k/xmit.o
CC [M] /build/buildd/linux-backports-modules-2.6.28-2.6.28/debian/build/build-generic/compat-wireless-2.6/drivers/net/wireless/ath9k/rc.o
CC [M] /build/buildd/linux-backports-modules-2.6.28-2.6.28/debian/build/build-generic/compat-wireless-2.6/net/mac80211/key.o
CC [M] /build/buildd/linux-backports-modules-2.6.28-2.6.28/debian/build/build-generic/compat-wireless-2.6/net/mac80211/util.o
LD [M] /build/buildd/linux-backports-modules-2.6.28-2.6.28/debian/build/build-generic/compat-wireless-2.6/drivers/net/wireless/ath9k/ath9k.o
LD /build/buildd/linux-backports-modules-2.6.28-2.6.28/debian/build/build-generic/compat-wireless-2.6/drivers/net/wireless/b43/built-in.o
CC [M] /build/buildd/linux-backports-modules-2.6.28-2.6.28/debian/build/build-generic/compat-wireless-2.6/drivers/net/wireless/b43/main.o
/build/buildd/linux-backports-modules-2.6.28-2.6.28/debian/build/build-generic/compat-wireless-2.6/drivers/net/wireless/b43/main.c: In function 'b43_print_fw_helptext':
/build/buildd/linux-backports-modules-2.6.28-2.6.28/debian/build/build-generic/compat-wireless-2.6/drivers/net/wireless/b43/main.c:1961: warning: format not a string literal and no format arguments
/build/buildd/linux-backports-modules-2.6.28-2.6.28/debian/build/build-generic/compat-wireless-2.6/drivers/net/wireless/b43/main.c:1963: warning: format not a string literal and no format arguments
CC [M] /build/buildd/linux-backports-modules-2.6.28-2.6.28/debian/build/build-generic/compat-wireless-2.6/net/mac80211/wme.o
CC [M] /build/buildd/linux-backports-modules-2.6.28-2.6.28/debian/build/build-generic/compat-wireless-2.6/net/mac80211/event.o
CC [M] /build/buildd/linux-backports-modules-2.6.28-2.6.28/debian/build/build-generic/compat-wireless-2.6/net/mac80211/led.o
CC [M] /build/buildd/linux-backports-modules-2.6.28-2.6.28/debian/build/build-generic/compat-wireless-2.6/drivers/net/wireless/b43/tables.o
CC [M] /build/buildd/linux-backports-modules-2.6.28-2.6.28/debian/build/build-generic/compat-wireless-2.6/drivers/net/wireless/b43/phy_common.o
CC [M] /build/buildd/linux-backports-modules-2.6.28-2.6.28/debian/build/build-generic/compat-wireless-2.6/net/mac80211/debugfs.o
CC [M] /build/buildd/linux-backports-modules-2.6.28-2.6.28/debian/build/build-generic/compat-wireless-2.6/drivers/net/wireless/b43/phy_g.o
CC [M] /build/buildd/linux-backports-modules-2.6.28-2.6.28/debian/build/build-generic/compat-wireless-2.6/net/mac80211/debugfs_sta.o
/build/buildd/linux-backports-modules-2.6.28-2.6.28/debian/build/build-generic/compat-wireless-2.6/drivers/net/wireless/b43/phy_g.c: In function 'b43_gphy_op_recalc_txpower':
/build/buildd/linux-backports-modules-2.6.28-2.6.28/debian/build/build-generic/compat-wireless-2.6/drivers/net/wireless/b43/phy_g.c:3195: warning: unused variable 'dbm'
CC [M] /build/buildd/linux-backports-modules-2.6.28-2.6.28/debian/build/build-generic/compat-wireless-2.6/net/mac80211/debugfs_netdev.o
CC [M] /build/buildd/linux-backports-modules-2.6.28-2.6.28/debian/build/build-generic/compat-wireless-2.6/net/mac80211/debugfs_key.o
CC [M] /build/buildd/linux-backports-modules-2.6.28-2.6.28/debian/build/build-generic/compat-wireless-2.6/drivers/net/wireless/b43/phy_a.o
CC [M] /build/buildd/linux-backports-modules-2.6.28-2.6.28/debian/build/build-generic/compat-wireless-2.6/net/mac80211/mesh.o
CC [M] /build/buildd/linux-backports-modules-2.6.28-2.6.28/debian/build/build-generic/compat-wireless-2.6/drivers/net/wireless/b43/sysfs.o
CC [M] /build/buildd/linux-backports-modules-2.6.28-2.6.28/debian/build/build-generic/compat-wireless-2.6/net/mac80211/mesh_pathtbl.o
CC [M] /build/buildd/linux-backports-modules-2.6.28-2.6.28/debian/build/build-generic/compat-wireless-2.6/drivers/net/wireless/b43/xmit.o
CC [M] /build/buildd/linux-backports-modules-2.6.28-2.6.28/debian/build/build-generic/compat-wireless-2.6/net/mac80211/mesh_plink.o
CC [M] /build/buildd/linux-backports-modules-2.6.28-2.6.28/debian/build/build-generic/compat-wireless-2.6/drivers/net/wireless/b43/lo.o
CC [M] /build/buildd/linux-backports-modules-2.6.28-2.6.28/debian/build/build-generic/compat-wireless-2.6/net/mac80211/mesh_hwmp.o
CC [M] /build/buildd/linux-backports-modules-2.6.28-2.6.28/debian/build/build-generic/compat-wireless-2.6/drivers/net/wireless/b43/wa.o
CC [M] /build/buildd/linux-backports-modules-2.6.28-2.6.28/debian/build/build-generic/compat-wireless-2.6/net/mac80211/rc80211_pid_algo.o
CC [M] /build/buildd/linux-backports-modules-2.6.28-2.6.28/debian/build/build-generic/compat-wireless-2.6/drivers/net/wireless/b43/dma.o
CC [M] /build/buildd/linux-backports-modules-2.6.28-2.6.28/debian/build/build-generic/compat-wireless-2.6/net/mac80211/rc80211_pid_debugfs.o
CC [M] /build/buildd/linux-backports-modules-2.6.28-2.6.28/debian/build/build-generic/compat-wireless-2.6/net/mac80211/rc80211_minstrel.o
CC [M] /build/buildd/linux-backports-modules-2.6.28-2.6.28/debian/build/build-generic/compat-wireless-2.6/drivers/net/wireless/b43/pio.o
CC [M] /build/buildd/linux-backports-modules-2.6.28-2.6.28/debian/build/build-generic/compat-wireless-2.6/net/mac80211/rc80211_minstrel_debugfs.o
CC [M] /build/buildd/linux-backports-modules-2.6.28-2.6.28/debian/build/build-generic/compat-wireless-2.6/drivers/net/wireless/b43/rfkill.o
make[4]: execvp: /bin/sh: Argument list too long
make[4]: *** [/build/buildd/linux-backports-modules-2.6.28-2.6.28/debian/build/build-generic/compat-wireless-2.6/net/mac80211/lbm_cw-mac80211.o] Error 127
make[3]: *** [/build/buildd/linux-backports-modules-2.6.28-2.6.28/debian/build/build-generic/compat-wireless-2.6/net/mac80211] Error 2
make[3]: *** Waiting for unfinished jobs....
CC [M] /build/buildd/linux-backports-modules-2.6.28-2.6.28/debian/build/build-generic/compat-wireless-2.6/drivers/net/wireless/b43/leds.o
CC [M] /build/buildd/linux-backports-modules-2.6.28-2.6.28/debian/build/build-generic/compat-wireless-2.6/drivers/net/wireless/b43/pcmcia.o
LD [M] /build/buildd/linux-backports-modules-2.6.28-2.6.28/debian/build/build-generic/compat-wireless-2.6/drivers/net/wireless/b43/b43.o
LD /build/buildd/linux-backports-modules-2.6.28-2.6.28/debian/build/build-generic/compat-wireless-2.6/drivers/net/wireless/b43legacy/built-in.o
CC [M] /build/buildd/linux-backports-modules-2.6.28-2.6.28/debian/build/build-generic/compat-wireless-2.6/drivers/net/wireless/b43legacy/main.o
LD /build/buildd/linux-backports-modules-2.6.28-2.6.28/debian/build/build-generic/compat-wireless-2.6/drivers/net/wireless/ipw2x00/built-in.o
CC [M] /build/buildd/linux-backports-modules-2.6.28-2.6.28/debian/build/build-generic/compat-wireless-2.6/drivers/net/wireless/ipw2x00/ipw2100.o
CC [M] /build/buildd/linux-backports-modules-2.6.28-2.6.28/debian/build/build-generic/compat-wireless-2.6/drivers/net/wireless/b43legacy/ilt.o
CC [M] /build/buildd/linux-backports-modules-2.6.28-2.6.28/debian/build/build-generic/compat-wireless-2.6/drivers/net/wireless/b43legacy/phy.o
CC [M] /build/buildd/linux-backports-modules-2.6.28-2.6.28/debian/build/build-generic/compat-wireless-2.6/drivers/net/wireless/ipw2x00/ipw2200.o
CC [M] /build/buildd/linux-backports-modules-2.6.28-2.6.28/debian/build/build-generic/compat-wireless-2.6/drivers/net/wireless/b43legacy/radio.o
CC [M] /build/buildd/linux-backports-modules-2.6.28-2.6.28/debian/build/build-generic/compat-wireless-2.6/drivers/net/wireless/b43legacy/sysfs.o
CC [M] /build/buildd/linux-backports-modules-2.6.28-2.6.28/debian/build/build-generic/compat-wireless-2.6/drivers/net/wireless/b43legacy/xmit.o
CC [M] /build/buildd/linux-backports-modules-2.6.28-2.6.28/debian/build/build-generic/compat-wireless-2.6/drivers/net/wireless/b43legacy/rfkill.o
CC [M] /build/buildd/linux-backports-modules-2.6.28-2.6.28/debian/build/build-generic/compat-wireless-2.6/drivers/net/wireless/b43legacy/leds.o
CC [M] /build/buildd/linux-backports-modules-2.6.28-2.6.28/debian/build/build-generic/compat-wireless-2.6/drivers/net/wireless/b43legacy/debugfs.o
CC [M] /build/buildd/linux-backports-modules-2.6.28-2.6.28/debian/build/build-generic/compat-wireless-2.6/drivers/net/wireless/b43legacy/dma.o
CC [M] /build/buildd/linux-backports-modules-2.6.28-2.6.28/debian/build/build-generic/compat-wireless-2.6/drivers/net/wireless/ipw2x00/libipw_module.o
CC [M] /build/buildd/linux-backports-modules-2.6.28-2.6.28/debian/build/build-generic/compat-wireless-2.6/drivers/net/wireless/ipw2x00/libipw_tx.o
CC [M] /build/buildd/linux-backports-modules-2.6.28-2.6.28/debian/build/build-generic/compat-wireless-2.6/drivers/net/wireless/b43legacy/pio.o
CC [M] /build/buildd/linux-backports-modules-2.6.28-2.6.28/debian/build/build-generic/compat-wireless-2.6/drivers/net/wireless/ipw2x00/libipw_rx.o
LD [M] /build/buildd/linux-backports-modules-2.6.28-2.6.28/debian/build/build-generic/compat-wireless-2.6/drivers/net/wireless/b43legacy/b43legacy.o
CC [M] /build/buildd/linux-backports-modules-2.6.28-2.6.28/debian/build/build-generic/compat-wireless-2.6/drivers/net/wireless/ipw2x00/libipw_wx.o
/build/buildd/linux-backports-modules-2.6.28-2.6.28/debian/build/build-generic/compat-wireless-2.6/drivers/net/wireless/ipw2x00/libipw_wx.c: In function 'ieee80211_wx_set_encodeext':
/build/buildd/linux-backports-modules-2.6.28-2.6.28/debian/build/build-generic/compat-wireless-2.6/drivers/net/wireless/ipw2x00/libipw_wx.c:611: warning: format not a string literal and no format arguments
CC [M] /build/buildd/linux-backports-modules-2.6.28-2.6.28/debian/build/build-generic/compat-wireless-2.6/drivers/net/wireless/ipw2x00/libipw_geo.o
LD /build/buildd/linux-backports-modules-2.6.28-2.6.28/debian/build/build-generic/compat-wireless-2.6/drivers/net/wireless/iwlwifi/built-in.o
CC [M] /build/buildd/linux-backports-modules-2.6.28-2.6.28/debian/build/build-generic/compat-wireless-2.6/drivers/net/wireless/iwlwifi/iwl3945-base.o
/build/buildd/linux-backports-modules-2.6.28-2.6.28/debian/build/build-generic/compat-wireless-2.6/drivers/net/wireless/iwlwifi/iwl3945-base.c: In function 'iwl3945_rx_reply_add_sta':
/build/buildd/linux-backports-modules-2.6.28-2.6.28/debian/build/build-generic/compat-wireless-2.6/drivers/net/wireless/iwlwifi/iwl3945-base.c:2747: warning: unused variable 'pkt'
/build/buildd/linux-backports-modules-2.6.28-2.6.28/debian/build/build-generic/compat-wireless-2.6/drivers/net/wireless/iwlwifi/iwl3945-base.c: In function 'iwl3945_rx_scan_results_notif':
/build/buildd/linux-backports-modules-2.6.28-2.6.28/debian/build/build-generic/compat-wireless-2.6/drivers/net/wireless/iwlwifi/iwl3945-base.c:2902: warning: unused variable 'notif'
/build/buildd/linux-backports-modules-2.6.28-2.6.28/debian/build/build-generic/compat-wireless-2.6/drivers/net/wireless/iwlwifi/iwl3945-base.c: In function 'iwl3945_rx_scan_complete_notif':
/build/buildd/linux-backports-modules-2.6.28-2.6.28/debian/build/build-generic/compat-wireless-2.6/drivers/net/wireless/iwlwifi/iwl3945-base.c:2927: warning: unused variable 'scan_notif'
LD [M] /build/buildd/linux-backports-modules-2.6.28-2.6.28/debian/build/build-generic/compat-wireless-2.6/drivers/net/wireless/ipw2x00/libipw.o
LD /build/buildd/linux-backports-modules-2.6.28-2.6.28/debian/build/build-generic/compat-wireless-2.6/drivers/net/wireless/libertas/built-in.o
CC [M] /build/buildd/linux-backports-modules-2.6.28-2.6.28/debian/build/build-generic/compat-wireless-2.6/drivers/net/wireless/libertas/main.o
CC [M] /build/buildd/linux-backports-modules-2.6.28-2.6.28/debian/build/build-generic/compat-wireless-2.6/drivers/net/wireless/libertas/wext.o
CC [M] /build/buildd/linux-backports-modules-2.6.28-2.6.28/debian/build/build-generic/compat-wireless-2.6/drivers/net/wireless/libertas/rx.o
CC [M] /build/buildd/linux-backports-modules-2.6.28-2.6.28/debian/build/build-generic/compat-wireless-2.6/drivers/net/wireless/iwlwifi/iwl-3945.o
CC [M] /build/buildd/linux-backports-modules-2.6.28-2.6.28/debian/build/build-generic/compat-wireless-2.6/drivers/net/wireless/libertas/tx.o
CC [M] /build/buildd/linux-backports-modules-2.6.28-2.6.28/debian/build/build-generic/compat-wireless-2.6/drivers/net/wireless/libertas/cmd.o
CC [M] /build/buildd/linux-backports-modules-2.6.28-2.6.28/debian/build/build-generic/compat-wireless-2.6/drivers/net/wireless/iwlwifi/iwl-3945-rs.o
/build/buildd/linux-backports-modules-2.6.28-2.6.28/debian/build/build-generic/compat-wireless-2.6/drivers/net/wireless/iwlwifi/iwl-3945-rs.c: In function 'iwl3945_rate_scale_flush_windows':
/build/buildd/linux-backports-modules-2.6.28-2.6.28/debian/build/build-generic/compat-wireless-2.6/drivers/net/wireless/iwlwifi/iwl-3945-rs.c:186: warning: unused variable 'priv'
/build/buildd/linux-backports-modules-2.6.28-2.6.28/debian/build/build-generic/compat-wireless-2.6/drivers/net/wireless/iwlwifi/iwl-3945-rs.c: In function 'iwl3945_bg_rate_scale_flush':
/build/buildd/linux-backports-modules-2.6.28-2.6.28/debian/build/build-generic/compat-wireless-2.6/drivers/net/wireless/iwlwifi/iwl-3945-rs.c:219: warning: unused variable 'priv'
/build/buildd/linux-backports-modules-2.6.28-2.6.28/debian/build/build-generic/compat-wireless-2.6/drivers/net/wireless/iwlwifi/iwl-3945-rs.c: In function 'iwl3945_collect_tx_data':
/build/buildd/linux-backports-modules-2.6.28-2.6.28/debian/build/build-generic/compat-wireless-2.6/drivers/net/wireless/iwlwifi/iwl-3945-rs.c:293: warning: unused variable 'priv'
/build/buildd/linux-backports-modules-2.6.28-2.6.28/debian/build/build-generic/compat-wireless-2.6/drivers/net/wireless/iwlwifi/iwl-3945-rs.c: In function 'rs_free_sta':
/build/buildd/linux-backports-modules-2.6.28-2.6.28/debian/build/build-generic/compat-wireless-2.6/drivers/net/wireless/iwlwifi/iwl-3945-rs.c:441: warning: unused variable 'priv'
/build/buildd/linux-backports-modules-2.6.28-2.6.28/debian/build/build-generic/compat-wireless-2.6/drivers/net/wireless/iwlwifi/iwl-3945-rs.c: In function 'iwl3945_get_adjacent_rate':
/build/buildd/linux-backports-modules-2.6.28-2.6.28/debian/build/build-generic/compat-wireless-2.6/drivers/net/wireless/iwlwifi/iwl-3945-rs.c:559: warning: unused variable 'priv'
CC [M] /build/buildd/linux-backports-modules-2.6.28-2.6.28/debian/build/build-generic/compat-wireless-2.6/drivers/net/wireless/iwlwifi/iwl-3945-led.o
CC [M] /build/buildd/linux-backports-modules-2.6.28-2.6.28/debian/build/build-generic/compat-wireless-2.6/drivers/net/wireless/libertas/cmdresp.o
CC [M] /build/buildd/linux-backports-modules-2.6.28-2.6.28/debian/build/build-generic/compat-wireless-2.6/drivers/net/wireless/iwlwifi/iwl-agn.o
CC [M] /build/buildd/linux-backports-modules-2.6.28-2.6.28/debian/build/build-generic/compat-wireless-2.6/drivers/net/wireless/libertas/scan.o
CC [M] /build/buildd/linux-backports-modules-2.6.28-2.6.28/debian/build/build-generic/compat-wireless-2.6/drivers/net/wireless/libertas/11d.o
CC [M] /build/buildd/linux-backports-modules-2.6.28-2.6.28/debian/build/build-generic/compat-wireless-2.6/drivers/net/wireless/iwlwifi/iwl-agn-rs.o
CC [M] /build/buildd/linux-backports-modules-2.6.28-2.6.28/debian/build/build-generic/compat-wireless-2.6/drivers/net/wireless/libertas/debugfs.o
CC [M] /build/buildd/linux-backports-modules-2.6.28-2.6.28/debian/build/build-generic/compat-wireless-2.6/drivers/net/wireless/libertas/persistcfg.o
CC [M] /build/buildd/linux-backports-modules-2.6.28-2.6.28/debian/build/build-generic/compat-wireless-2.6/drivers/net/wireless/iwlwifi/iwl-agn-hcmd-check.o
CC [M] /build/buildd/linux-backports-modules-2.6.28-2.6.28/debian/build/build-generic/compat-wireless-2.6/drivers/net/wireless/libertas/ethtool.o
CC [M] /build/buildd/linux-backports-modules-2.6.28-2.6.28/debian/build/build-generic/compat-wireless-2.6/drivers/net/wireless/iwlwifi/iwl-4965.o
CC [M] /build/buildd/linux-backports-modules-2.6.28-2.6.28/debian/build/build-generic/compat-wireless-2.6/drivers/net/wireless/libertas/assoc.o
CC [M] /build/buildd/linux-backports-modules-2.6.28-2.6.28/debian/build/build-generic/compat-wireless-2.6/drivers/net/wireless/libertas/if_cs.o
CC [M] /build/buildd/linux-backports-modules-2.6.28-2.6.28/debian/build/build-generic/compat-wireless-2.6/drivers/net/wireless/iwlwifi/iwl-5000.o
CC [M] /build/buildd/linux-backports-modules-2.6.28-2.6.28/debian/build/build-generic/compat-wireless-2.6/drivers/net/wireless/libertas/if_sdio.o
CC [M] /build/buildd/linux-backports-modules-2.6.28-2.6.28/debian/build/build-generic/compat-wireless-2.6/drivers/net/wireless/iwlwifi/iwl-core.o
CC [M] /build/buildd/linux-backports-modules-2.6.28-2.6.28/debian/build/build-generic/compat-wireless-2.6/drivers/net/wireless/libertas/if_usb.o
LD [M] /build/buildd/linux-backports-modules-2.6.28-2.6.28/debian/build/build-generic/compat-wireless-2.6/drivers/net/wireless/libertas/libertas.o
LD [M] /build/buildd/linux-backports-modules-2.6.28-2.6.28/debian/build/build-generic/compat-wireless-2.6/drivers/net/wireless/libertas/usb8xxx.o
LD [M] /build/buildd/linux-backports-modules-2.6.28-2.6.28/debian/build/build-generic/compat-wireless-2.6/drivers/net/wireless/libertas/libertas_cs.o
LD [M] /build/buildd/linux-backports-modules-2.6.28-2.6.28/debian/build/build-generic/compat-wireless-2.6/drivers/net/wireless/libertas/libertas_sdio.o
LD /build/buildd/linux-backports-modules-2.6.28-2.6.28/debian/build/build-generic/compat-wireless-2.6/drivers/net/wireless/libertas_tf/built-in.o
CC [M] /build/buildd/linux-backports-modules-2.6.28-2.6.28/debian/build/build-generic/compat-wireless-2.6/drivers/net/wireless/libertas_tf/main.o
CC [M] /build/buildd/linux-backports-modules-2.6.28-2.6.28/debian/build/build-generic/compat-wireless-2.6/drivers/net/wireless/iwlwifi/iwl-eeprom.o
CC [M] /build/buildd/linux-backports-modules-2.6.28-2.6.28/debian/build/build-generic/compat-wireless-2.6/drivers/net/wireless/libertas_tf/cmd.o
CC [M] /build/buildd/linux-backports-modules-2.6.28-2.6.28/debian/build/build-generic/compat-wireless-2.6/drivers/net/wireless/iwlwifi/iwl-hcmd.o
CC [M] /build/buildd/linux-backports-modules-2.6.28-2.6.28/debian/build/build-generic/compat-wireless-2.6/drivers/net/wireless/libertas_tf/if_usb.o
CC [M] /build/buildd/linux-backports-modules-2.6.28-2.6.28/debian/build/build-generic/compat-wireless-2.6/drivers/net/wireless/iwlwifi/iwl-power.o
LD [M] /build/buildd/linux-backports-modules-2.6.28-2.6.28/debian/build/build-generic/compat-wireless-2.6/drivers/net/wireless/libertas_tf/libertas_tf.o
LD [M] /build/buildd/linux-backports-modules-2.6.28-2.6.28/debian/build/build-generic/compat-wireless-2.6/drivers/net/wireless/libertas_tf/libertas_tf_usb.o
LD /build/buildd/linux-backports-modules-2.6.28-2.6.28/debian/build/build-generic/compat-wireless-2.6/drivers/net/wireless/p54/built-in.o
CC [M] /build/buildd/linux-backports-modules-2.6.28-2.6.28/debian/build/build-generic/compat-wireless-2.6/drivers/net/wireless/p54/p54common.o
CC [M] /build/buildd/linux-backports-modules-2.6.28-2.6.28/debian/build/build-generic/compat-wireless-2.6/drivers/net/wireless/iwlwifi/iwl-rx.o
CC [M] /build/buildd/linux-backports-modules-2.6.28-2.6.28/debian/build/build-generic/compat-wireless-2.6/drivers/net/wireless/iwlwifi/iwl-tx.o
CC [M] /build/buildd/linux-backports-modules-2.6.28-2.6.28/debian/build/build-generic/compat-wireless-2.6/drivers/net/wireless/p54/p54usb.o
CC [M] /build/buildd/linux-backports-modules-2.6.28-2.6.28/debian/build/build-generic/compat-wireless-2.6/drivers/net/wireless/p54/p54pci.o
CC [M] /build/buildd/linux-backports-modules-2.6.28-2.6.28/debian/build/build-generic/compat-wireless-2.6/drivers/net/wireless/iwlwifi/iwl-sta.o
LD /build/buildd/linux-backports-modules-2.6.28-2.6.28/debian/build/build-generic/compat-wireless-2.6/drivers/net/wireless/rt2x00/built-in.o
CC [M] /build/buildd/linux-backports-modules-2.6.28-2.6.28/debian/build/build-generic/compat-wireless-2.6/drivers/net/wireless/rt2x00/rt2x00dev.o
CC [M] /build/buildd/linux-backports-modules-2.6.28-2.6.28/debian/build/build-generic/compat-wireless-2.6/drivers/net/wireless/iwlwifi/iwl-calib.o
CC [M] /build/buildd/linux-backports-modules-2.6.28-2.6.28/debian/build/build-generic/compat-wireless-2.6/drivers/net/wireless/rt2x00/rt2x00mac.o
CC [M] /build/buildd/linux-backports-modules-2.6.28-2.6.28/debian/build/build-generic/compat-wireless-2.6/drivers/net/wireless/iwlwifi/iwl-scan.o
CC [M] /build/buildd/linux-backports-modules-2.6.28-2.6.28/debian/build/build-generic/compat-wireless-2.6/drivers/net/wireless/rt2x00/rt2x00config.o
CC [M] /build/buildd/linux-backports-modules-2.6.28-2.6.28/debian/build/build-generic/compat-wireless-2.6/drivers/net/wireless/rt2x00/rt2x00queue.o
CC [M] /build/buildd/linux-backports-modules-2.6.28-2.6.28/debian/build/build-generic/compat-wireless-2.6/drivers/net/wireless/iwlwifi/iwl-led.o
CC [M] /build/buildd/linux-backports-modules-2.6.28-2.6.28/debian/build/build-generic/compat-wireless-2.6/drivers/net/wireless/iwlwifi/iwl-rfkill.o
CC [M] /build/buildd/linux-backports-modules-2.6.28-2.6.28/debian/build/build-generic/compat-wireless-2.6/drivers/net/wireless/rt2x00/rt2x00link.o
CC [M] /build/buildd/linux-backports-modules-2.6.28-2.6.28/debian/build/build-generic/compat-wireless-2.6/drivers/net/wireless/rt2x00/rt2x00crypto.o
CC [M] /build/buildd/linux-backports-modules-2.6.28-2.6.28/debian/build/build-generic/compat-wireless-2.6/drivers/net/wireless/iwlwifi/iwl-spectrum.o
CC [M] /build/buildd/linux-backports-modules-2.6.28-2.6.28/debian/build/build-generic/compat-wireless-2.6/drivers/net/wireless/rt2x00/rt2x00rfkill.o
LD [M] /build/buildd/linux-backports-modules-2.6.28-2.6.28/debian/build/build-generic/compat-wireless-2.6/drivers/net/wireless/iwlwifi/iwlcore.o
LD [M] /build/buildd/linux-backports-modules-2.6.28-2.6.28/debian/build/build-generic/compat-wireless-2.6/drivers/net/wireless/iwlwifi/iwlagn.o
LD [M] /build/buildd/linux-backports-modules-2.6.28-2.6.28/debian/build/build-generic/compat-wireless-2.6/drivers/net/wireless/iwlwifi/iwl3945.o
LD /build/buildd/linux-backports-modules-2.6.28-2.6.28/debian/build/build-generic/compat-wireless-2.6/drivers/net/wireless/rtl818x/built-in.o
CC [M] /build/buildd/linux-backports-modules-2.6.28-2.6.28/debian/build/build-generic/compat-wireless-2.6/drivers/net/wireless/rtl818x/rtl8180_dev.o
CC [M] /build/buildd/linux-backports-modules-2.6.28-2.6.28/debian/build/build-generic/compat-wireless-2.6/drivers/net/wireless/rt2x00/rt2x00firmware.o
CC [M] /build/buildd/linux-backports-modules-2.6.28-2.6.28/debian/build/build-generic/compat-wireless-2.6/drivers/net/wireless/rt2x00/rt2x00leds.o
CC [M] /build/buildd/linux-backports-modules-2.6.28-2.6.28/debian/build/build-generic/compat-wireless-2.6/drivers/net/wireless/rtl818x/rtl8180_rtl8225.o
CC [M] /build/buildd/linux-backports-modules-2.6.28-2.6.28/debian/build/build-generic/compat-wireless-2.6/drivers/net/wireless/rt2x00/rt2x00pci.o
CC [M] /build/buildd/linux-backports-modules-2.6.28-2.6.28/debian/build/build-generic/compat-wireless-2.6/drivers/net/wireless/rtl818x/rtl8180_sa2400.o
CC [M] /build/buildd/linux-backports-modules-2.6.28-2.6.28/debian/build/build-generic/compat-wireless-2.6/drivers/net/wireless/rt2x00/rt2x00usb.o
CC [M] /build/buildd/linux-backports-modules-2.6.28-2.6.28/debian/build/build-generic/compat-wireless-2.6/drivers/net/wireless/rtl818x/rtl8180_max2820.o
CC [M] /build/buildd/linux-backports-modules-2.6.28-2.6.28/debian/build/build-generic/compat-wireless-2.6/drivers/net/wireless/rtl818x/rtl8180_grf5101.o
CC [M] /build/buildd/linux-backports-modules-2.6.28-2.6.28/debian/build/build-generic/compat-wireless-2.6/drivers/net/wireless/rt2x00/rt2400pci.o
CC [M] /build/buildd/linux-backports-modules-2.6.28-2.6.28/debian/build/build-generic/compat-wireless-2.6/drivers/net/wireless/rtl818x/rtl8187_dev.o
CC [M] /build/buildd/linux-backports-modules-2.6.28-2.6.28/debian/build/build-generic/compat-wireless-2.6/drivers/net/wireless/rt2x00/rt2500pci.o
CC [M] /build/buildd/linux-backports-modules-2.6.28-2.6.28/debian/build/build-generic/compat-wireless-2.6/drivers/net/wireless/rtl818x/rtl8187_rtl8225.o
LD [M] /build/buildd/linux-backports-modules-2.6.28-2.6.28/debian/build/build-generic/compat-wireless-2.6/drivers/net/wireless/rtl818x/rtl8180.o
LD [M] /build/buildd/linux-backports-modules-2.6.28-2.6.28/debian/build/build-generic/compat-wireless-2.6/drivers/net/wireless/rtl818x/rtl8187.o
LD /build/buildd/linux-backports-modules-2.6.28-2.6.28/debian/build/build-generic/compat-wireless-2.6/drivers/net/wireless/zd1211rw/built-in.o
CC [M] /build/buildd/linux-backports-modules-2.6.28-2.6.28/debian/build/build-generic/compat-wireless-2.6/drivers/net/wireless/zd1211rw/zd_chip.o
CC [M] /build/buildd/linux-backports-modules-2.6.28-2.6.28/debian/build/build-generic/compat-wireless-2.6/drivers/net/wireless/rt2x00/rt61pci.o
CC [M] /build/buildd/linux-backports-modules-2.6.28-2.6.28/debian/build/build-generic/compat-wireless-2.6/drivers/net/wireless/zd1211rw/zd_mac.o
CC [M] /build/buildd/linux-backports-modules-2.6.28-2.6.28/debian/build/build-generic/compat-wireless-2.6/drivers/net/wireless/zd1211rw/zd_rf_al2230.o
CC [M] /build/buildd/linux-backports-modules-2.6.28-2.6.28/debian/build/build-generic/compat-wireless-2.6/drivers/net/wireless/rt2x00/rt2500usb.o
CC [M] /build/buildd/linux-backports-modules-2.6.28-2.6.28/debian/build/build-generic/compat-wireless-2.6/drivers/net/wireless/zd1211rw/zd_rf_rf2959.o
CC [M] /build/buildd/linux-backports-modules-2.6.28-2.6.28/debian/build/build-generic/compat-wireless-2.6/drivers/net/wireless/zd1211rw/zd_rf_al7230b.o
CC [M] /build/buildd/linux-backports-modules-2.6.28-2.6.28/debian/build/build-generic/compat-wireless-2.6/drivers/net/wireless/zd1211rw/zd_rf_uw2453.o
CC [M] /build/buildd/linux-backports-modules-2.6.28-2.6.28/debian/build/build-generic/compat-wireless-2.6/drivers/net/wireless/rt2x00/rt73usb.o
CC [M] /build/buildd/linux-backports-modules-2.6.28-2.6.28/debian/build/build-generic/compat-wireless-2.6/drivers/net/wireless/zd1211rw/zd_rf.o
CC [M] /build/buildd/linux-backports-modules-2.6.28-2.6.28/debian/build/build-generic/compat-wireless-2.6/drivers/net/wireless/zd1211rw/zd_usb.o
LD [M] /build/buildd/linux-backports-modules-2.6.28-2.6.28/debian/build/build-generic/compat-wireless-2.6/drivers/net/wireless/rt2x00/rt2x00lib.o
LD [M] /build/buildd/linux-backports-modules-2.6.28-2.6.28/debian/build/build-generic/compat-wireless-2.6/drivers/net/wireless/zd1211rw/zd1211rw.o
make[2]: *** [_module_/build/buildd/linux-backports-modules-2.6.28-2.6.28/debian/build/build-generic/compat-wireless-2.6] Error 2
make[2]: Leaving directory `/usr/src/linux-headers-2.6.28-6-generic'
make[1]: *** [modules] Error 2
make[1]: Leaving directory `/build/buildd/linux-backports-modules-2.6.28-2.6.28/debian/build/build-generic/compat-wireless-2.6'
make: *** [/build/buildd/linux-backports-modules-2.6.28-2.6.28/debian/stamps/stamp-build-generic] Error 2
dpkg-buildpackage: failure: debian/rules build gave error exit status 2
******************************************************************************
Build finished at 20090204-2124
FAILED [dpkg-buildpackage died]
Purging chroot-jaunty-autotest/build/buildd/linux-backports-modules-2.6.28-2.6.28
------------------------------------------------------------------------------
/usr/bin/sudo dpkg --root=/home/buildd/build-jaunty-autotest/chroot-jaunty-autotest --purge groff-base libglib2.0-0 git-core libsasl2-2 libdigest-sha1-perl gettext file libtasn1-3 openssl linux-headers-2.6.28-6-server liberror-perl po-debconf libcroco3 libxml2 libcurl3-gnutls man-db libssl0.9.8 intltool-debian libldap-2.4-2 libgpg-error0 html2text ca-certificates libgcrypt11 gettext-base debhelper libidn11 libkeyutils1 libgnutls26 libmagic1 libexpat1 kernel-wedge libsasl2-modules linux-headers-2.6.28-6-generic bsdmainutils linux-headers-2.6.28-6 module-init-tools libkrb53
(Reading database ... 34922 files and directories currently installed.)
Removing git-core ...
Purging configuration files for git-core ...
Removing libdigest-sha1-perl ...
Removing linux-headers-2.6.28-6-server ...
Removing liberror-perl ...
Removing libcurl3-gnutls ...
Purging configuration files for libcurl3-gnutls ...
Removing libldap-2.4-2 ...
Purging configuration files for libldap-2.4-2 ...
Removing ca-certificates ...
Removing hash symlinks in /etc/ssl/certs ...done.
Purging configuration files for ca-certificates ...
Removing libidn11 ...
Purging configuration files for libidn11 ...
Removing libgnutls26 ...
Purging configuration files for libgnutls26 ...
Removing libexpat1 ...
Purging configuration files for libexpat1 ...
Removing kernel-wedge ...
Removing linux-headers-2.6.28-6-generic ...
Removing linux-headers-2.6.28-6 ...
Removing module-init-tools ...
Purging configuration files for module-init-tools ...
Removing libkrb53 ...
Purging configuration files for libkrb53 ...
Removing libtasn1-3 ...
Purging configuration files for libtasn1-3 ...
Removing openssl ...
Purging configuration files for openssl ...
Removing libgcrypt11 ...
Purging configuration files for libgcrypt11 ...
Removing debhelper ...
Removing libkeyutils1 ...
Purging configuration files for libkeyutils1 ...
Removing file ...
Purging configuration files for file ...
Removing po-debconf ...
Removing man-db ...
Purging configuration files for man-db ...
Removing intltool-debian ...
Removing libgpg-error0 ...
Purging configuration files for libgpg-error0 ...
Removing html2text ...
Purging configuration files for html2text ...
Removing libmagic1 ...
Purging configuration files for libmagic1 ...
Removing bsdmainutils ...
Purging configuration files for bsdmainutils ...
Removing groff-base ...
Purging configuration files for groff-base ...
Removing gettext ...
Removing libcroco3 ...
Purging configuration files for libcroco3 ...
Removing libxml2 ...
Purging configuration files for libxml2 ...
Removing gettext-base ...
Removing libglib2.0-0 ...
Purging configuration files for libglib2.0-0 ...
Removing libsasl2-2 ...
Purging configuration files for libsasl2-2 ...
Removing libsasl2-modules ...
Removing libssl0.9.8 ...
Purging configuration files for libssl0.9.8 ...
******************************************************************************
Finished at 20090204-2125
Build needed 00:01:51, 32712k disk space
More information about the ubuntu-autotest
mailing list