Log for failed build of elilo_3.8-1ubuntu1 (dist=jaunty-autotest)

Build Daemon user noreply at buildd.ubuntu.com
Sat Apr 25 23:48:50 BST 2009


Automatic build of elilo_3.8-1ubuntu1 on terranova by sbuild/i386 1.170.5
Build started at 20090425-2348
******************************************************************************
Checking available source versions...
Fetching source files...
Reading package lists...
Building dependency tree...
Reading state information...
Need to get 236kB of source archives.
Get:1 http://archive.internal jaunty-autotest/main elilo 3.8-1ubuntu1 (dsc) [1089B]
Get:2 http://archive.internal jaunty-autotest/main elilo 3.8-1ubuntu1 (tar) [206kB]
Get:3 http://archive.internal jaunty-autotest/main elilo 3.8-1ubuntu1 (diff) [28.6kB]
Fetched 236kB in 0s (5308kB/s)
Download complete and in download only mode
** Using build dependencies supplied by package:
Build-Depends: debhelper (>> 5), binutils (>= 2.17.50.0.14), gnu-efi (>= 3.0d), po-debconf
Checking for already installed source dependencies...
debhelper: missing
binutils: already installed (2.19.51.20090423-0ubuntu1 >= 2.17.50.0.14 is satisfied)
gnu-efi: missing
po-debconf: missing
Checking for source dependency conflicts...
  /usr/bin/sudo /usr/bin/apt-get --purge $CHROOT_OPTIONS -q -y install debhelper gnu-efi po-debconf
Reading package lists...
Building dependency tree...
Reading state information...
The following extra packages will be installed:
  bsdmainutils file gettext gettext-base groff-base html2text intltool-debian
  libcroco3 libglib2.0-0 libmagic1 libxml2 man-db
Suggested packages:
  wamerican wordlist whois vacation dh-make cvs gettext-doc elilo groff less
  www-browser libmail-box-perl
Recommended packages:
  curl wget lynx libglib2.0-data shared-mime-info xml-core
  libmail-sendmail-perl libcompress-zlib-perl
The following NEW packages will be installed:
  bsdmainutils debhelper file gettext gettext-base gnu-efi groff-base
  html2text intltool-debian libcroco3 libglib2.0-0 libmagic1 libxml2 man-db
  po-debconf
0 upgraded, 15 newly installed, 0 to remove and 1 not upgraded.
Need to get 144kB/8169kB of archives.
After this operation, 24.7MB of additional disk space will be used.
WARNING: The following packages cannot be authenticated!
  libmagic1 file bsdmainutils gettext-base groff-base libxml2 man-db html2text
  libglib2.0-0 libcroco3 gettext intltool-debian po-debconf debhelper gnu-efi
Authentication warning overridden.
Get:1 http://ftpmaster.internal jaunty/main gnu-efi 3.0e-2ubuntu1 [144kB]
debconf: unable to initialize frontend: Dialog
debconf: (Dialog frontend will not work on a dumb terminal, an emacs shell buffer, or without a controlling terminal.)
debconf: falling back to frontend: Readline
debconf: unable to initialize frontend: Readline
debconf: (This frontend requires a controlling tty.)
debconf: falling back to frontend: Teletype
dpkg-preconfigure: unable to re-open stdin: 
Fetched 144kB in 0s (3609kB/s)
Selecting previously deselected package libmagic1.
(Reading database ... 10222 files and directories currently installed.)
Unpacking libmagic1 (from .../libmagic1_4.26-2ubuntu3_i386.deb) ...
Selecting previously deselected package file.
Unpacking file (from .../file_4.26-2ubuntu3_i386.deb) ...
Selecting previously deselected package bsdmainutils.
Unpacking bsdmainutils (from .../bsdmainutils_6.1.10ubuntu3_i386.deb) ...
Selecting previously deselected package gettext-base.
Unpacking gettext-base (from .../gettext-base_0.17-6ubuntu2_i386.deb) ...
Selecting previously deselected package groff-base.
Unpacking groff-base (from .../groff-base_1.18.1.1-22build1_i386.deb) ...
Selecting previously deselected package libxml2.
Unpacking libxml2 (from .../libxml2_2.6.32.dfsg-5ubuntu4_i386.deb) ...
Selecting previously deselected package man-db.
Unpacking man-db (from .../man-db_2.5.5-1build1_i386.deb) ...
Selecting previously deselected package html2text.
Unpacking html2text (from .../html2text_1.3.2a-5_i386.deb) ...
Selecting previously deselected package libglib2.0-0.
Unpacking libglib2.0-0 (from .../libglib2.0-0_2.20.1-0ubuntu2_i386.deb) ...
Selecting previously deselected package libcroco3.
Unpacking libcroco3 (from .../libcroco3_0.6.1-2_i386.deb) ...
Selecting previously deselected package gettext.
Unpacking gettext (from .../gettext_0.17-6ubuntu2_i386.deb) ...
Selecting previously deselected package intltool-debian.
Unpacking intltool-debian (from .../intltool-debian_0.35.0+20060710.1_all.deb) ...
Selecting previously deselected package po-debconf.
Unpacking po-debconf (from .../po-debconf_1.0.15ubuntu1_all.deb) ...
Selecting previously deselected package debhelper.
Unpacking debhelper (from .../debhelper_7.0.17ubuntu4_all.deb) ...
Selecting previously deselected package gnu-efi.
Unpacking gnu-efi (from .../gnu-efi_3.0e-2ubuntu1_i386.deb) ...
Setting up libmagic1 (4.26-2ubuntu3) ...

Setting up file (4.26-2ubuntu3) ...
Setting up bsdmainutils (6.1.10ubuntu3) ...

Setting up gettext-base (0.17-6ubuntu2) ...

Setting up groff-base (1.18.1.1-22build1) ...

Setting up libxml2 (2.6.32.dfsg-5ubuntu4) ...

Setting up man-db (2.5.5-1build1) ...
Building database of manual pages ...
... skipping, since this is a buildd

Setting up html2text (1.3.2a-5) ...

Setting up libglib2.0-0 (2.20.1-0ubuntu2) ...

Setting up libcroco3 (0.6.1-2) ...

Setting up gettext (0.17-6ubuntu2) ...

Setting up intltool-debian (0.35.0+20060710.1) ...
Setting up po-debconf (1.0.15ubuntu1) ...

Setting up debhelper (7.0.17ubuntu4) ...

Setting up gnu-efi (3.0e-2ubuntu1) ...
Processing triggers for libc6 ...
ldconfig deferred processing now taking place
Checking correctness of source dependencies...
Toolchain package versions: libc6-dev_2.9-4ubuntu6 make_3.81-5 dpkg-dev_1.14.24ubuntu1 linux-libc-dev_2.6.28-11.42 g++-4.4_4.4.0-0ubuntu3 gcc-4.4_4.4.0-0ubuntu3 binutils_2.19.51.20090423-0ubuntu1 libstdc++6_4.4.0-0ubuntu3 libstdc++6-4.4-dev_4.4.0-0ubuntu3
------------------------------------------------------------------------------
sh: gcc: not found
dpkg-source: warning: Couldn't determine gcc system type, falling back to default (native compilation)
gpg: Signature made Fri Jun 20 03:06:40 2008 BST using DSA key ID E0E67611
gpg: Can't check signature: public key not found
dpkg-source: extracting elilo in elilo-3.8
dpkg-source: unpacking elilo_3.8.orig.tar.gz
dpkg-source: applying /home/buildd/build-jaunty-autotest/elilo_3.8-1ubuntu1.diff.gz
dpkg-buildpackage: set CFLAGS to default value: -g -O2
dpkg-buildpackage: set CPPFLAGS to default value: 
dpkg-buildpackage: set LDFLAGS to default value: -Wl,-Bsymbolic-functions
dpkg-buildpackage: set FFLAGS to default value: -g -O2
dpkg-buildpackage: set CXXFLAGS to default value: -g -O2
dpkg-buildpackage: source package elilo
dpkg-buildpackage: source version 3.8-1ubuntu1
dpkg-buildpackage: host architecture i386
 /usr/bin/fakeroot debian/rules clean
dh_testdir
dh_testroot
rm -f build-stamp configure-stamp
[ ! -f Makefile ] || /usr/bin/make clean
make[1]: Entering directory `/build/buildd/elilo-3.8'
make[2]: Entering directory `/build/buildd/elilo-3.8/fs'
rm -f -f fs.o  localfs.o netfs.o
make[2]: Leaving directory `/build/buildd/elilo-3.8/fs'
make[2]: Entering directory `/build/buildd/elilo-3.8/choosers'
rm -f -f choosers.o  simple.o textmenu.o
make[2]: Leaving directory `/build/buildd/elilo-3.8/choosers'
make[2]: Entering directory `/build/buildd/elilo-3.8/devschemes'
rm -f -f devschemes.o simple.o
make[2]: Leaving directory `/build/buildd/elilo-3.8/devschemes'
make[2]: Entering directory `/build/buildd/elilo-3.8/tools'
rm -f -f eliloalt eliloalt.o
make[2]: Leaving directory `/build/buildd/elilo-3.8/tools'
make[2]: Entering directory `/build/buildd/elilo-3.8/ia32'
rm -f -f sysdeps.o system.o config.o bzimage.o plain_loader.o gzip_loader.o gzip.o
rm -f -f bin_to_h.o bin_to_h
rm -f -f rmswitch.h rmswitch.o rmswitch
make[2]: Leaving directory `/build/buildd/elilo-3.8/ia32'
rm -f elilo.efi *~ *.so elilo.o getopt.o strops.o loader.o fileops.o util.o vars.o alloc.o chooser.o config.o initrd.o alternate.o bootparams.o gunzip.o apple.o fs/fs.o choosers/choosers.o devschemes/devschemes.o ia32/sysdeps.o glue_localfs.o glue_netfs.o
make[1]: Leaving directory `/build/buildd/elilo-3.8'
debconf-updatepo
dh_clean
 debian/rules build
dh_testdir
touch configure-stamp
dh_testdir
/usr/bin/make
make[1]: Entering directory `/build/buildd/elilo-3.8'
/usr/bin/make -C fs
make[2]: Entering directory `/build/buildd/elilo-3.8/fs'
/usr/bin/gcc -I. -I/build/buildd/elilo-3.8/fs/.. -I/usr/include/efi -I/usr/include/efi/ia32 -I/usr/include/efi/protocol -O2  -fpic -fshort-wchar -Wall -DENABLE_MACHINE_SPECIFIC_NETCONFIG -DCONFIG_LOCALFS -DCONFIG_NETFS -DCONFIG_CHOOSER_SIMPLE -DCONFIG_CHOOSER_TEXTMENU -DCONFIG_ia32  -c localfs.c -o localfs.o
/usr/bin/gcc -I. -I/build/buildd/elilo-3.8/fs/.. -I/usr/include/efi -I/usr/include/efi/ia32 -I/usr/include/efi/protocol -O2  -fpic -fshort-wchar -Wall -DENABLE_MACHINE_SPECIFIC_NETCONFIG -DCONFIG_LOCALFS -DCONFIG_NETFS -DCONFIG_CHOOSER_SIMPLE -DCONFIG_CHOOSER_TEXTMENU -DCONFIG_ia32  -c netfs.c -o netfs.o
/usr/bin/ld -r -o fs.o  localfs.o netfs.o
make[2]: Leaving directory `/build/buildd/elilo-3.8/fs'
/usr/bin/make -C choosers
make[2]: Entering directory `/build/buildd/elilo-3.8/choosers'
/usr/bin/gcc -I. -I/build/buildd/elilo-3.8/choosers/.. -I/usr/include/efi -I/usr/include/efi/ia32 -I/usr/include/efi/protocol -O2  -fpic -fshort-wchar -Wall -DENABLE_MACHINE_SPECIFIC_NETCONFIG -DCONFIG_LOCALFS -DCONFIG_NETFS -DCONFIG_CHOOSER_SIMPLE -DCONFIG_CHOOSER_TEXTMENU -DCONFIG_ia32  -c simple.c -o simple.o
simple.c: In function 'display_message':
simple.c:240: warning: pointer targets in passing argument 3 of 'fops_read' differ in signedness
/build/buildd/elilo-3.8/choosers/../fileops.h:40: note: expected 'UINTN *' but argument is of type 'INTN *'
/usr/bin/gcc -I. -I/build/buildd/elilo-3.8/choosers/.. -I/usr/include/efi -I/usr/include/efi/ia32 -I/usr/include/efi/protocol -O2  -fpic -fshort-wchar -Wall -DENABLE_MACHINE_SPECIFIC_NETCONFIG -DCONFIG_LOCALFS -DCONFIG_NETFS -DCONFIG_CHOOSER_SIMPLE -DCONFIG_CHOOSER_TEXTMENU -DCONFIG_ia32  -c textmenu.c -o textmenu.o
textmenu.c: In function 'read_message_file':
textmenu.c:211: warning: pointer targets in passing argument 3 of 'fops_read' differ in signedness
/build/buildd/elilo-3.8/choosers/../fileops.h:40: note: expected 'UINTN *' but argument is of type 'INTN *'
textmenu.c: In function 'select_kernel':
textmenu.c:247: warning: pointer targets in passing argument 2 of 'read_message_file' differ in signedness
textmenu.c:189: note: expected 'INT8 *' but argument is of type 'UINT8 *'
textmenu.c:299: warning: pointer targets in passing argument 2 of 'read_message_file' differ in signedness
textmenu.c:189: note: expected 'INT8 *' but argument is of type 'UINT8 *'
/usr/bin/ld -o choosers.o -r  simple.o textmenu.o
make[2]: Leaving directory `/build/buildd/elilo-3.8/choosers'
/usr/bin/make -C devschemes
make[2]: Entering directory `/build/buildd/elilo-3.8/devschemes'
/usr/bin/gcc -I. -I/build/buildd/elilo-3.8/devschemes/.. -I/usr/include/efi -I/usr/include/efi/ia32 -I/usr/include/efi/protocol -O2  -fpic -fshort-wchar -Wall -DENABLE_MACHINE_SPECIFIC_NETCONFIG -DCONFIG_LOCALFS -DCONFIG_NETFS -DCONFIG_CHOOSER_SIMPLE -DCONFIG_CHOOSER_TEXTMENU -DCONFIG_ia32  -c simple.c -o simple.o
/usr/bin/ld -r -o devschemes.o simple.o
make[2]: Leaving directory `/build/buildd/elilo-3.8/devschemes'
/usr/bin/make -C tools
make[2]: Entering directory `/build/buildd/elilo-3.8/tools'
/usr/bin/gcc -O2  -Wall -c eliloalt.c -o eliloalt.o
/usr/bin/gcc -o eliloalt -O2  -Wall eliloalt.o
make[2]: Leaving directory `/build/buildd/elilo-3.8/tools'
/usr/bin/make -C ia32
make[2]: Entering directory `/build/buildd/elilo-3.8/ia32'
/usr/bin/gcc -o bin_to_h bin_to_h.c
/usr/bin/as -o rmswitch.o rmswitch.S
/usr/bin/ld -Ttext 0x0 -s --oformat binary -o rmswitch rmswitch.o
./bin_to_h <rmswitch >rmswitch.h
/usr/bin/gcc -I. -I/build/buildd/elilo-3.8/ia32/.. -I/usr/include/efi -I/usr/include/efi/ia32 -I/usr/include/efi/protocol -O2  -fpic -fshort-wchar -Wall -DENABLE_MACHINE_SPECIFIC_NETCONFIG -DCONFIG_LOCALFS -DCONFIG_NETFS -DCONFIG_CHOOSER_SIMPLE -DCONFIG_CHOOSER_TEXTMENU -DCONFIG_ia32  -c system.c -o system.o
system.c: In function 'get_video_info':
system.c:202: warning: passing argument 3 of 'BS->HandleProtocol' from incompatible pointer type
system.c:202: note: expected 'void **' but argument is of type 'struct EFI_GRAPHICS_OUTPUT_PROTOCOL **'
system.c:273: warning: implicit declaration of function 'find_bits'
system.c:172: warning: 'Gop_handle' is used uninitialized in this function
/usr/bin/gcc -I. -I/build/buildd/elilo-3.8/ia32/.. -I/usr/include/efi -I/usr/include/efi/ia32 -I/usr/include/efi/protocol -O2  -fpic -fshort-wchar -Wall -DENABLE_MACHINE_SPECIFIC_NETCONFIG -DCONFIG_LOCALFS -DCONFIG_NETFS -DCONFIG_CHOOSER_SIMPLE -DCONFIG_CHOOSER_TEXTMENU -DCONFIG_ia32  -c config.c -o config.o
/usr/bin/gcc -I. -I/build/buildd/elilo-3.8/ia32/.. -I/usr/include/efi -I/usr/include/efi/ia32 -I/usr/include/efi/protocol -O2  -fpic -fshort-wchar -Wall -DENABLE_MACHINE_SPECIFIC_NETCONFIG -DCONFIG_LOCALFS -DCONFIG_NETFS -DCONFIG_CHOOSER_SIMPLE -DCONFIG_CHOOSER_TEXTMENU -DCONFIG_ia32  -c bzimage.c -o bzimage.o
/usr/bin/gcc -I. -I/build/buildd/elilo-3.8/ia32/.. -I/usr/include/efi -I/usr/include/efi/ia32 -I/usr/include/efi/protocol -O2  -fpic -fshort-wchar -Wall -DENABLE_MACHINE_SPECIFIC_NETCONFIG -DCONFIG_LOCALFS -DCONFIG_NETFS -DCONFIG_CHOOSER_SIMPLE -DCONFIG_CHOOSER_TEXTMENU -DCONFIG_ia32  -c plain_loader.c -o plain_loader.o
/usr/bin/gcc -I. -I/build/buildd/elilo-3.8/ia32/.. -I/usr/include/efi -I/usr/include/efi/ia32 -I/usr/include/efi/protocol -O2  -fpic -fshort-wchar -Wall -DENABLE_MACHINE_SPECIFIC_NETCONFIG -DCONFIG_LOCALFS -DCONFIG_NETFS -DCONFIG_CHOOSER_SIMPLE -DCONFIG_CHOOSER_TEXTMENU -DCONFIG_ia32  -c gzip_loader.c -o gzip_loader.o
/usr/bin/gcc -I. -I/build/buildd/elilo-3.8/ia32/.. -I/usr/include/efi -I/usr/include/efi/ia32 -I/usr/include/efi/protocol -O2  -fpic -fshort-wchar -Wall -DENABLE_MACHINE_SPECIFIC_NETCONFIG -DCONFIG_LOCALFS -DCONFIG_NETFS -DCONFIG_CHOOSER_SIMPLE -DCONFIG_CHOOSER_TEXTMENU -DCONFIG_ia32  -c gzip.c -o gzip.o
gzip.c: In function 'fill_inbuf':
gzip.c:161: warning: pointer targets in passing argument 3 of 'fops_read' differ in signedness
/build/buildd/elilo-3.8/ia32/../fileops.h:40: note: expected 'UINTN *' but argument is of type 'INTN *'
gzip.c: In function 'flush_window':
gzip.c:446: warning: pointer targets in passing argument 1 of 'first_block' differ in signedness
gzip.c:280: note: expected 'const char *' but argument is of type 'uch *'
gzip.c:452: warning: pointer targets in assignment differ in signedness
/usr/bin/ld -r -o sysdeps.o system.o config.o bzimage.o plain_loader.o gzip_loader.o gzip.o
make[2]: Leaving directory `/build/buildd/elilo-3.8/ia32'
/usr/bin/gcc -I. -I. -I/usr/include/efi -I/usr/include/efi/ia32 -I/usr/include/efi/protocol -O2  -fpic -fshort-wchar -Wall -DENABLE_MACHINE_SPECIFIC_NETCONFIG -DCONFIG_LOCALFS -DCONFIG_NETFS -DCONFIG_CHOOSER_SIMPLE -DCONFIG_CHOOSER_TEXTMENU -DCONFIG_ia32  -c elilo.c -o elilo.o
elilo.c: In function 'efi_main':
elilo.c:712: warning: implicit declaration of function 'apple_fudge'
/usr/bin/gcc -I. -I. -I/usr/include/efi -I/usr/include/efi/ia32 -I/usr/include/efi/protocol -O2  -fpic -fshort-wchar -Wall -DENABLE_MACHINE_SPECIFIC_NETCONFIG -DCONFIG_LOCALFS -DCONFIG_NETFS -DCONFIG_CHOOSER_SIMPLE -DCONFIG_CHOOSER_TEXTMENU -DCONFIG_ia32  -c getopt.c -o getopt.o
/usr/bin/gcc -I. -I. -I/usr/include/efi -I/usr/include/efi/ia32 -I/usr/include/efi/protocol -O2  -fpic -fshort-wchar -Wall -DENABLE_MACHINE_SPECIFIC_NETCONFIG -DCONFIG_LOCALFS -DCONFIG_NETFS -DCONFIG_CHOOSER_SIMPLE -DCONFIG_CHOOSER_TEXTMENU -DCONFIG_ia32  -c strops.c -o strops.o
/usr/bin/gcc -I. -I. -I/usr/include/efi -I/usr/include/efi/ia32 -I/usr/include/efi/protocol -O2  -fpic -fshort-wchar -Wall -DENABLE_MACHINE_SPECIFIC_NETCONFIG -DCONFIG_LOCALFS -DCONFIG_NETFS -DCONFIG_CHOOSER_SIMPLE -DCONFIG_CHOOSER_TEXTMENU -DCONFIG_ia32  -c loader.c -o loader.o
/usr/bin/gcc -I. -I. -I/usr/include/efi -I/usr/include/efi/ia32 -I/usr/include/efi/protocol -O2  -fpic -fshort-wchar -Wall -DENABLE_MACHINE_SPECIFIC_NETCONFIG -DCONFIG_LOCALFS -DCONFIG_NETFS -DCONFIG_CHOOSER_SIMPLE -DCONFIG_CHOOSER_TEXTMENU -DCONFIG_ia32  -c fileops.c -o fileops.o
/usr/bin/gcc -I. -I. -I/usr/include/efi -I/usr/include/efi/ia32 -I/usr/include/efi/protocol -O2  -fpic -fshort-wchar -Wall -DENABLE_MACHINE_SPECIFIC_NETCONFIG -DCONFIG_LOCALFS -DCONFIG_NETFS -DCONFIG_CHOOSER_SIMPLE -DCONFIG_CHOOSER_TEXTMENU -DCONFIG_ia32  -c util.c -o util.o
util.c: In function 'read_file':
util.c:269: warning: pointer targets in passing argument 3 of 'fops_read' differ in signedness
fileops.h:40: note: expected 'UINTN *' but argument is of type 'INTN *'
util.c: In function 'print_memmap':
util.c:437: warning: integer constant is too large for 'long' type
util.c: In function 'find_kernel_memory':
util.c:490: warning: cast to pointer from integer of different size
util.c:491: warning: cast to pointer from integer of different size
/usr/bin/gcc -I. -I. -I/usr/include/efi -I/usr/include/efi/ia32 -I/usr/include/efi/protocol -O2  -fpic -fshort-wchar -Wall -DENABLE_MACHINE_SPECIFIC_NETCONFIG -DCONFIG_LOCALFS -DCONFIG_NETFS -DCONFIG_CHOOSER_SIMPLE -DCONFIG_CHOOSER_TEXTMENU -DCONFIG_ia32  -c vars.c -o vars.o
/usr/bin/gcc -I. -I. -I/usr/include/efi -I/usr/include/efi/ia32 -I/usr/include/efi/protocol -O2  -fpic -fshort-wchar -Wall -DENABLE_MACHINE_SPECIFIC_NETCONFIG -DCONFIG_LOCALFS -DCONFIG_NETFS -DCONFIG_CHOOSER_SIMPLE -DCONFIG_CHOOSER_TEXTMENU -DCONFIG_ia32  -c alloc.c -o alloc.o
alloc.c: In function 'alloc_pages':
alloc.c:125: warning: cast from pointer to integer of different size
alloc.c:139: warning: cast to pointer from integer of different size
alloc.c: In function 'free':
alloc.c:171: warning: cast from pointer to integer of different size
alloc.c: In function 'free_all':
alloc.c:203: warning: cast from pointer to integer of different size
/usr/bin/gcc -I. -I. -I/usr/include/efi -I/usr/include/efi/ia32 -I/usr/include/efi/protocol -O2  -fpic -fshort-wchar -Wall -DENABLE_MACHINE_SPECIFIC_NETCONFIG -DCONFIG_LOCALFS -DCONFIG_NETFS -DCONFIG_CHOOSER_SIMPLE -DCONFIG_CHOOSER_TEXTMENU -DCONFIG_ia32  -c chooser.c -o chooser.o
/usr/bin/gcc -I. -I. -I/usr/include/efi -I/usr/include/efi/ia32 -I/usr/include/efi/protocol -O2  -fpic -fshort-wchar -Wall -DENABLE_MACHINE_SPECIFIC_NETCONFIG -DCONFIG_LOCALFS -DCONFIG_NETFS -DCONFIG_CHOOSER_SIMPLE -DCONFIG_CHOOSER_TEXTMENU -DCONFIG_ia32  -c config.c -o config.o
/usr/bin/gcc -I. -I. -I/usr/include/efi -I/usr/include/efi/ia32 -I/usr/include/efi/protocol -O2  -fpic -fshort-wchar -Wall -DENABLE_MACHINE_SPECIFIC_NETCONFIG -DCONFIG_LOCALFS -DCONFIG_NETFS -DCONFIG_CHOOSER_SIMPLE -DCONFIG_CHOOSER_TEXTMENU -DCONFIG_ia32  -c initrd.c -o initrd.o
/usr/bin/gcc -I. -I. -I/usr/include/efi -I/usr/include/efi/ia32 -I/usr/include/efi/protocol -O2  -fpic -fshort-wchar -Wall -DENABLE_MACHINE_SPECIFIC_NETCONFIG -DCONFIG_LOCALFS -DCONFIG_NETFS -DCONFIG_CHOOSER_SIMPLE -DCONFIG_CHOOSER_TEXTMENU -DCONFIG_ia32  -c alternate.c -o alternate.o
alternate.c: In function 'alternate_kernel':
alternate.c:83: warning: pointer targets in passing argument 4 of 'RT->GetVariable' differ in signedness
alternate.c:83: note: expected 'UINTN *' but argument is of type 'INTN *'
/usr/bin/gcc -I. -I. -I/usr/include/efi -I/usr/include/efi/ia32 -I/usr/include/efi/protocol -O2  -fpic -fshort-wchar -Wall -DENABLE_MACHINE_SPECIFIC_NETCONFIG -DCONFIG_LOCALFS -DCONFIG_NETFS -DCONFIG_CHOOSER_SIMPLE -DCONFIG_CHOOSER_TEXTMENU -DCONFIG_ia32  -c bootparams.c -o bootparams.o
/usr/bin/gcc -I. -I. -I/usr/include/efi -I/usr/include/efi/ia32 -I/usr/include/efi/protocol -O2  -fpic -fshort-wchar -Wall -DENABLE_MACHINE_SPECIFIC_NETCONFIG -DCONFIG_LOCALFS -DCONFIG_NETFS -DCONFIG_CHOOSER_SIMPLE -DCONFIG_CHOOSER_TEXTMENU -DCONFIG_ia32  -c gunzip.c -o gunzip.o
In file included from gunzip.c:101:
inflate.c: In function 'gunzip':
inflate.c:1098: warning: value computed is not used
inflate.c:1099: warning: value computed is not used
inflate.c:1100: warning: value computed is not used
/usr/bin/gcc -I. -I. -I/usr/include/efi -I/usr/include/efi/ia32 -I/usr/include/efi/protocol -O2  -fpic -fshort-wchar -Wall -DENABLE_MACHINE_SPECIFIC_NETCONFIG -DCONFIG_LOCALFS -DCONFIG_NETFS -DCONFIG_CHOOSER_SIMPLE -DCONFIG_CHOOSER_TEXTMENU -DCONFIG_ia32  -c apple.c -o apple.o
/usr/bin/gcc -I. -I. -I/usr/include/efi -I/usr/include/efi/ia32 -I/usr/include/efi/protocol -O2  -fpic -fshort-wchar -Wall -DENABLE_MACHINE_SPECIFIC_NETCONFIG -DCONFIG_LOCALFS -DCONFIG_NETFS -DCONFIG_CHOOSER_SIMPLE -DCONFIG_CHOOSER_TEXTMENU -DCONFIG_ia32  -c glue_localfs.c -o glue_localfs.o
/usr/bin/gcc -I. -I. -I/usr/include/efi -I/usr/include/efi/ia32 -I/usr/include/efi/protocol -O2  -fpic -fshort-wchar -Wall -DENABLE_MACHINE_SPECIFIC_NETCONFIG -DCONFIG_LOCALFS -DCONFIG_NETFS -DCONFIG_CHOOSER_SIMPLE -DCONFIG_CHOOSER_TEXTMENU -DCONFIG_ia32  -c glue_netfs.c -o glue_netfs.o
/usr/bin/ld -nostdlib -znocombreloc -T /usr/lib/elf_ia32_efi.lds -shared -Bsymbolic -L/usr/lib -L/usr/lib /usr/lib/crt0-efi-ia32.o elilo.o getopt.o strops.o loader.o fileops.o util.o vars.o alloc.o chooser.o config.o initrd.o alternate.o bootparams.o gunzip.o apple.o fs/fs.o choosers/choosers.o devschemes/devschemes.o ia32/sysdeps.o glue_localfs.o glue_netfs.o -o elilo.so -lefi -lgnuefi /usr/lib/gcc/i486-linux-gnu/4.4.0/libgcc.a
apple.o: In function `apple_fudge':
apple.c:(.text+0x4c9): undefined reference to `__stack_chk_fail_local'
fs/fs.o: In function `netfs_getinfo':
netfs.c:(.text+0x1914): undefined reference to `__stack_chk_fail_local'
fs/fs.o: In function `netfs_open':
netfs.c:(.text+0x2293): undefined reference to `__stack_chk_fail_local'
choosers/choosers.o: In function `.L48':
simple.c:(.text+0xe97): undefined reference to `__stack_chk_fail_local'
ia32/sysdeps.o: In function `sysdeps_create_boot_params':
(.text+0xde9): undefined reference to `__stack_chk_fail_local'
ia32/sysdeps.o:bzimage.c:(.text+0x1a40): more undefined references to `__stack_chk_fail_local' follow
/usr/bin/ld: elilo.so: hidden symbol `__stack_chk_fail_local' isn't defined
/usr/bin/ld: final link failed: Nonrepresentable section on output
make[1]: *** [elilo.so] Error 1
make[1]: Leaving directory `/build/buildd/elilo-3.8'
make: *** [build-stamp] Error 2
dpkg-buildpackage: failure: debian/rules build gave error exit status 2
******************************************************************************
Build finished at 20090425-2348
FAILED [dpkg-buildpackage died]
Purging chroot-jaunty-autotest/build/buildd/elilo-3.8
------------------------------------------------------------------------------
  /usr/bin/sudo dpkg --root=/home/buildd/build-jaunty-autotest/chroot-jaunty-autotest --purge po-debconf intltool-debian groff-base libglib2.0-0 libcroco3 libmagic1 gettext file gnu-efi libxml2 bsdmainutils html2text gettext-base man-db debhelper
(Reading database ... 11449 files and directories currently installed.)
Removing gnu-efi ...
Removing debhelper ...
Removing po-debconf ...
Removing intltool-debian ...
Removing gettext ...
Removing file ...
Purging configuration files for file ...
Removing html2text ...
Purging configuration files for html2text ...
Removing gettext-base ...
Removing man-db ...
Purging configuration files for man-db ...
  Removing catpages as well as /var/cache/man hierarchy.
dpkg - warning: while removing man-db, directory `/usr/share/doc/man-db/examples' not empty so not removed.
dpkg - warning: while removing man-db, directory `/usr/share/doc/man-db' not empty so not removed.
dpkg - warning: while removing man-db, directory `/usr/share/man-db' not empty so not removed.
dpkg - warning: while removing man-db, directory `/usr/share/bug/man-db' not empty so not removed.
dpkg - warning: while removing man-db, directory `/usr/lib/man-db' not empty so not removed.
Removing groff-base ...
Purging configuration files for groff-base ...
Removing libcroco3 ...
Purging configuration files for libcroco3 ...
Removing libmagic1 ...
Purging configuration files for libmagic1 ...
Removing libxml2 ...
Purging configuration files for libxml2 ...
Removing bsdmainutils ...
Purging configuration files for bsdmainutils ...
Removing libglib2.0-0 ...
Purging configuration files for libglib2.0-0 ...
Processing triggers for libc6 ...
ldconfig deferred processing now taking place
******************************************************************************
Finished at 20090425-2348
Build needed 00:00:09, 1580k disk space




More information about the ubuntu-autotest mailing list