Log for failed build of slugimage_1:0.0+r104-5 (dist=jaunty-autotest)
Build Daemon user
noreply at buildd.ubuntu.com
Tue Apr 14 14:56:29 BST 2009
Automatic build of slugimage_1:0.0+r104-5 on terranova by sbuild/i386 1.170.5
Build started at 20090414-1456
******************************************************************************
Checking available source versions...
Fetching source files...
Reading package lists...
Building dependency tree...
Reading state information...
NOTICE: 'slugimage' packaging is maintained in the 'Svn' version control system at:
svn://svn.debian.org/collab-maint/deb-maint/slugimage/trunk
Need to get 17.8kB of source archives.
Get:1 http://archive.internal jaunty-autotest/main slugimage 1:0.0+r104-5 (dsc) [1144B]
Get:2 http://archive.internal jaunty-autotest/main slugimage 1:0.0+r104-5 (tar) [14.6kB]
Get:3 http://archive.internal jaunty-autotest/main slugimage 1:0.0+r104-5 (diff) [2055B]
Fetched 17.8kB in 0s (731kB/s)
Download complete and in download only mode
** Using build dependencies supplied by package:
Build-Depends: debhelper (>= 7), dpkg-dev (>= 1.9.0), bsdmainutils
Checking for already installed source dependencies...
debhelper: missing
dpkg-dev: already installed (1.14.24ubuntu1 >= 1.9.0 is satisfied)
bsdmainutils: missing
Checking for source dependency conflicts...
/usr/bin/sudo /usr/bin/apt-get --purge $CHROOT_OPTIONS -q -y install debhelper bsdmainutils
Reading package lists...
Building dependency tree...
Reading state information...
The following extra packages will be installed:
file gettext gettext-base groff-base html2text intltool-debian libcroco3
libglib2.0-0 libmagic1 libxml2 man-db po-debconf
Suggested packages:
wamerican wordlist whois vacation dh-make cvs gettext-doc groff less
www-browser libmail-box-perl
Recommended packages:
curl wget lynx libglib2.0-data shared-mime-info xml-core
libmail-sendmail-perl libcompress-zlib-perl
The following NEW packages will be installed:
bsdmainutils debhelper file gettext gettext-base groff-base html2text
intltool-debian libcroco3 libglib2.0-0 libmagic1 libxml2 man-db po-debconf
0 upgraded, 14 newly installed, 0 to remove and 0 not upgraded.
Need to get 0B/7819kB of archives.
After this operation, 23.5MB of additional disk space will be used.
WARNING: The following packages cannot be authenticated!
libmagic1 file bsdmainutils gettext-base groff-base libxml2 man-db html2text
libglib2.0-0 libcroco3 gettext intltool-debian po-debconf debhelper
debconf: unable to initialize frontend: Dialog
debconf: (Dialog frontend will not work on a dumb terminal, an emacs shell buffer, or without a controlling terminal.)
debconf: falling back to frontend: Readline
debconf: unable to initialize frontend: Readline
debconf: (This frontend requires a controlling tty.)
debconf: falling back to frontend: Teletype
dpkg-preconfigure: unable to re-open stdin:
Authentication warning overridden.
Selecting previously deselected package libmagic1.
(Reading database ... 9821 files and directories currently installed.)
Unpacking libmagic1 (from .../libmagic1_4.26-2ubuntu3_i386.deb) ...
Selecting previously deselected package file.
Unpacking file (from .../file_4.26-2ubuntu3_i386.deb) ...
Selecting previously deselected package bsdmainutils.
Unpacking bsdmainutils (from .../bsdmainutils_6.1.10ubuntu3_i386.deb) ...
Selecting previously deselected package gettext-base.
Unpacking gettext-base (from .../gettext-base_0.17-6ubuntu2_i386.deb) ...
Selecting previously deselected package groff-base.
Unpacking groff-base (from .../groff-base_1.18.1.1-22build1_i386.deb) ...
Selecting previously deselected package libxml2.
Unpacking libxml2 (from .../libxml2_2.6.32.dfsg-5ubuntu4_i386.deb) ...
Selecting previously deselected package man-db.
Unpacking man-db (from .../man-db_2.5.5-1build1_i386.deb) ...
Selecting previously deselected package html2text.
Unpacking html2text (from .../html2text_1.3.2a-5_i386.deb) ...
Selecting previously deselected package libglib2.0-0.
Unpacking libglib2.0-0 (from .../libglib2.0-0_2.20.1-0ubuntu2_i386.deb) ...
Selecting previously deselected package libcroco3.
Unpacking libcroco3 (from .../libcroco3_0.6.1-2_i386.deb) ...
Selecting previously deselected package gettext.
Unpacking gettext (from .../gettext_0.17-6ubuntu2_i386.deb) ...
Selecting previously deselected package intltool-debian.
Unpacking intltool-debian (from .../intltool-debian_0.35.0+20060710.1_all.deb) ...
Selecting previously deselected package po-debconf.
Unpacking po-debconf (from .../po-debconf_1.0.15ubuntu1_all.deb) ...
Selecting previously deselected package debhelper.
Unpacking debhelper (from .../debhelper_7.0.17ubuntu4_all.deb) ...
Setting up libmagic1 (4.26-2ubuntu3) ...
Setting up file (4.26-2ubuntu3) ...
Setting up bsdmainutils (6.1.10ubuntu3) ...
Setting up gettext-base (0.17-6ubuntu2) ...
Setting up groff-base (1.18.1.1-22build1) ...
Setting up libxml2 (2.6.32.dfsg-5ubuntu4) ...
Setting up man-db (2.5.5-1build1) ...
Building database of manual pages ...
... skipping, since this is a buildd
Setting up html2text (1.3.2a-5) ...
Setting up libglib2.0-0 (2.20.1-0ubuntu2) ...
Setting up libcroco3 (0.6.1-2) ...
Setting up gettext (0.17-6ubuntu2) ...
Setting up intltool-debian (0.35.0+20060710.1) ...
Setting up po-debconf (1.0.15ubuntu1) ...
Setting up debhelper (7.0.17ubuntu4) ...
Processing triggers for libc6 ...
ldconfig deferred processing now taking place
Checking correctness of source dependencies...
Toolchain package versions: libc6-dev_2.9-4ubuntu6 make_3.81-5 dpkg-dev_1.14.24ubuntu1 linux-libc-dev_2.6.28-11.41 g++-4.3_4.3.3-5ubuntu4 gcc-4.3_4.3.3-5ubuntu4 binutils_2.19.1-0ubuntu3 libstdc++6_4.3.3-5ubuntu4 libstdc++6-4.3-dev_4.3.3-5ubuntu4
------------------------------------------------------------------------------
sh: gcc: not found
dpkg-source: warning: Couldn't determine gcc system type, falling back to default (native compilation)
gpg: Signature made Wed Jun 4 04:41:10 2008 BST using DSA key ID 2EAE5D2D
gpg: Can't check signature: public key not found
dpkg-source: extracting slugimage in slugimage-0.0+r104
dpkg-source: unpacking slugimage_0.0+r104.orig.tar.gz
dpkg-source: applying /home/buildd/build-jaunty-autotest/slugimage_0.0+r104-5.diff.gz
dpkg-buildpackage: set CFLAGS to default value: -g -O2
dpkg-buildpackage: set CPPFLAGS to default value:
dpkg-buildpackage: set LDFLAGS to default value: -Wl,-Bsymbolic-functions
dpkg-buildpackage: set FFLAGS to default value: -g -O2
dpkg-buildpackage: set CXXFLAGS to default value: -g -O2
dpkg-buildpackage: source package slugimage
dpkg-buildpackage: source version 1:0.0+r104-5
dpkg-buildpackage: host architecture i386
/usr/bin/fakeroot debian/rules clean
dh clean
dh_testdir
dh_auto_clean
make[1]: Entering directory `/build/buildd/slugimage-0.0+r104'
rm -rf tests/files tests/*/*.output
make[1]: Leaving directory `/build/buildd/slugimage-0.0+r104'
dh_clean
debian/rules build
dh build
dh_testdir
dh_auto_configure
dh_auto_build
make[1]: Entering directory `/build/buildd/slugimage-0.0+r104'
make[1]: Leaving directory `/build/buildd/slugimage-0.0+r104'
dh_auto_test
make[1]: Entering directory `/build/buildd/slugimage-0.0+r104'
cd tests && ./runtests
Running test ./debian/small-kernel... ok
Running test ./debian/smaller-kernel... ok
Running test ./debian/standard... ok
Running test ./misc/large-ramdisk... ok
Running test ./misc/stock... ok
Running test ./misc/large-kernel... ok
Running test ./misc/ethaddr... ok
Running test ./slugos/large-flashdisk... ok
Running test ./slugos/standard... ok
Running test ./apex/small-kernel... ok
Running test ./apex/standard... ok
make[1]: Leaving directory `/build/buildd/slugimage-0.0+r104'
/usr/bin/fakeroot debian/rules binary
dh build
dh binary-indep --until dh_prep
dh_testroot -i
dh_prep -i
dh_install slugimage usr/bin
dh_installman slugimage.1
dh binary-indep --remaining
dh_testdir -i
dh_testroot -i
dh_installdirs -i
dh_auto_install -i
dh_installdocs -i
dh_installchangelogs -i
dh_installexamples -i
dh_installcatalogs -i
dh_installcron -i
dh_installdebconf -i
dh_installcatalogs -i
dh_installemacsen -i
dh_installifupdown -i
dh_installinfo -i
dh_installinit -i
dh_installmenu -i
dh_installmime -i
dh_installmodules -i
dh_installlogcheck -i
dh_installlogrotate -i
dh_installpam -i
dh_installppp -i
dh_installudev -i
dh_installwm -i
dh_installxfonts -i
dh_lintian -i
dh_desktop -i
dh_gconf -i
dh_icons -i
dh_perl -i
dh_pysupport -i
Traceback (most recent call last):
File "/usr/bin/pysupport-movemodules", line 9, in <module>
from hashlib import md5
File "/usr/lib/python2.6/hashlib.py", line 136, in <module>
md5 = __get_builtin_constructor('md5')
File "/usr/lib/python2.6/hashlib.py", line 63, in __get_builtin_constructor
import _md5
ImportError: No module named _md5
dh_pysupport: command returned error code 256
make: *** [binary-indep] Error 1
dpkg-buildpackage: failure: /usr/bin/fakeroot debian/rules binary gave error exit status 2
******************************************************************************
Build finished at 20090414-1456
FAILED [dpkg-buildpackage died]
Purging chroot-jaunty-autotest/build/buildd/slugimage-0.0+r104
------------------------------------------------------------------------------
/usr/bin/sudo dpkg --root=/home/buildd/build-jaunty-autotest/chroot-jaunty-autotest --purge po-debconf intltool-debian groff-base libglib2.0-0 libcroco3 libmagic1 gettext file libxml2 bsdmainutils html2text gettext-base man-db debhelper
(Reading database ... 10990 files and directories currently installed.)
Removing debhelper ...
dpkg - warning: while removing debhelper, directory `/usr/share/debhelper/autoscripts' not empty so not removed.
dpkg - warning: while removing debhelper, directory `/usr/share/debhelper' not empty so not removed.
Removing po-debconf ...
Removing intltool-debian ...
Removing gettext ...
Removing file ...
Purging configuration files for file ...
Removing html2text ...
Purging configuration files for html2text ...
Removing gettext-base ...
Removing man-db ...
Purging configuration files for man-db ...
Removing catpages as well as /var/cache/man hierarchy.
dpkg - warning: while removing man-db, directory `/usr/share/doc/man-db/examples' not empty so not removed.
dpkg - warning: while removing man-db, directory `/usr/share/doc/man-db' not empty so not removed.
dpkg - warning: while removing man-db, directory `/usr/share/man-db' not empty so not removed.
dpkg - warning: while removing man-db, directory `/usr/share/bug/man-db' not empty so not removed.
dpkg - warning: while removing man-db, directory `/usr/lib/man-db' not empty so not removed.
Removing groff-base ...
Purging configuration files for groff-base ...
Removing libcroco3 ...
Purging configuration files for libcroco3 ...
Removing libmagic1 ...
Purging configuration files for libmagic1 ...
Removing libxml2 ...
Purging configuration files for libxml2 ...
Removing bsdmainutils ...
Purging configuration files for bsdmainutils ...
Removing libglib2.0-0 ...
Purging configuration files for libglib2.0-0 ...
Processing triggers for libc6 ...
ldconfig deferred processing now taking place
******************************************************************************
Finished at 20090414-1456
Build needed 00:00:11, 308k disk space
More information about the ubuntu-autotest
mailing list