Log for failed build of linux86_0.16.17-3ubuntu1 (dist=jaunty-autotest)

Build Daemon user noreply at buildd.ubuntu.com
Fri Apr 10 10:25:32 BST 2009


Automatic build of linux86_0.16.17-3ubuntu1 on royal by sbuild/powerpc 1.170.5
Build started at 20090410-1025
******************************************************************************
Checking available source versions...
Fetching source files...
Reading package lists...
Building dependency tree...
Reading state information...
Need to get 715kB of source archives.
Get:1 http://archive.internal jaunty-autotest/main linux86 0.16.17-3ubuntu1 (dsc) [1054B]
Get:2 http://archive.internal jaunty-autotest/main linux86 0.16.17-3ubuntu1 (tar) [703kB]
Get:3 http://archive.internal jaunty-autotest/main linux86 0.16.17-3ubuntu1 (diff) [10.9kB]
Fetched 715kB in 0s (12.8MB/s)
Download complete and in download only mode
------------------------------------------------------------------------------
dpkg-source: extracting linux86 in linux86-0.16.17
dpkg-source: unpacking linux86_0.16.17.orig.tar.gz
dpkg-source: applying /srv/royal.buildd/home/buildd/build-jaunty-autotest/linux86_0.16.17-3ubuntu1.diff.gz
dpkg-buildpackage: set CFLAGS to default value: -g -O2
dpkg-buildpackage: set CPPFLAGS to default value: 
dpkg-buildpackage: set LDFLAGS to default value: -Wl,-Bsymbolic-functions
dpkg-buildpackage: set FFLAGS to default value: -g -O2
dpkg-buildpackage: set CXXFLAGS to default value: -g -O2
dpkg-buildpackage: source package linux86
dpkg-buildpackage: source version 0.16.17-3ubuntu1
dpkg-buildpackage: host architecture powerpc
 /usr/bin/fakeroot debian/rules clean
rm -f build
make realclean
make[1]: Entering directory `/build/buildd/linux86-0.16.17'
make[2]: Entering directory `/build/buildd/linux86-0.16.17'
[ ! -f make.fil ] || make -f make.fil VERSION=0.16.17 TOPDIR=`pwd` realclean
rm -f make.fil ifdef ifdef.o
make[2]: Leaving directory `/build/buildd/linux86-0.16.17'
make[1]: Leaving directory `/build/buildd/linux86-0.16.17'
rm -f ld/ar.h
rm -rf debian/tmp*
rm -f debian/files debian/substvars
 debian/rules build
make all LIBPRE=/usr/ < /dev/null
make[1]: Entering directory `/build/buildd/linux86-0.16.17'
make[2]: Entering directory `/build/buildd/linux86-0.16.17'
cc  -O -DGNUMAKE -c ifdef.c
cc  -Wl,-Bsymbolic-functions -o ifdef ifdef.o
./ifdef -MU makefile.in >tmp.mak
echo > tmp.sed
[ "/usr/bin" != "//bin" ] || echo >> tmp.sed "s:%BINDIR%:/bin:"
[ "/usr/lib/bcc" != "//lib/bcc" ] || echo >> tmp.sed "s:%LIBDIR%:/lib:"
[ "/usr/lib/bcc" != "//lib/bcc" ] || echo >> tmp.sed "s:%INCLDIR%:/usr:"
[ "/usr/bin" != "//bin" ] || echo >> tmp.sed "s:%ASLDDIR%:/bin:"
[ "/usr/man" != "//man" ] || echo >> tmp.sed "s:%MANDIR%:/usr/man:"
echo >> tmp.sed "s:%PREFIX%:/usr:"
echo >> tmp.sed "s:%BINDIR%:/usr/bin:"
echo >> tmp.sed "s:%INCLDIR%:/usr/lib/bcc:"
echo >> tmp.sed "s:%LIBDIR%:/usr/lib/bcc:"
echo >> tmp.sed "s:%ASLDDIR%:/usr/bin:"
echo >> tmp.sed "s:%MANDIR%:/usr/man:"
echo >> tmp.sed "s:%ELKSSRC%:/usr/src/elks:"
echo >> tmp.sed "s:%CC%:cc:"
echo >> tmp.sed "s:%CFLAGS%:-O:"
echo >> tmp.sed "s:%LDFLAGS%:-Wl,-Bsymbolic-functions:"
sed -f tmp.sed < tmp.mak > make.tmp
mv -f make.tmp make.fil
PATH="`pwd`/bin:$PATH" make -f make.fil VERSION=0.16.17 TOPDIR=`pwd` all
make[3]: Entering directory `/build/buildd/linux86-0.16.17'
make -C libc .config.dir
make[4]: Entering directory `/build/buildd/linux86-0.16.17/libc'
sh Config_sh
Using default configuration
make[4]: Leaving directory `/build/buildd/linux86-0.16.17/libc'
echo '#define VERSION "'"0.16.17"'"' > bcc/version.h
VER=0.16.17 ; \
	echo "#define VER_MAJ ${VER%%.*}" >> bcc/version.h ; \
	VER="${VER#*.}" ; \
	echo "#define VER_MIN ${VER%.*}" >> bcc/version.h ; \
	echo "#define VER_PAT ${VER#*.}" >> bcc/version.h 
make -C bcc CC='cc' CFLAGS=' -Wall -Wstrict-prototypes -O2 -g' LDFLAGS='' PREFIX=/usr LIBDIR='/usr/lib/bcc' BINDIR='/usr/bin' ANSI='' BCCARCH='' bcc ncc bcc-cc1
make[4]: Entering directory `/build/buildd/linux86-0.16.17/bcc'
cc  -Wall -Wstrict-prototypes -O2 -g  -DLOCALPREFIX=/usr -DBINDIR=/usr/bin -DDEFARCH=0 bcc.c -o bcc
cc  -Wall -Wstrict-prototypes -O2 -g  -DLOCALPREFIX= -DDEFARCH=0 bcc.c -o ncc
cc  -Wall -Wstrict-prototypes -O2 -g -c bcc-cc1.c
cc  -Wall -Wstrict-prototypes -O2 -g -c codefrag.c
cc  -Wall -Wstrict-prototypes -O2 -g -c dbnode.c
cc  -Wall -Wstrict-prototypes -O2 -g -c declare.c
cc  -Wall -Wstrict-prototypes -O2 -g -c express.c
express.c:23: warning: conflicting types for built-in function 'exp2'
cc  -Wall -Wstrict-prototypes -O2 -g -c exptree.c
cc  -Wall -Wstrict-prototypes -O2 -g -c floatop.c
floatop.c: In function 'f_indirect':
floatop.c:33: warning: dereferencing type-punned pointer will break strict-aliasing rules
floatop.c:48: warning: dereferencing type-punned pointer will break strict-aliasing rules
cc  -Wall -Wstrict-prototypes -O2 -g -c function.c
cc  -Wall -Wstrict-prototypes -O2 -g -c gencode.c
cc  -Wall -Wstrict-prototypes -O2 -g -c genloads.c
genloads.c: In function 'load':
genloads.c:391: warning: dereferencing type-punned pointer will break strict-aliasing rules
genloads.c:395: warning: dereferencing type-punned pointer will break strict-aliasing rules
cc  -Wall -Wstrict-prototypes -O2 -g -c glogcode.c
cc  -Wall -Wstrict-prototypes -O2 -g -c hardop.c
cc  -Wall -Wstrict-prototypes -O2 -g -c input.c
input.c: In function 'inputinit':
input.c:400: warning: array subscript is below array bounds
cc  -Wall -Wstrict-prototypes -O2 -g -c label.c
cc  -Wall -Wstrict-prototypes -O2 -g -c loadexp.c
loadexp.c: In function 'initexpression':
loadexp.c:79: warning: dereferencing type-punned pointer will break strict-aliasing rules
cc  -Wall -Wstrict-prototypes -O2 -g -c longop.c
cc  -Wall -Wstrict-prototypes -O2 -g -c output.c
output.c: In function 'flushout':
output.c:220: warning: ignoring return value of 'write', declared with attribute warn_unused_result
cc  -Wall -Wstrict-prototypes -O2 -g -c preproc.c
cc  -Wall -Wstrict-prototypes -O2 -g -c preserve.c
cc  -Wall -Wstrict-prototypes -O2 -g -c scan.c
cc  -Wall -Wstrict-prototypes -O2 -g -c softop.c
cc  -Wall -Wstrict-prototypes -O2 -g -c state.c
cc  -Wall -Wstrict-prototypes -O2 -g -c table.c
cc  -Wall -Wstrict-prototypes -O2 -g -c type.c
cc  -Wall -Wstrict-prototypes -O2 -g -c assign.c
cc  -Wall -Wstrict-prototypes -O2 -g -c hashcmd.c
cc   -Wall -Wstrict-prototypes -O2 -g -c debug.c
debug.c:93: warning: 'ident' defined but not used
cc   -Wall -Wstrict-prototypes -O2 -g -c dbprintf.c
dbprintf.c: In function 'dbprintf':
dbprintf.c:24: warning: implicit declaration of function 'vdbprintf'
dbprintf.c: In function 'putch':
dbprintf.c:30: warning: implicit declaration of function 'write'
dbprintf.c: At top level:
dbprintf.c:34: warning: function declaration isn't a prototype
dbprintf.c: In function 'vdbprintf':
dbprintf.c:45: warning: suggest parentheses around assignment used as truth value
dbprintf.c:104: warning: pointer targets in assignment differ in signedness
dbprintf.c:110: warning: implicit declaration of function 'strlen'
dbprintf.c:110: warning: incompatible implicit declaration of built-in function 'strlen'
cc   bcc-cc1.o codefrag.o dbnode.o declare.o express.o exptree.o floatop.o function.o gencode.o genloads.o glogcode.o hardop.o input.o label.o loadexp.o longop.o output.o preproc.o preserve.o scan.o softop.o state.o table.o type.o assign.o hashcmd.o debug.o dbprintf.o -o bcc-cc1
make[4]: Leaving directory `/build/buildd/linux86-0.16.17/bcc'
cp -p bcc/bcc bin/Bcc
cp -p bcc/ncc bin/ncc
cp -p bcc/bcc-cc1 lib/bcc-cc1
make -C cpp CC='cc' CFLAGS=' -Wall -Wstrict-prototypes -O2 -g' LDFLAGS='' PREFIX=/usr LIBDIR='/usr/lib/bcc' BINDIR='/usr/bin' ANSI='' bcc-cpp
make[4]: Entering directory `/build/buildd/linux86-0.16.17/cpp'
cc -Wall -Wstrict-prototypes -O2 -g   -c -o main.o main.c
cc -Wall -Wstrict-prototypes -O2 -g   -c -o cpp.o cpp.c
cc -Wall -Wstrict-prototypes -O2 -g   -c -o hash.o hash.c
cc -Wall -Wstrict-prototypes -O2 -g   -c -o token1.o token1.c
cc -Wall -Wstrict-prototypes -O2 -g   -c -o token2.o token2.c
cc -Wall -Wstrict-prototypes -O2 -g -o bcc-cpp main.o cpp.o hash.o token1.o token2.o
make[4]: Leaving directory `/build/buildd/linux86-0.16.17/cpp'
cp -p cpp/bcc-cpp lib/bcc-cpp
make -C unproto CC='cc' CFLAGS=' -Wall -Wstrict-prototypes -O2 -g' LDFLAGS='' PREFIX=/usr LIBDIR='/usr/lib/bcc' BINDIR='/usr/bin' ANSI='' unproto
make[4]: Entering directory `/build/buildd/linux86-0.16.17/unproto'
cc -Wall -Wstrict-prototypes -O2 -g -w      -DREOPEN -c tok_io.c -o tok_io.o
cc -Wall -Wstrict-prototypes -O2 -g -w      -DREOPEN -c tok_class.c -o tok_class.o
cc -Wall -Wstrict-prototypes -O2 -g -w      -DREOPEN -c tok_pool.c -o tok_pool.o
cc -Wall -Wstrict-prototypes -O2 -g -w      -DREOPEN -c unproto.c -o unproto.o
cc -Wall -Wstrict-prototypes -O2 -g -w      -DREOPEN -c vstring.c -o vstring.o
cc -Wall -Wstrict-prototypes -O2 -g -w      -DREOPEN -c symbol.c -o symbol.o
cc -Wall -Wstrict-prototypes -O2 -g -w      -DREOPEN -c error.c -o error.o
cc -Wall -Wstrict-prototypes -O2 -g -w      -DREOPEN -c hash.c -o hash.o
cc -Wall -Wstrict-prototypes -O2 -g -w      -DREOPEN -c strsave.c -o strsave.o
cc -Wall -Wstrict-prototypes -O2 -g -w      -DREOPEN  -o unproto tok_io.o tok_class.o tok_pool.o unproto.o vstring.o symbol.o error.o hash.o strsave.o 
make[4]: Leaving directory `/build/buildd/linux86-0.16.17/unproto'
cp -p unproto/unproto lib/unproto
make -C copt CC='cc' CFLAGS=' -Wall -Wstrict-prototypes -O2 -g' LDFLAGS='' PREFIX=/usr LIBDIR='/usr/lib/bcc' BINDIR='/usr/bin' ANSI='' copt
make[4]: Entering directory `/build/buildd/linux86-0.16.17/copt'
cc  -Wall -Wstrict-prototypes -O2 -g  -o copt copt.c
copt.c: In function 'writeoutf':
copt.c:806: warning: format not a string literal and no format arguments
make[4]: Leaving directory `/build/buildd/linux86-0.16.17/copt'
cp -p copt/copt lib/copt
cp -p copt/rules.* lib/.
cp -p copt/rules.start lib/i386/.
cp -p copt/rules.386 lib/i386/.
cp -p copt/rules.end lib/i386/.
echo '#define VERSION "'"0.16.17"'"' > as/version.h
make -C as CC='cc' CFLAGS=' -Wall -Wstrict-prototypes -O2 -g' LDFLAGS='' PREFIX=/usr LIBDIR='/usr/lib/bcc' BINDIR='/usr/bin' ANSI='' all
make[4]: Entering directory `/build/buildd/linux86-0.16.17/as'
cc -Wall -Wstrict-prototypes -O2 -g -c as.c
as.c: In function 'as_abort':
as.c:68: warning: ignoring return value of 'write', declared with attribute warn_unused_result
as.c:69: warning: ignoring return value of 'write', declared with attribute warn_unused_result
as.c:70: warning: ignoring return value of 'write', declared with attribute warn_unused_result
cc -Wall -Wstrict-prototypes -O2 -g -c assemble.c
cc -Wall -Wstrict-prototypes -O2 -g -c errors.c
cc -Wall -Wstrict-prototypes -O2 -g -c express.c
cc -Wall -Wstrict-prototypes -O2 -g -c genbin.c
cc -Wall -Wstrict-prototypes -O2 -g -c genlist.c
genlist.c: In function 'list1':
genlist.c:197: warning: ignoring return value of 'write', declared with attribute warn_unused_result
genlist.c: In function 'writec':
genlist.c:432: warning: ignoring return value of 'write', declared with attribute warn_unused_result
genlist.c: In function 'writeoff':
genlist.c:454: warning: ignoring return value of 'write', declared with attribute warn_unused_result
genlist.c: In function 'writes':
genlist.c:462: warning: ignoring return value of 'write', declared with attribute warn_unused_result
genlist.c: In function 'writew':
genlist.c:482: warning: ignoring return value of 'write', declared with attribute warn_unused_result
cc -Wall -Wstrict-prototypes -O2 -g -c genobj.c
cc -Wall -Wstrict-prototypes -O2 -g -c gensym.c
gensym.c: In function 'gensym':
gensym.c:95: warning: ignoring return value of 'write', declared with attribute warn_unused_result
cc -Wall -Wstrict-prototypes -O2 -g -c keywords.c
cc -Wall -Wstrict-prototypes -O2 -g -c macro.c
cc -Wall -Wstrict-prototypes -O2 -g -c mops.c
cc -Wall -Wstrict-prototypes -O2 -g -c pops.c
cc -Wall -Wstrict-prototypes -O2 -g -c readsrc.c
cc -Wall -Wstrict-prototypes -O2 -g -c scan.c
cc -Wall -Wstrict-prototypes -O2 -g -c table.c
cc -Wall -Wstrict-prototypes -O2 -g -c typeconv.c
typeconv.c: In function 'xxerr':
typeconv.c:14: warning: ignoring return value of 'write', declared with attribute warn_unused_result
cc -Wall -Wstrict-prototypes -O2 -g -c alloc.c
cc  as.o assemble.o errors.o express.o genbin.o genlist.o genobj.o gensym.o keywords.o macro.o mops.o pops.o readsrc.o scan.o table.o typeconv.o alloc.o -o as86
sed -e "s:%%LIBDIR%%:/usr/lib/bcc:" -e "s:%%BINDIR%%:/usr/bin:" \
		< as86_encap.sh > tmp
chmod +x as86_encap
make[4]: Leaving directory `/build/buildd/linux86-0.16.17/as'
cp -p as/as86 bin/as86
cp -p as/as86_encap bin/as86_encap
make -C ar CC='cc' CFLAGS=' -Wall -Wstrict-prototypes -O2 -g' LDFLAGS='' PREFIX=/usr LIBDIR='/usr/lib/bcc' BINDIR='/usr/bin' ANSI='' all
make[4]: Entering directory `/build/buildd/linux86-0.16.17/ar'
test -f ar.h || \
	{ rm -f ar.h ; ln -s ../libc/include/ar.h . ; } || \
	ln ../libc/include/ar.h .
test -f rel_aout.h || \
	{ rm -f rel_aout.h ; ln -s ../ld/rel_aout.h . ; } || \
	ln ../ld/rel_aout.h .
cc -Wall -Wstrict-prototypes -O2 -g  -c ar.c -o ar.o
ar.c: In function 'copy_out_member':
ar.c:1177: warning: ignoring return value of 'read', declared with attribute warn_unused_result
ar.c: In function 'write_symdef_member':
ar.c:1565: warning: ignoring return value of 'write', declared with attribute warn_unused_result
ar.c: In function 'error_with_file':
ar.c:2039: warning: format not a string literal and no format arguments
cc -Wall -Wstrict-prototypes -O2 -g  -c alloca.c -o alloca.o
cc  ar.o alloca.o -o ar86
make[4]: Leaving directory `/build/buildd/linux86-0.16.17/ar'
cp -p ar/ar86 bin/ar86
echo '#define VERSION "'"0.16.17"'"' > ld/version.h
make -C ld CC='cc' CFLAGS=' -Wall -Wstrict-prototypes -O2 -g' LDFLAGS='' PREFIX=/usr LIBDIR='/usr/lib/bcc' BINDIR='/usr/bin' ANSI='' ld86
make[4]: Entering directory `/build/buildd/linux86-0.16.17/ld'
test -f ar.h || \
	{ rm -f ar.h ; ln -s ../libc/include/ar.h . ; } || \
	ln ../libc/include/ar.h .
cc -Wall -Wstrict-prototypes -O2 -g -DREL_OUTPUT -c dumps.c -o dumps.o
dumps.c: In function 'dumpmods':
dumps.c:22: warning: implicit declaration of function 'memcmp'
dumps.c:25: warning: implicit declaration of function 'strlen'
dumps.c:25: warning: incompatible implicit declaration of built-in function 'strlen'
cc -Wall -Wstrict-prototypes -O2 -g -DREL_OUTPUT -c io.c -o io.o
io.c: In function 'flusherr':
io.c:142: warning: ignoring return value of 'write', declared with attribute warn_unused_result
cc -Wall -Wstrict-prototypes -O2 -g -DREL_OUTPUT -c ld.c -o ld.o
ld.c: In function 'main':
ld.c:223: warning: implicit declaration of function 'ld86r'
cc -Wall -Wstrict-prototypes -O2 -g -DREL_OUTPUT -c readobj.c -o readobj.o
cc -Wall -Wstrict-prototypes -O2 -g -DREL_OUTPUT -c table.c -o table.o
cc -Wall -Wstrict-prototypes -O2 -g -DREL_OUTPUT -c typeconv.c -o typeconv.o
typeconv.c: In function 'xxerr':
typeconv.c:14: warning: ignoring return value of 'write', declared with attribute warn_unused_result
cc -Wall -Wstrict-prototypes -O2 -g -DREL_OUTPUT -c linksyms.c -o linksyms.o
cc -Wall -Wstrict-prototypes -O2 -g -DREL_OUTPUT -c mkar.c -o mkar.o
mkar.c: In function 'ld86r':
mkar.c:41: warning: implicit declaration of function 'fatalerror'
cc -Wall -Wstrict-prototypes -O2 -g -DREL_OUTPUT -c writex86.c -o writex86.o
cc -Wall -Wstrict-prototypes -O2 -g -DREL_OUTPUT  -c writebin.c
writebin.c: In function 'writebin':
writebin.c:1062: warning: ignoring return value of 'write', declared with attribute warn_unused_result
cc -Wall -Wstrict-prototypes -O2 -g -DREL_OUTPUT -c writeemu.c -o writeemu.o
cc  dumps.o io.o ld.o readobj.o table.o typeconv.o linksyms.o mkar.o writex86.o writebin.o writeemu.o -o ld86
make[4]: Leaving directory `/build/buildd/linux86-0.16.17/ld'
cp -p ld/ld86 bin/ld86
make -C ld CC='cc' CFLAGS=' -Wall -Wstrict-prototypes -O2 -g' LDFLAGS='' PREFIX=/usr LIBDIR='/usr/lib/bcc' BINDIR='/usr/bin' ANSI='' objdump86
make[4]: Entering directory `/build/buildd/linux86-0.16.17/ld'
cc -Wall -Wstrict-prototypes -O2 -g    objdump86.c   -o objdump86
objdump86.c: In function 'do_module':
objdump86.c:240: warning: ignoring return value of 'fread', declared with attribute warn_unused_result
make[4]: Leaving directory `/build/buildd/linux86-0.16.17/ld'
cp -p ld/objdump86 bin/objdump86
test -f bin/ncc
make -C libc CC=ncc "CCFLAGS=-O" AR=ar86 ARFLAGS=r PLATFORM=i86-ELKS
make[4]: Entering directory `/build/buildd/linux86-0.16.17/libc'
ncc -c -Mn -O -D__LIBC__ -D__LIBC_VER__='"0.16.17"' -o crt0.o crt0.c
*** buffer overflow detected ***: ncc terminated
======= Backtrace: =========
/lib/libc.so.6(__fortify_fail+0x6c)[0xff7c0ec]
/lib/libc.so.6[0xff79598]
/lib/libc.so.6[0xff79ef4]
ncc[0x1000128c]
ncc[0x10003908]
/lib/libc.so.6[0xfe93be4]
/lib/libc.so.6[0xfe93da0]
======= Memory map: ========
00100000-00103000 r-xp 00100000 00:00 0 
0fe75000-0ffd9000 r-xp 00000000 09:00 2510120                            /lib/libc-2.9.so
0ffd9000-0ffe8000 ---p 00164000 09:00 2510120                            /lib/libc-2.9.so
0ffe8000-0ffec000 r--p 00163000 09:00 2510120                            /lib/libc-2.9.so
0ffec000-0ffed000 rw-p 00167000 09:00 2510120                            /lib/libc-2.9.so
0ffed000-0fff0000 rw-p 0ffed000 00:00 0 
10000000-10005000 r-xp 00000000 09:00 2771060                            /build/buildd/linux86-0.16.17/bin/ncc
10014000-10015000 r--p 00004000 09:00 2771060                            /build/buildd/linux86-0.16.17/bin/ncc
10015000-10016000 rw-p 00005000 09:00 2771060                            /build/buildd/linux86-0.16.17/bin/ncc
10016000-10037000 rwxp 10016000 00:00 0                                  [heap]
40000000-4001f000 r-xp 00000000 09:00 2510117                            /lib/ld-2.9.so
4001f000-40020000 rw-p 4001f000 00:00 0 
40023000-40025000 rw-p 40023000 00:00 0 
4002f000-40030000 r--p 0001f000 09:00 2510117                            /lib/ld-2.9.so
40030000-40031000 rw-p 00020000 09:00 2510117                            /lib/ld-2.9.so
ff7f4000-ff809000 rw-p ff7f4000 00:00 0                                  [stack]
make[4]: *** [crt0.o] Aborted
make[4]: Leaving directory `/build/buildd/linux86-0.16.17/libc'
make[3]: *** [library] Error 2
make[3]: Leaving directory `/build/buildd/linux86-0.16.17'
make[2]: *** [all] Error 2
make[2]: Leaving directory `/build/buildd/linux86-0.16.17'
make[1]: *** [all] Error 2
make[1]: Leaving directory `/build/buildd/linux86-0.16.17'
make: *** [build] Error 2
dpkg-buildpackage: failure: debian/rules build gave error exit status 2
******************************************************************************
Build finished at 20090410-1025
FAILED [dpkg-buildpackage died]
Purging chroot-jaunty-autotest/build/buildd/linux86-0.16.17
------------------------------------------------------------------------------
******************************************************************************
Finished at 20090410-1025
Build needed 00:00:28, 8252k disk space




More information about the ubuntu-autotest mailing list