Log for failed build of python-debian_0.1.12ubuntu1 (dist=jaunty-autotest)

Build Daemon user noreply at buildd.ubuntu.com
Fri Apr 10 07:02:18 BST 2009


Automatic build of python-debian_0.1.12ubuntu1 on terranova by sbuild/i386 1.170.5
Build started at 20090410-0702
******************************************************************************
Checking available source versions...
Fetching source files...
Reading package lists...
Building dependency tree...
Reading state information...
NOTICE: 'python-debian' packaging is maintained in the 'Git' version control system at:
git://git.debian.org/git/pkg-python-debian/python-debian.git
Need to get 213kB of source archives.
Get:1 http://archive.internal jaunty-autotest/main python-debian 0.1.12ubuntu1 (dsc) [1363B]
Get:2 http://archive.internal jaunty-autotest/main python-debian 0.1.12ubuntu1 (tar) [212kB]
Fetched 213kB in 0s (12.0MB/s)
Download complete and in download only mode
** Using build dependencies supplied by package:
Build-Depends: debhelper (>= 5.0.37.2), python
Build-Depends-Indep: python-support (>= 0.3)
Checking for already installed source dependencies...
debhelper: missing
python: missing
python-support: missing
Checking for source dependency conflicts...
  /usr/bin/sudo /usr/bin/apt-get --purge $CHROOT_OPTIONS -q -y install debhelper python python-support
Reading package lists...
Building dependency tree...
Reading state information...
The following extra packages will be installed:
  bsdmainutils file gettext gettext-base groff-base html2text intltool-debian
  libcroco3 libglib2.0-0 libmagic1 libncursesw5 libreadline5 libsqlite3-0
  libssl0.9.8 libxml2 man-db mime-support po-debconf python2.6 readline-common
Suggested packages:
  wamerican wordlist whois vacation dh-make cvs gettext-doc groff less
  www-browser libmail-box-perl python-doc python-tk python-profiler
  python2.6-doc python2.6-profiler
Recommended packages:
  curl wget lynx libglib2.0-data shared-mime-info libgpm2 xml-core
  libmail-sendmail-perl libcompress-zlib-perl
The following NEW packages will be installed:
  bsdmainutils debhelper file gettext gettext-base groff-base html2text
  intltool-debian libcroco3 libglib2.0-0 libmagic1 libncursesw5 libreadline5
  libsqlite3-0 libssl0.9.8 libxml2 man-db mime-support po-debconf python
  python-support python2.6 readline-common
0 upgraded, 23 newly installed, 0 to remove and 0 not upgraded.
Need to get 0B/14.4MB of archives.
After this operation, 43.1MB of additional disk space will be used.
WARNING: The following packages cannot be authenticated!
  libmagic1 file libncursesw5 readline-common libreadline5 libsqlite3-0
  libssl0.9.8 mime-support python2.6 python bsdmainutils gettext-base
  groff-base libxml2 man-db python-support html2text libglib2.0-0 libcroco3
  gettext intltool-debian po-debconf debhelper
debconf: unable to initialize frontend: Dialog
debconf: (Dialog frontend will not work on a dumb terminal, an emacs shell buffer, or without a controlling terminal.)
debconf: falling back to frontend: Readline
debconf: unable to initialize frontend: Readline
debconf: (This frontend requires a controlling tty.)
debconf: falling back to frontend: Teletype
dpkg-preconfigure: unable to re-open stdin: 
Authentication warning overridden.
Selecting previously deselected package libmagic1.
(Reading database ... 9820 files and directories currently installed.)
Unpacking libmagic1 (from .../libmagic1_4.26-2ubuntu3_i386.deb) ...
Selecting previously deselected package file.
Unpacking file (from .../file_4.26-2ubuntu3_i386.deb) ...
Selecting previously deselected package libncursesw5.
Unpacking libncursesw5 (from .../libncursesw5_5.7+20090207-1ubuntu1_i386.deb) ...
Selecting previously deselected package readline-common.
Unpacking readline-common (from .../readline-common_5.2-4_all.deb) ...
Selecting previously deselected package libreadline5.
Unpacking libreadline5 (from .../libreadline5_5.2-4_i386.deb) ...
Selecting previously deselected package libsqlite3-0.
Unpacking libsqlite3-0 (from .../libsqlite3-0_3.6.10-1_i386.deb) ...
Selecting previously deselected package libssl0.9.8.
Unpacking libssl0.9.8 (from .../libssl0.9.8_0.9.8g-15ubuntu3_i386.deb) ...
Selecting previously deselected package mime-support.
Unpacking mime-support (from .../mime-support_3.44-1_all.deb) ...
Selecting previously deselected package python2.6.
Unpacking python2.6 (from .../python2.6_2.6.2~rc1-0ubuntu1_i386.deb) ...
Selecting previously deselected package python.
Unpacking python (from .../python_2.6.1-0ubuntu9_all.deb) ...
Selecting previously deselected package bsdmainutils.
Unpacking bsdmainutils (from .../bsdmainutils_6.1.10ubuntu3_i386.deb) ...
Selecting previously deselected package gettext-base.
Unpacking gettext-base (from .../gettext-base_0.17-6ubuntu2_i386.deb) ...
Selecting previously deselected package groff-base.
Unpacking groff-base (from .../groff-base_1.18.1.1-22build1_i386.deb) ...
Selecting previously deselected package libxml2.
Unpacking libxml2 (from .../libxml2_2.6.32.dfsg-5ubuntu4_i386.deb) ...
Selecting previously deselected package man-db.
Unpacking man-db (from .../man-db_2.5.5-1build1_i386.deb) ...
Selecting previously deselected package python-support.
Unpacking python-support (from .../python-support_0.8.7ubuntu3_all.deb) ...
Selecting previously deselected package html2text.
Unpacking html2text (from .../html2text_1.3.2a-5_i386.deb) ...
Selecting previously deselected package libglib2.0-0.
Unpacking libglib2.0-0 (from .../libglib2.0-0_2.20.0-1build2_i386.deb) ...
Selecting previously deselected package libcroco3.
Unpacking libcroco3 (from .../libcroco3_0.6.1-2_i386.deb) ...
Selecting previously deselected package gettext.
Unpacking gettext (from .../gettext_0.17-6ubuntu2_i386.deb) ...
Selecting previously deselected package intltool-debian.
Unpacking intltool-debian (from .../intltool-debian_0.35.0+20060710.1_all.deb) ...
Selecting previously deselected package po-debconf.
Unpacking po-debconf (from .../po-debconf_1.0.15ubuntu1_all.deb) ...
Selecting previously deselected package debhelper.
Unpacking debhelper (from .../debhelper_7.0.17ubuntu4_all.deb) ...
Setting up libmagic1 (4.26-2ubuntu3) ...

Setting up file (4.26-2ubuntu3) ...
Setting up libncursesw5 (5.7+20090207-1ubuntu1) ...

Setting up readline-common (5.2-4) ...

Setting up libreadline5 (5.2-4) ...

Setting up libsqlite3-0 (3.6.10-1) ...

Setting up libssl0.9.8 (0.9.8g-15ubuntu3) ...

Setting up mime-support (3.44-1) ...

Setting up python2.6 (2.6.2~rc1-0ubuntu1) ...

Setting up python (2.6.1-0ubuntu9) ...

Setting up bsdmainutils (6.1.10ubuntu3) ...

Setting up gettext-base (0.17-6ubuntu2) ...

Setting up groff-base (1.18.1.1-22build1) ...

Setting up libxml2 (2.6.32.dfsg-5ubuntu4) ...

Setting up man-db (2.5.5-1build1) ...
Building database of manual pages ...
... skipping, since this is a buildd

Setting up python-support (0.8.7ubuntu3) ...

Setting up html2text (1.3.2a-5) ...

Setting up libglib2.0-0 (2.20.0-1build2) ...

Setting up libcroco3 (0.6.1-2) ...

Setting up gettext (0.17-6ubuntu2) ...

Setting up intltool-debian (0.35.0+20060710.1) ...
Setting up po-debconf (1.0.15ubuntu1) ...

Setting up debhelper (7.0.17ubuntu4) ...

Processing triggers for libc6 ...
ldconfig deferred processing now taking place
Checking correctness of source dependencies...
Toolchain package versions: libc6-dev_2.9-4ubuntu6 make_3.81-5 dpkg-dev_1.14.24ubuntu1 linux-libc-dev_2.6.28-11.41 g++-4.3_4.3.3-5ubuntu4 gcc-4.3_4.3.3-5ubuntu4 binutils_2.19.1-0ubuntu3 libstdc++6_4.3.3-5ubuntu4 libstdc++6-4.3-dev_4.3.3-5ubuntu4
------------------------------------------------------------------------------
sh: gcc: not found
dpkg-source: warning: Couldn't determine gcc system type, falling back to default (native compilation)
gpg: Signature made Fri Mar  6 01:00:25 2009 GMT using DSA key ID 17063E6D
gpg: Can't check signature: public key not found
dpkg-source: extracting python-debian in python-debian-0.1.12ubuntu1
dpkg-source: unpacking python-debian_0.1.12ubuntu1.tar.gz
dpkg-buildpackage: set CFLAGS to default value: -g -O2
dpkg-buildpackage: set CPPFLAGS to default value: 
dpkg-buildpackage: set LDFLAGS to default value: -Wl,-Bsymbolic-functions
dpkg-buildpackage: set FFLAGS to default value: -g -O2
dpkg-buildpackage: set CXXFLAGS to default value: -g -O2
dpkg-buildpackage: source package python-debian
dpkg-buildpackage: source version 0.1.12ubuntu1
dpkg-buildpackage: host architecture i386
 /usr/bin/fakeroot debian/rules clean
sed -e 's/__CHANGELOG_VERSION__/0.1.12ubuntu1/' < setup.py.in > setup.py
dh_testdir
dh_testroot
rm -f build-stamp
# Add here commands to clean up after the build process.
python setup.py clean
running clean
rm -rf build/
rm -f README.debtags
rm -f setup.py
dh_clean
 debian/rules build
sed -e 's/__CHANGELOG_VERSION__/0.1.12ubuntu1/' < setup.py.in > setup.py
dh_testdir
# Add here commands to compile the package.
python setup.py build
running build
running build_py
creating build
creating build/lib.linux-i686-2.6
copying deb822.py -> build/lib.linux-i686-2.6
creating build/lib.linux-i686-2.6/debian_bundle
copying debian_bundle/debfile.py -> build/lib.linux-i686-2.6/debian_bundle
copying debian_bundle/__init__.py -> build/lib.linux-i686-2.6/debian_bundle
copying debian_bundle/changelog.py -> build/lib.linux-i686-2.6/debian_bundle
copying debian_bundle/debian_support.py -> build/lib.linux-i686-2.6/debian_bundle
copying debian_bundle/deb822.py -> build/lib.linux-i686-2.6/debian_bundle
copying debian_bundle/arfile.py -> build/lib.linux-i686-2.6/debian_bundle
copying debian_bundle/debtags.py -> build/lib.linux-i686-2.6/debian_bundle
# run the tests
cd tests && \
		for f in deb822 debfile debtags; do \
			./test_$f.py ; \
		done 
../debian_bundle/deb822.py:1039: DeprecationWarning: object.__init__() takes no parameters
  str.__init__(self, str_)
....................................
----------------------------------------------------------------------
Ran 36 tests in 0.123s

OK
Traceback (most recent call last):
  File "./test_debfile.py", line 31, in <module>
    import debfile
  File "../debian_bundle/debfile.py", line 24, in <module>
    from changelog import Changelog
  File "../debian_bundle/changelog.py", line 30, in <module>
    import debian_support
  File "../debian_bundle/debian_support.py", line 25, in <module>
    import apt_pkg
ImportError: No module named apt_pkg
...
----------------------------------------------------------------------
Ran 3 tests in 0.006s

OK
#python debian_bundle/python_support.py
debian_bundle/doc-debtags > README.debtags
touch build-stamp
 /usr/bin/fakeroot debian/rules binary
dh_testdir
dh_testroot
dh_clean
dh_installdirs
# Add here commands to install the package into debian/tmp
python setup.py install --root="/build/buildd/python-debian-0.1.12ubuntu1/debian/python-debian" --no-compile
running install
running build
running build_py
running install_lib
creating /build/buildd/python-debian-0.1.12ubuntu1/debian/python-debian/usr
creating /build/buildd/python-debian-0.1.12ubuntu1/debian/python-debian/usr/local
creating /build/buildd/python-debian-0.1.12ubuntu1/debian/python-debian/usr/local/lib
creating /build/buildd/python-debian-0.1.12ubuntu1/debian/python-debian/usr/local/lib/python2.6
creating /build/buildd/python-debian-0.1.12ubuntu1/debian/python-debian/usr/local/lib/python2.6/dist-packages
copying build/lib.linux-i686-2.6/deb822.py -> /build/buildd/python-debian-0.1.12ubuntu1/debian/python-debian/usr/local/lib/python2.6/dist-packages
creating /build/buildd/python-debian-0.1.12ubuntu1/debian/python-debian/usr/local/lib/python2.6/dist-packages/debian_bundle
copying build/lib.linux-i686-2.6/debian_bundle/debfile.py -> /build/buildd/python-debian-0.1.12ubuntu1/debian/python-debian/usr/local/lib/python2.6/dist-packages/debian_bundle
copying build/lib.linux-i686-2.6/debian_bundle/__init__.py -> /build/buildd/python-debian-0.1.12ubuntu1/debian/python-debian/usr/local/lib/python2.6/dist-packages/debian_bundle
copying build/lib.linux-i686-2.6/debian_bundle/changelog.py -> /build/buildd/python-debian-0.1.12ubuntu1/debian/python-debian/usr/local/lib/python2.6/dist-packages/debian_bundle
copying build/lib.linux-i686-2.6/debian_bundle/debian_support.py -> /build/buildd/python-debian-0.1.12ubuntu1/debian/python-debian/usr/local/lib/python2.6/dist-packages/debian_bundle
copying build/lib.linux-i686-2.6/debian_bundle/deb822.py -> /build/buildd/python-debian-0.1.12ubuntu1/debian/python-debian/usr/local/lib/python2.6/dist-packages/debian_bundle
copying build/lib.linux-i686-2.6/debian_bundle/arfile.py -> /build/buildd/python-debian-0.1.12ubuntu1/debian/python-debian/usr/local/lib/python2.6/dist-packages/debian_bundle
copying build/lib.linux-i686-2.6/debian_bundle/debtags.py -> /build/buildd/python-debian-0.1.12ubuntu1/debian/python-debian/usr/local/lib/python2.6/dist-packages/debian_bundle
running install_egg_info
Writing /build/buildd/python-debian-0.1.12ubuntu1/debian/python-debian/usr/local/lib/python2.6/dist-packages/python_debian-0.1.12ubuntu1.egg-info
dh_testdir
dh_testroot
dh_installchangelogs
dh_installdocs
dh_installexamples
# TODO: Enrico would like to keep wxssearch out of the package
# but so far, he has no better place for it
#rm "/build/buildd/python-debian-0.1.12ubuntu1/debian/python-debian/usr/share/doc/python-debian/examples/wxssearch"
rm "/build/buildd/python-debian-0.1.12ubuntu1/debian/python-debian/usr/share/doc/python-debian/examples/debtags/wxssearch"
dh_compress -Xexamples
dh_fixperms
dh_pysupport -d
Traceback (most recent call last):
  File "/usr/bin/pysupport-movemodules", line 137, in <module>
    do_move (basedir, package, "usr/lib", "site-packages")
  File "/usr/bin/pysupport-movemodules", line 78, in do_move
    file_dict.addsum(relfile,pyvers,md5.new(file(absfile).read()).digest())
AttributeError: 'builtin_function_or_method' object has no attribute 'new'
dh_pysupport: command returned error code 256
make: *** [binary-indep] Error 1
dpkg-buildpackage: failure: /usr/bin/fakeroot debian/rules binary gave error exit status 2
******************************************************************************
Build finished at 20090410-0702
FAILED [dpkg-buildpackage died]
Purging chroot-jaunty-autotest/build/buildd/python-debian-0.1.12ubuntu1
------------------------------------------------------------------------------
  /usr/bin/sudo dpkg --root=/home/buildd/build-jaunty-autotest/chroot-jaunty-autotest --purge intltool-debian groff-base libglib2.0-0 mime-support readline-common gettext file html2text gettext-base debhelper po-debconf python python2.6 libcroco3 libmagic1 libreadline5 python-support libxml2 libsqlite3-0 bsdmainutils libssl0.9.8 man-db libncursesw5
(Reading database ... 11694 files and directories currently installed.)
Removing debhelper ...
Removing po-debconf ...
Removing python-support ...
Purging configuration files for python-support ...
Removing man-db ...
Purging configuration files for man-db ...
  Removing catpages as well as /var/cache/man hierarchy.
dpkg - warning: while removing man-db, directory `/usr/share/doc/man-db/examples' not empty so not removed.
dpkg - warning: while removing man-db, directory `/usr/share/doc/man-db' not empty so not removed.
dpkg - warning: while removing man-db, directory `/usr/share/man-db' not empty so not removed.
dpkg - warning: while removing man-db, directory `/usr/share/bug/man-db' not empty so not removed.
dpkg - warning: while removing man-db, directory `/usr/lib/man-db' not empty so not removed.
Removing intltool-debian ...
Removing groff-base ...
Purging configuration files for groff-base ...
Removing gettext ...
Removing file ...
Purging configuration files for file ...
Removing html2text ...
Purging configuration files for html2text ...
Removing gettext-base ...
Removing python ...
Purging configuration files for python ...
Removing python2.6 ...
Purging configuration files for python2.6 ...
dpkg - warning: while removing python2.6, directory `/usr/share/applications' not empty so not removed.
Removing libcroco3 ...
Purging configuration files for libcroco3 ...
Removing libmagic1 ...
Purging configuration files for libmagic1 ...
Removing libreadline5 ...
Purging configuration files for libreadline5 ...
Removing libxml2 ...
Purging configuration files for libxml2 ...
Removing libsqlite3-0 ...
Purging configuration files for libsqlite3-0 ...
Removing bsdmainutils ...
Purging configuration files for bsdmainutils ...
Removing libssl0.9.8 ...
Purging configuration files for libssl0.9.8 ...
Removing libncursesw5 ...
Purging configuration files for libncursesw5 ...
Removing libglib2.0-0 ...
Purging configuration files for libglib2.0-0 ...
Removing mime-support ...
Purging configuration files for mime-support ...
Removing readline-common ...
Purging configuration files for readline-common ...
Processing triggers for libc6 ...
ldconfig deferred processing now taking place
******************************************************************************
Finished at 20090410-0702
Build needed 00:00:02, 1156k disk space




More information about the ubuntu-autotest mailing list