Log for failed build of notify-python_0.1.1-2build2 (dist=jaunty-autotest)

Build Daemon user noreply at buildd.ubuntu.com
Fri Apr 10 06:09:09 BST 2009


Automatic build of notify-python_0.1.1-2build2 on king by sbuild/amd64 1.170.5
Build started at 20090410-0605
******************************************************************************
Checking available source versions...
Fetching source files...
Reading package lists...
Building dependency tree...
Reading state information...
NOTICE: 'notify-python' packaging is maintained in the 'Svn' version control system at:
svn://svn.debian.org/svn/python-modules/packages/notify-python/trunk/
Need to get 328kB of source archives.
Get:1 http://archive.internal jaunty-autotest/main notify-python 0.1.1-2build2 (dsc) [1443B]
Get:2 http://archive.internal jaunty-autotest/main notify-python 0.1.1-2build2 (tar) [323kB]
Get:3 http://archive.internal jaunty-autotest/main notify-python 0.1.1-2build2 (diff) [2927B]
Fetched 328kB in 0s (8739kB/s)
Download complete and in download only mode
** Using build dependencies supplied by package:
Build-Depends: debhelper (>= 5.0.37.2), cdbs (>= 0.4.43), python-all-dev (>= 2.3.5-7), python-support (>= 0.3), pkg-config (>= 0.20-1), libnotify-dev (>= 0.4.3), python-gtk2-dev (>= 2.10)
Checking for already installed source dependencies...
debhelper: missing
cdbs: missing
python-all-dev: missing
python-support: missing
pkg-config: missing
libnotify-dev: missing
python-gtk2-dev: missing
Checking for source dependency conflicts...
  /usr/bin/sudo /usr/bin/apt-get --purge $CHROOT_OPTIONS -q -y install debhelper cdbs python-all-dev python-support pkg-config libnotify-dev python-gtk2-dev
Reading package lists...
Building dependency tree...
Reading state information...
The following extra packages will be installed:
  autoconf automake autotools-dev bsdmainutils defoma fdupes file fontconfig
  fontconfig-config gettext gettext-base groff-base html2text intltool
  intltool-debian libatk1.0-0 libatk1.0-dev libcairo2 libcairo2-dev libcroco3
  libcups2 libdatrie0 libdbus-1-3 libdbus-1-dev libdbus-glib-1-2
  libdbus-glib-1-dev libdirectfb-1.0-0 libdirectfb-dev libdirectfb-extra
  libexpat1 libexpat1-dev libffi-dev libffi5 libfontconfig1 libfontconfig1-dev
  libfreetype6 libfreetype6-dev libgcrypt11 libglib2.0-0 libglib2.0-dev
  libgnutls26 libgpg-error0 libgtk2.0-0 libgtk2.0-common libgtk2.0-dev
  libhtml-parser-perl libhtml-tagset-perl libhtml-tree-perl libice-dev libice6
  libjasper1 libjpeg62 libjpeg62-dev libkeyutils1 libkrb53 libmagic1
  libncursesw5 libnewt0.52 libnotify1 libpango1.0-0 libpango1.0-common
  libpango1.0-dev libpixman-1-0 libpixman-1-dev libpng12-0 libpng12-dev
  libpopt0 libpthread-stubs0 libpthread-stubs0-dev libpython2.6 libreadline5
  libsm-dev libsm6 libsqlite3-0 libssl0.9.8 libsysfs-dev libsysfs2 libtasn1-3
  libthai-data libthai0 libtiff4 libts-0.0-0 liburi-perl libwww-perl libx11-6
  libx11-data libx11-dev libxau-dev libxau6 libxcb-render-util0
  libxcb-render-util0-dev libxcb-render0 libxcb-render0-dev libxcb1
  libxcb1-dev libxcomposite-dev libxcomposite1 libxcursor-dev libxcursor1
  libxdamage-dev libxdamage1 libxdmcp-dev libxdmcp6 libxext-dev libxext6
  libxfixes-dev libxfixes3 libxft-dev libxft2 libxi-dev libxi6 libxinerama-dev
  libxinerama1 libxml-parser-perl libxml2 libxml2-utils libxrandr-dev
  libxrandr2 libxrender-dev libxrender1 m4 man-db mime-support netbase
  po-debconf python python-all python-cairo python-central python-dev
  python-gobject python-gobject-dev python-gtk2 python2.5 python2.5-dev
  python2.5-minimal python2.6 python2.6-dev readline-common shared-mime-info
  ttf-dejavu ttf-dejavu-core ttf-dejavu-extra ucf whiptail x11-common
  x11proto-composite-dev x11proto-core-dev x11proto-damage-dev
  x11proto-fixes-dev x11proto-input-dev x11proto-kb-dev x11proto-randr-dev
  x11proto-render-dev x11proto-xext-dev x11proto-xinerama-dev xtrans-dev
  zlib1g-dev
Suggested packages:
  autoconf2.13 autobook autoconf-archive gnu-standards autoconf-doc libtool
  wamerican wordlist whois vacation devscripts doc-base dh-make defoma-doc
  psfontmgr x-ttcidfont-conf dfontmgr libft-perl cvs gettext-doc groff
  libcairo2-doc cups-common rng-tools libglib2.0-doc gnutls-bin
  librsvg2-common gvfs libgtk2.0-doc libdata-dump-perl libjasper-runtime
  krb5-doc krb5-user ttf-japanese-gothic ttf-japanese-mincho ttf-thryomanes
  ttf-baekmuk ttf-arphic-gbsn00lp ttf-arphic-bsmi00lp ttf-arphic-gkai00mp
  ttf-arphic-bkai00mp libpango1.0-doc imagemagick libio-socket-ssl-perl less
  www-browser libmail-box-perl python-doc python-tk python-profiler
  python-gobject-dbg python-gtk2-doc python-numpy python2.5-doc binfmt-support
  python2.6-doc python2.6-profiler
Recommended packages:
  curl wget lynx libatk1.0-data dbus libglib2.0-data hicolor-icon-theme
  libgtk2.0-bin libgpm2 libfribidi0 notification-daemon libmailtools-perl
  libhtml-format-perl libcompress-zlib-perl xml-core ifupdown
  libmail-sendmail-perl docbook-xsl
The following NEW packages will be installed:
  autoconf automake autotools-dev bsdmainutils cdbs debhelper defoma fdupes
  file fontconfig fontconfig-config gettext gettext-base groff-base html2text
  intltool intltool-debian libatk1.0-0 libatk1.0-dev libcairo2 libcairo2-dev
  libcroco3 libcups2 libdatrie0 libdbus-1-3 libdbus-1-dev libdbus-glib-1-2
  libdbus-glib-1-dev libdirectfb-1.0-0 libdirectfb-dev libdirectfb-extra
  libexpat1 libexpat1-dev libffi-dev libffi5 libfontconfig1 libfontconfig1-dev
  libfreetype6 libfreetype6-dev libgcrypt11 libglib2.0-0 libglib2.0-dev
  libgnutls26 libgpg-error0 libgtk2.0-0 libgtk2.0-common libgtk2.0-dev
  libhtml-parser-perl libhtml-tagset-perl libhtml-tree-perl libice-dev libice6
  libjasper1 libjpeg62 libjpeg62-dev libkeyutils1 libkrb53 libmagic1
  libncursesw5 libnewt0.52 libnotify-dev libnotify1 libpango1.0-0
  libpango1.0-common libpango1.0-dev libpixman-1-0 libpixman-1-dev libpng12-0
  libpng12-dev libpopt0 libpthread-stubs0 libpthread-stubs0-dev libpython2.6
  libreadline5 libsm-dev libsm6 libsqlite3-0 libssl0.9.8 libsysfs-dev
  libsysfs2 libtasn1-3 libthai-data libthai0 libtiff4 libts-0.0-0 liburi-perl
  libwww-perl libx11-6 libx11-data libx11-dev libxau-dev libxau6
  libxcb-render-util0 libxcb-render-util0-dev libxcb-render0
  libxcb-render0-dev libxcb1 libxcb1-dev libxcomposite-dev libxcomposite1
  libxcursor-dev libxcursor1 libxdamage-dev libxdamage1 libxdmcp-dev libxdmcp6
  libxext-dev libxext6 libxfixes-dev libxfixes3 libxft-dev libxft2 libxi-dev
  libxi6 libxinerama-dev libxinerama1 libxml-parser-perl libxml2 libxml2-utils
  libxrandr-dev libxrandr2 libxrender-dev libxrender1 m4 man-db mime-support
  netbase pkg-config po-debconf python python-all python-all-dev python-cairo
  python-central python-dev python-gobject python-gobject-dev python-gtk2
  python-gtk2-dev python-support python2.5 python2.5-dev python2.5-minimal
  python2.6 python2.6-dev readline-common shared-mime-info ttf-dejavu
  ttf-dejavu-core ttf-dejavu-extra ucf whiptail x11-common
  x11proto-composite-dev x11proto-core-dev x11proto-damage-dev
  x11proto-fixes-dev x11proto-input-dev x11proto-kb-dev x11proto-randr-dev
  x11proto-render-dev x11proto-xext-dev x11proto-xinerama-dev xtrans-dev
  zlib1g-dev
0 upgraded, 165 newly installed, 0 to remove and 0 not upgraded.
Need to get 38.8kB/57.5MB of archives.
After this operation, 207MB of additional disk space will be used.
WARNING: The following packages cannot be authenticated!
  x11-common libice6 x11proto-core-dev libice-dev libsm6 libsm-dev libxau6
  libxdmcp6 libxcb1 libx11-data libx11-6 libxau-dev libxdmcp-dev
  x11proto-input-dev x11proto-kb-dev xtrans-dev libpthread-stubs0
  libpthread-stubs0-dev libxcb1-dev libx11-dev libxext6 libxfixes3
  libxcomposite1 x11proto-xext-dev x11proto-fixes-dev libxfixes-dev
  x11proto-composite-dev libxext-dev libxcomposite-dev libxrender1 libxcursor1
  x11proto-render-dev libxrender-dev libxcursor-dev libxdamage1
  x11proto-damage-dev libxdamage-dev libexpat1 libfreetype6 ucf libnewt0.52
  libpopt0 whiptail libmagic1 file defoma ttf-dejavu-core ttf-dejavu-extra
  ttf-dejavu fontconfig-config libfontconfig1 libxft2 libexpat1-dev zlib1g-dev
  libfreetype6-dev libglib2.0-0 pkg-config libfontconfig1-dev libxft-dev
  libxi6 libxi-dev libxinerama1 x11proto-xinerama-dev libxinerama-dev
  libxrandr2 x11proto-randr-dev libxrandr-dev libgpg-error0 libgcrypt11
  libtasn1-3 libgnutls26 libkeyutils1 libkrb53 libncursesw5 readline-common
  libreadline5 libsqlite3-0 libssl0.9.8 mime-support netbase python2.6 python
  bsdmainutils gettext-base groff-base libhtml-tagset-perl liburi-perl
  libhtml-parser-perl libhtml-tree-perl libwww-perl libxml-parser-perl libxml2
  man-db python-central python-support m4 autoconf autotools-dev automake
  html2text libcroco3 gettext intltool-debian po-debconf debhelper fdupes
  intltool cdbs fontconfig libatk1.0-0 libglib2.0-dev libatk1.0-dev libsysfs2
  libts-0.0-0 libdirectfb-1.0-0 libpixman-1-0 libpng12-0 libxcb-render0
  libxcb-render-util0 libcairo2 libpng12-dev libjpeg62 libdirectfb-extra
  libjpeg62-dev libsysfs-dev libdirectfb-dev libpixman-1-dev
  libxcb-render0-dev libxcb-render-util0-dev libcairo2-dev libcups2 libdatrie0
  libdbus-1-3 libdbus-1-dev libdbus-glib-1-2 libdbus-glib-1-dev
  libgtk2.0-common libjasper1 libpango1.0-common libthai-data libthai0
  libpango1.0-0 libtiff4 shared-mime-info libgtk2.0-0 libpango1.0-dev
  libxml2-utils libgtk2.0-dev libnotify1 libnotify-dev libpython2.6
  python2.5-minimal python2.5 python-all python2.6-dev python-dev
  python2.5-dev python-all-dev python-cairo libffi5 python-gobject libffi-dev
  python-gobject-dev python-gtk2 python-gtk2-dev
Authentication warning overridden.
Get:1 http://archive.internal jaunty-autotest/main libnotify1 0.4.5-0ubuntu1 [21.0kB]
Get:2 http://archive.internal jaunty-autotest/main libnotify-dev 0.4.5-0ubuntu1 [17.8kB]
debconf: unable to initialize frontend: Dialog
debconf: (Dialog frontend will not work on a dumb terminal, an emacs shell buffer, or without a controlling terminal.)
debconf: falling back to frontend: Readline
debconf: unable to initialize frontend: Readline
debconf: (This frontend requires a controlling tty.)
debconf: falling back to frontend: Teletype
dpkg-preconfigure: unable to re-open stdin: 
Fetched 38.8kB in 0s (1569kB/s)
Selecting previously deselected package x11-common.
(Reading database ... 9812 files and directories currently installed.)
Unpacking x11-common (from .../x11-common_1%3a7.4~5ubuntu18_all.deb) ...
Selecting previously deselected package libice6.
Unpacking libice6 (from .../libice6_2%3a1.0.4-1_amd64.deb) ...
Setting up x11-common (1:7.4~5ubuntu18) ...

Selecting previously deselected package x11proto-core-dev.
(Reading database ... 9894 files and directories currently installed.)
Unpacking x11proto-core-dev (from .../x11proto-core-dev_7.0.14-2_all.deb) ...
Selecting previously deselected package libice-dev.
Unpacking libice-dev (from .../libice-dev_2%3a1.0.4-1_amd64.deb) ...
Selecting previously deselected package libsm6.
Unpacking libsm6 (from .../libsm6_2%3a1.1.0-1_amd64.deb) ...
Selecting previously deselected package libsm-dev.
Unpacking libsm-dev (from .../libsm-dev_2%3a1.1.0-1_amd64.deb) ...
Selecting previously deselected package libxau6.
Unpacking libxau6 (from .../libxau6_1%3a1.0.4-1_amd64.deb) ...
Selecting previously deselected package libxdmcp6.
Unpacking libxdmcp6 (from .../libxdmcp6_1%3a1.0.2-3_amd64.deb) ...
Selecting previously deselected package libxcb1.
Unpacking libxcb1 (from .../libxcb1_1.1.93-0ubuntu3_amd64.deb) ...
Selecting previously deselected package libx11-data.
Unpacking libx11-data (from .../libx11-data_2%3a1.1.99.2-1ubuntu2_all.deb) ...
Selecting previously deselected package libx11-6.
Unpacking libx11-6 (from .../libx11-6_2%3a1.1.99.2-1ubuntu2_amd64.deb) ...
Selecting previously deselected package libxau-dev.
Unpacking libxau-dev (from .../libxau-dev_1%3a1.0.4-1_amd64.deb) ...
Selecting previously deselected package libxdmcp-dev.
Unpacking libxdmcp-dev (from .../libxdmcp-dev_1%3a1.0.2-3_amd64.deb) ...
Selecting previously deselected package x11proto-input-dev.
Unpacking x11proto-input-dev (from .../x11proto-input-dev_1.5.0-1ubuntu1_all.deb) ...
Selecting previously deselected package x11proto-kb-dev.
Unpacking x11proto-kb-dev (from .../x11proto-kb-dev_1.0.3-3ubuntu1_all.deb) ...
Selecting previously deselected package xtrans-dev.
Unpacking xtrans-dev (from .../xtrans-dev_1.2.3-1_all.deb) ...
Selecting previously deselected package libpthread-stubs0.
Unpacking libpthread-stubs0 (from .../libpthread-stubs0_0.1-2_amd64.deb) ...
Selecting previously deselected package libpthread-stubs0-dev.
Unpacking libpthread-stubs0-dev (from .../libpthread-stubs0-dev_0.1-2_amd64.deb) ...
Selecting previously deselected package libxcb1-dev.
Unpacking libxcb1-dev (from .../libxcb1-dev_1.1.93-0ubuntu3_amd64.deb) ...
Selecting previously deselected package libx11-dev.
Unpacking libx11-dev (from .../libx11-dev_2%3a1.1.99.2-1ubuntu2_amd64.deb) ...
Selecting previously deselected package libxext6.
Unpacking libxext6 (from .../libxext6_2%3a1.0.99.1-0ubuntu3_amd64.deb) ...
Selecting previously deselected package libxfixes3.
Unpacking libxfixes3 (from .../libxfixes3_1%3a4.0.3-2_amd64.deb) ...
Selecting previously deselected package libxcomposite1.
Unpacking libxcomposite1 (from .../libxcomposite1_1%3a0.4.0-3_amd64.deb) ...
Selecting previously deselected package x11proto-xext-dev.
Unpacking x11proto-xext-dev (from .../x11proto-xext-dev_7.0.4-1_all.deb) ...
Selecting previously deselected package x11proto-fixes-dev.
Unpacking x11proto-fixes-dev (from .../x11proto-fixes-dev_1%3a4.0-3_all.deb) ...
Selecting previously deselected package libxfixes-dev.
Unpacking libxfixes-dev (from .../libxfixes-dev_1%3a4.0.3-2_amd64.deb) ...
Selecting previously deselected package x11proto-composite-dev.
Unpacking x11proto-composite-dev (from .../x11proto-composite-dev_1%3a0.4-2_all.deb) ...
Selecting previously deselected package libxext-dev.
Unpacking libxext-dev (from .../libxext-dev_2%3a1.0.99.1-0ubuntu3_amd64.deb) ...
Selecting previously deselected package libxcomposite-dev.
Unpacking libxcomposite-dev (from .../libxcomposite-dev_1%3a0.4.0-3_amd64.deb) ...
Selecting previously deselected package libxrender1.
Unpacking libxrender1 (from .../libxrender1_1%3a0.9.4-2_amd64.deb) ...
Selecting previously deselected package libxcursor1.
Unpacking libxcursor1 (from .../libxcursor1_1%3a1.1.9-1_amd64.deb) ...
Selecting previously deselected package x11proto-render-dev.
Unpacking x11proto-render-dev (from .../x11proto-render-dev_2%3a0.9.3-2_all.deb) ...
Selecting previously deselected package libxrender-dev.
Unpacking libxrender-dev (from .../libxrender-dev_1%3a0.9.4-2_amd64.deb) ...
Selecting previously deselected package libxcursor-dev.
Unpacking libxcursor-dev (from .../libxcursor-dev_1%3a1.1.9-1_amd64.deb) ...
Selecting previously deselected package libxdamage1.
Unpacking libxdamage1 (from .../libxdamage1_1%3a1.1.1-4_amd64.deb) ...
Selecting previously deselected package x11proto-damage-dev.
Unpacking x11proto-damage-dev (from .../x11proto-damage-dev_1%3a1.1.0-2build1_all.deb) ...
Selecting previously deselected package libxdamage-dev.
Unpacking libxdamage-dev (from .../libxdamage-dev_1%3a1.1.1-4_amd64.deb) ...
Selecting previously deselected package libexpat1.
Unpacking libexpat1 (from .../libexpat1_2.0.1-4_amd64.deb) ...
Selecting previously deselected package libfreetype6.
Unpacking libfreetype6 (from .../libfreetype6_2.3.9-4build1_amd64.deb) ...
Selecting previously deselected package ucf.
Unpacking ucf (from .../archives/ucf_3.0014_all.deb) ...
Moving old data out of the way
Selecting previously deselected package libnewt0.52.
Unpacking libnewt0.52 (from .../libnewt0.52_0.52.2-11.3ubuntu3_amd64.deb) ...
Selecting previously deselected package libpopt0.
Unpacking libpopt0 (from .../libpopt0_1.14-4_amd64.deb) ...
Selecting previously deselected package whiptail.
Unpacking whiptail (from .../whiptail_0.52.2-11.3ubuntu3_amd64.deb) ...
Selecting previously deselected package libmagic1.
Unpacking libmagic1 (from .../libmagic1_4.26-2ubuntu3_amd64.deb) ...
Selecting previously deselected package file.
Unpacking file (from .../file_4.26-2ubuntu3_amd64.deb) ...
Selecting previously deselected package defoma.
Unpacking defoma (from .../defoma_0.11.10-0.2ubuntu1_all.deb) ...
Selecting previously deselected package ttf-dejavu-core.
Unpacking ttf-dejavu-core (from .../ttf-dejavu-core_2.28-1_all.deb) ...
Selecting previously deselected package ttf-dejavu-extra.
Unpacking ttf-dejavu-extra (from .../ttf-dejavu-extra_2.28-1_all.deb) ...
Selecting previously deselected package ttf-dejavu.
Unpacking ttf-dejavu (from .../ttf-dejavu_2.28-1_all.deb) ...
Selecting previously deselected package fontconfig-config.
Unpacking fontconfig-config (from .../fontconfig-config_2.6.0-1ubuntu12_all.deb) ...
Selecting previously deselected package libfontconfig1.
Unpacking libfontconfig1 (from .../libfontconfig1_2.6.0-1ubuntu12_amd64.deb) ...
Selecting previously deselected package libxft2.
Unpacking libxft2 (from .../libxft2_2.1.13-3ubuntu1_amd64.deb) ...
Selecting previously deselected package libexpat1-dev.
Unpacking libexpat1-dev (from .../libexpat1-dev_2.0.1-4_amd64.deb) ...
Selecting previously deselected package zlib1g-dev.
Unpacking zlib1g-dev (from .../zlib1g-dev_1%3a1.2.3.3.dfsg-12ubuntu2_amd64.deb) ...
Selecting previously deselected package libfreetype6-dev.
Unpacking libfreetype6-dev (from .../libfreetype6-dev_2.3.9-4build1_amd64.deb) ...
Selecting previously deselected package libglib2.0-0.
Unpacking libglib2.0-0 (from .../libglib2.0-0_2.20.0-1build2_amd64.deb) ...
Selecting previously deselected package pkg-config.
Unpacking pkg-config (from .../pkg-config_0.22-1_amd64.deb) ...
Selecting previously deselected package libfontconfig1-dev.
Unpacking libfontconfig1-dev (from .../libfontconfig1-dev_2.6.0-1ubuntu12_amd64.deb) ...
Selecting previously deselected package libxft-dev.
Unpacking libxft-dev (from .../libxft-dev_2.1.13-3ubuntu1_amd64.deb) ...
Selecting previously deselected package libxi6.
Unpacking libxi6 (from .../libxi6_2%3a1.2.0-1ubuntu1_amd64.deb) ...
Selecting previously deselected package libxi-dev.
Unpacking libxi-dev (from .../libxi-dev_2%3a1.2.0-1ubuntu1_amd64.deb) ...
Selecting previously deselected package libxinerama1.
Unpacking libxinerama1 (from .../libxinerama1_2%3a1.0.3-2_amd64.deb) ...
Selecting previously deselected package x11proto-xinerama-dev.
Unpacking x11proto-xinerama-dev (from .../x11proto-xinerama-dev_1.1.2-5ubuntu1_all.deb) ...
Selecting previously deselected package libxinerama-dev.
Unpacking libxinerama-dev (from .../libxinerama-dev_2%3a1.0.3-2_amd64.deb) ...
Selecting previously deselected package libxrandr2.
Unpacking libxrandr2 (from .../libxrandr2_2%3a1.3.0-1build1_amd64.deb) ...
Selecting previously deselected package x11proto-randr-dev.
Unpacking x11proto-randr-dev (from .../x11proto-randr-dev_1.3.0-1_all.deb) ...
Selecting previously deselected package libxrandr-dev.
Unpacking libxrandr-dev (from .../libxrandr-dev_2%3a1.3.0-1build1_amd64.deb) ...
Selecting previously deselected package libgpg-error0.
Unpacking libgpg-error0 (from .../libgpg-error0_1.4-2ubuntu7_amd64.deb) ...
Selecting previously deselected package libgcrypt11.
Unpacking libgcrypt11 (from .../libgcrypt11_1.4.1-2ubuntu1_amd64.deb) ...
Selecting previously deselected package libtasn1-3.
Unpacking libtasn1-3 (from .../libtasn1-3_1.5-1_amd64.deb) ...
Selecting previously deselected package libgnutls26.
Unpacking libgnutls26 (from .../libgnutls26_2.4.2-6_amd64.deb) ...
Selecting previously deselected package libkeyutils1.
Unpacking libkeyutils1 (from .../libkeyutils1_1.2-9_amd64.deb) ...
Selecting previously deselected package libkrb53.
Unpacking libkrb53 (from .../libkrb53_1.6.dfsg.4~beta1-5ubuntu2_amd64.deb) ...
Selecting previously deselected package libncursesw5.
Unpacking libncursesw5 (from .../libncursesw5_5.7+20090207-1ubuntu1_amd64.deb) ...
Selecting previously deselected package readline-common.
Unpacking readline-common (from .../readline-common_5.2-4_all.deb) ...
Selecting previously deselected package libreadline5.
Unpacking libreadline5 (from .../libreadline5_5.2-4_amd64.deb) ...
Selecting previously deselected package libsqlite3-0.
Unpacking libsqlite3-0 (from .../libsqlite3-0_3.6.10-1_amd64.deb) ...
Selecting previously deselected package libssl0.9.8.
Unpacking libssl0.9.8 (from .../libssl0.9.8_0.9.8g-15ubuntu3_amd64.deb) ...
Selecting previously deselected package mime-support.
Unpacking mime-support (from .../mime-support_3.44-1_all.deb) ...
Selecting previously deselected package netbase.
Unpacking netbase (from .../netbase_4.34ubuntu2_all.deb) ...
Selecting previously deselected package python2.6.
Unpacking python2.6 (from .../python2.6_2.6.2~rc1-0ubuntu1_amd64.deb) ...
Selecting previously deselected package python.
Unpacking python (from .../python_2.6.1-0ubuntu9_all.deb) ...
Selecting previously deselected package bsdmainutils.
Unpacking bsdmainutils (from .../bsdmainutils_6.1.10ubuntu3_amd64.deb) ...
Selecting previously deselected package gettext-base.
Unpacking gettext-base (from .../gettext-base_0.17-6ubuntu2_amd64.deb) ...
Selecting previously deselected package groff-base.
Unpacking groff-base (from .../groff-base_1.18.1.1-22build1_amd64.deb) ...
Selecting previously deselected package libhtml-tagset-perl.
Unpacking libhtml-tagset-perl (from .../libhtml-tagset-perl_3.20-2_all.deb) ...
Selecting previously deselected package liburi-perl.
Unpacking liburi-perl (from .../liburi-perl_1.37+dfsg-1ubuntu1_all.deb) ...
Selecting previously deselected package libhtml-parser-perl.
Unpacking libhtml-parser-perl (from .../libhtml-parser-perl_3.59-1ubuntu1_amd64.deb) ...
Selecting previously deselected package libhtml-tree-perl.
Unpacking libhtml-tree-perl (from .../libhtml-tree-perl_3.23-1_all.deb) ...
Selecting previously deselected package libwww-perl.
Unpacking libwww-perl (from .../libwww-perl_5.820-1_all.deb) ...
Selecting previously deselected package libxml-parser-perl.
Unpacking libxml-parser-perl (from .../libxml-parser-perl_2.36-1.1build2_amd64.deb) ...
Selecting previously deselected package libxml2.
Unpacking libxml2 (from .../libxml2_2.6.32.dfsg-5ubuntu4_amd64.deb) ...
Selecting previously deselected package man-db.
Unpacking man-db (from .../man-db_2.5.5-1build1_amd64.deb) ...
Selecting previously deselected package python-central.
Unpacking python-central (from .../python-central_0.6.11ubuntu6_all.deb) ...
Selecting previously deselected package python-support.
Unpacking python-support (from .../python-support_0.8.7ubuntu3_all.deb) ...
Selecting previously deselected package m4.
Unpacking m4 (from .../archives/m4_1.4.11-1_amd64.deb) ...
Selecting previously deselected package autoconf.
Unpacking autoconf (from .../autoconf_2.63-2ubuntu1_all.deb) ...
Selecting previously deselected package autotools-dev.
Unpacking autotools-dev (from .../autotools-dev_20080123.2_all.deb) ...
Selecting previously deselected package automake.
Unpacking automake (from .../automake_1%3a1.10.2-0ubuntu2_all.deb) ...
Selecting previously deselected package html2text.
Unpacking html2text (from .../html2text_1.3.2a-5_amd64.deb) ...
Selecting previously deselected package libcroco3.
Unpacking libcroco3 (from .../libcroco3_0.6.1-2_amd64.deb) ...
Selecting previously deselected package gettext.
Unpacking gettext (from .../gettext_0.17-6ubuntu2_amd64.deb) ...
Selecting previously deselected package intltool-debian.
Unpacking intltool-debian (from .../intltool-debian_0.35.0+20060710.1_all.deb) ...
Selecting previously deselected package po-debconf.
Unpacking po-debconf (from .../po-debconf_1.0.15ubuntu1_all.deb) ...
Selecting previously deselected package debhelper.
Unpacking debhelper (from .../debhelper_7.0.17ubuntu4_all.deb) ...
Selecting previously deselected package fdupes.
Unpacking fdupes (from .../fdupes_1.50-PR2-1_amd64.deb) ...
Selecting previously deselected package intltool.
Unpacking intltool (from .../intltool_0.40.6-1_all.deb) ...
Selecting previously deselected package cdbs.
Unpacking cdbs (from .../cdbs_0.4.52ubuntu18_all.deb) ...
Selecting previously deselected package fontconfig.
Unpacking fontconfig (from .../fontconfig_2.6.0-1ubuntu12_amd64.deb) ...
Selecting previously deselected package libatk1.0-0.
Unpacking libatk1.0-0 (from .../libatk1.0-0_1.26.0-0ubuntu2_amd64.deb) ...
Selecting previously deselected package libglib2.0-dev.
Unpacking libglib2.0-dev (from .../libglib2.0-dev_2.20.0-1build2_amd64.deb) ...
Selecting previously deselected package libatk1.0-dev.
Unpacking libatk1.0-dev (from .../libatk1.0-dev_1.26.0-0ubuntu2_amd64.deb) ...
Selecting previously deselected package libsysfs2.
Unpacking libsysfs2 (from .../libsysfs2_2.1.0-5_amd64.deb) ...
Selecting previously deselected package libts-0.0-0.
Unpacking libts-0.0-0 (from .../libts-0.0-0_1.0-4ubuntu2_amd64.deb) ...
Selecting previously deselected package libdirectfb-1.0-0.
Unpacking libdirectfb-1.0-0 (from .../libdirectfb-1.0-0_1.0.1-11ubuntu1_amd64.deb) ...
Selecting previously deselected package libpixman-1-0.
Unpacking libpixman-1-0 (from .../libpixman-1-0_0.13.2-1_amd64.deb) ...
Selecting previously deselected package libpng12-0.
Unpacking libpng12-0 (from .../libpng12-0_1.2.27-2ubuntu2_amd64.deb) ...
Selecting previously deselected package libxcb-render0.
Unpacking libxcb-render0 (from .../libxcb-render0_1.1.93-0ubuntu3_amd64.deb) ...
Selecting previously deselected package libxcb-render-util0.
Unpacking libxcb-render-util0 (from .../libxcb-render-util0_0.2.1+git1-1_amd64.deb) ...
Selecting previously deselected package libcairo2.
Unpacking libcairo2 (from .../libcairo2_1.8.6-1ubuntu2_amd64.deb) ...
Selecting previously deselected package libpng12-dev.
Unpacking libpng12-dev (from .../libpng12-dev_1.2.27-2ubuntu2_amd64.deb) ...
Selecting previously deselected package libjpeg62.
Unpacking libjpeg62 (from .../libjpeg62_6b-14_amd64.deb) ...
Selecting previously deselected package libdirectfb-extra.
Unpacking libdirectfb-extra (from .../libdirectfb-extra_1.0.1-11ubuntu1_amd64.deb) ...
Selecting previously deselected package libjpeg62-dev.
Unpacking libjpeg62-dev (from .../libjpeg62-dev_6b-14_amd64.deb) ...
Selecting previously deselected package libsysfs-dev.
Unpacking libsysfs-dev (from .../libsysfs-dev_2.1.0-5_amd64.deb) ...
Selecting previously deselected package libdirectfb-dev.
Unpacking libdirectfb-dev (from .../libdirectfb-dev_1.0.1-11ubuntu1_amd64.deb) ...
Selecting previously deselected package libpixman-1-dev.
Unpacking libpixman-1-dev (from .../libpixman-1-dev_0.13.2-1_amd64.deb) ...
Selecting previously deselected package libxcb-render0-dev.
Unpacking libxcb-render0-dev (from .../libxcb-render0-dev_1.1.93-0ubuntu3_amd64.deb) ...
Selecting previously deselected package libxcb-render-util0-dev.
Unpacking libxcb-render-util0-dev (from .../libxcb-render-util0-dev_0.2.1+git1-1_amd64.deb) ...
Selecting previously deselected package libcairo2-dev.
Unpacking libcairo2-dev (from .../libcairo2-dev_1.8.6-1ubuntu2_amd64.deb) ...
Selecting previously deselected package libcups2.
Unpacking libcups2 (from .../libcups2_1.3.9-17_amd64.deb) ...
Selecting previously deselected package libdatrie0.
Unpacking libdatrie0 (from .../libdatrie0_0.1.3-2_amd64.deb) ...
Selecting previously deselected package libdbus-1-3.
Unpacking libdbus-1-3 (from .../libdbus-1-3_1.2.12-0ubuntu2_amd64.deb) ...
Selecting previously deselected package libdbus-1-dev.
Unpacking libdbus-1-dev (from .../libdbus-1-dev_1.2.12-0ubuntu2_amd64.deb) ...
Selecting previously deselected package libdbus-glib-1-2.
Unpacking libdbus-glib-1-2 (from .../libdbus-glib-1-2_0.80-3_amd64.deb) ...
Selecting previously deselected package libdbus-glib-1-dev.
Unpacking libdbus-glib-1-dev (from .../libdbus-glib-1-dev_0.80-3_amd64.deb) ...
Selecting previously deselected package libgtk2.0-common.
Unpacking libgtk2.0-common (from .../libgtk2.0-common_2.16.0-1ubuntu4_all.deb) ...
Selecting previously deselected package libjasper1.
Unpacking libjasper1 (from .../libjasper1_1.900.1-5.1_amd64.deb) ...
Selecting previously deselected package libpango1.0-common.
Unpacking libpango1.0-common (from .../libpango1.0-common_1.24.0-3ubuntu1_all.deb) ...
Selecting previously deselected package libthai-data.
Unpacking libthai-data (from .../libthai-data_0.1.9-4_all.deb) ...
Selecting previously deselected package libthai0.
Unpacking libthai0 (from .../libthai0_0.1.9-4_amd64.deb) ...
Selecting previously deselected package libpango1.0-0.
Unpacking libpango1.0-0 (from .../libpango1.0-0_1.24.0-3ubuntu1_amd64.deb) ...
Selecting previously deselected package libtiff4.
Unpacking libtiff4 (from .../libtiff4_3.8.2-11_amd64.deb) ...
Selecting previously deselected package shared-mime-info.
Unpacking shared-mime-info (from .../shared-mime-info_0.60-1_amd64.deb) ...
Selecting previously deselected package libgtk2.0-0.
Unpacking libgtk2.0-0 (from .../libgtk2.0-0_2.16.0-1ubuntu4_amd64.deb) ...
Selecting previously deselected package libpango1.0-dev.
Unpacking libpango1.0-dev (from .../libpango1.0-dev_1.24.0-3ubuntu1_amd64.deb) ...
Selecting previously deselected package libxml2-utils.
Unpacking libxml2-utils (from .../libxml2-utils_2.6.32.dfsg-5ubuntu4_amd64.deb) ...
Selecting previously deselected package libgtk2.0-dev.
Unpacking libgtk2.0-dev (from .../libgtk2.0-dev_2.16.0-1ubuntu4_amd64.deb) ...
Selecting previously deselected package libnotify1.
Unpacking libnotify1 (from .../libnotify1_0.4.5-0ubuntu1_amd64.deb) ...
Selecting previously deselected package libnotify-dev.
Unpacking libnotify-dev (from .../libnotify-dev_0.4.5-0ubuntu1_amd64.deb) ...
Selecting previously deselected package libpython2.6.
Unpacking libpython2.6 (from .../libpython2.6_2.6.2~rc1-0ubuntu1_amd64.deb) ...
Selecting previously deselected package python2.5-minimal.
Unpacking python2.5-minimal (from .../python2.5-minimal_2.5.4-1ubuntu4_amd64.deb) ...
Selecting previously deselected package python2.5.
Unpacking python2.5 (from .../python2.5_2.5.4-1ubuntu4_amd64.deb) ...
Selecting previously deselected package python-all.
Unpacking python-all (from .../python-all_2.6.1-0ubuntu9_all.deb) ...
Selecting previously deselected package python2.6-dev.
Unpacking python2.6-dev (from .../python2.6-dev_2.6.2~rc1-0ubuntu1_amd64.deb) ...
Selecting previously deselected package python-dev.
Unpacking python-dev (from .../python-dev_2.6.1-0ubuntu9_all.deb) ...
Selecting previously deselected package python2.5-dev.
Unpacking python2.5-dev (from .../python2.5-dev_2.5.4-1ubuntu4_amd64.deb) ...
Selecting previously deselected package python-all-dev.
Unpacking python-all-dev (from .../python-all-dev_2.6.1-0ubuntu9_all.deb) ...
Selecting previously deselected package python-cairo.
Unpacking python-cairo (from .../python-cairo_1.4.12-1.2ubuntu1_amd64.deb) ...
Selecting previously deselected package libffi5.
Unpacking libffi5 (from .../libffi5_3.0.7-1ubuntu1_amd64.deb) ...
Selecting previously deselected package python-gobject.
Unpacking python-gobject (from .../python-gobject_2.16.1-1ubuntu2_amd64.deb) ...
Selecting previously deselected package libffi-dev.
Unpacking libffi-dev (from .../libffi-dev_3.0.7-1ubuntu1_amd64.deb) ...
Selecting previously deselected package python-gobject-dev.
Unpacking python-gobject-dev (from .../python-gobject-dev_2.16.1-1ubuntu2_all.deb) ...
Selecting previously deselected package python-gtk2.
Unpacking python-gtk2 (from .../python-gtk2_2.14.1-1ubuntu1_amd64.deb) ...
Selecting previously deselected package python-gtk2-dev.
Unpacking python-gtk2-dev (from .../python-gtk2-dev_2.14.1-1ubuntu1_all.deb) ...
Setting up libice6 (2:1.0.4-1) ...

Setting up x11proto-core-dev (7.0.14-2) ...
Setting up libice-dev (2:1.0.4-1) ...
Setting up libsm6 (2:1.1.0-1) ...

Setting up libsm-dev (2:1.1.0-1) ...
Setting up libxau6 (1:1.0.4-1) ...

Setting up libxdmcp6 (1:1.0.2-3) ...

Setting up libxcb1 (1.1.93-0ubuntu3) ...

Setting up libx11-data (2:1.1.99.2-1ubuntu2) ...
Setting up libx11-6 (2:1.1.99.2-1ubuntu2) ...

Setting up libxau-dev (1:1.0.4-1) ...
Setting up libxdmcp-dev (1:1.0.2-3) ...
Setting up x11proto-input-dev (1.5.0-1ubuntu1) ...
Setting up x11proto-kb-dev (1.0.3-3ubuntu1) ...
Setting up xtrans-dev (1.2.3-1) ...
Setting up libpthread-stubs0 (0.1-2) ...
Setting up libpthread-stubs0-dev (0.1-2) ...
Setting up libxcb1-dev (1.1.93-0ubuntu3) ...
Setting up libx11-dev (2:1.1.99.2-1ubuntu2) ...
Setting up libxext6 (2:1.0.99.1-0ubuntu3) ...

Setting up libxfixes3 (1:4.0.3-2) ...

Setting up libxcomposite1 (1:0.4.0-3) ...

Setting up x11proto-xext-dev (7.0.4-1) ...
Setting up x11proto-fixes-dev (1:4.0-3) ...
Setting up libxfixes-dev (1:4.0.3-2) ...
Setting up x11proto-composite-dev (1:0.4-2) ...
Setting up libxext-dev (2:1.0.99.1-0ubuntu3) ...
Setting up libxcomposite-dev (1:0.4.0-3) ...
Setting up libxrender1 (1:0.9.4-2) ...

Setting up libxcursor1 (1:1.1.9-1) ...

Setting up x11proto-render-dev (2:0.9.3-2) ...
Setting up libxrender-dev (1:0.9.4-2) ...
Setting up libxcursor-dev (1:1.1.9-1) ...
Setting up libxdamage1 (1:1.1.1-4) ...

Setting up x11proto-damage-dev (1:1.1.0-2build1) ...
Setting up libxdamage-dev (1:1.1.1-4) ...
Setting up libexpat1 (2.0.1-4) ...

Setting up libfreetype6 (2.3.9-4build1) ...

Setting up ucf (3.0014) ...

Setting up libnewt0.52 (0.52.2-11.3ubuntu3) ...

Setting up libpopt0 (1.14-4) ...

Setting up whiptail (0.52.2-11.3ubuntu3) ...
Setting up libmagic1 (4.26-2ubuntu3) ...

Setting up file (4.26-2ubuntu3) ...
Setting up defoma (0.11.10-0.2ubuntu1) ...

Setting up ttf-dejavu-core (2.28-1) ...

Setting up ttf-dejavu-extra (2.28-1) ...

Setting up ttf-dejavu (2.28-1) ...
Setting up fontconfig-config (2.6.0-1ubuntu12) ...

Setting up libfontconfig1 (2.6.0-1ubuntu12) ...

Setting up libxft2 (2.1.13-3ubuntu1) ...

Setting up libexpat1-dev (2.0.1-4) ...

Setting up zlib1g-dev (1:1.2.3.3.dfsg-12ubuntu2) ...
Setting up libfreetype6-dev (2.3.9-4build1) ...

Setting up libglib2.0-0 (2.20.0-1build2) ...

Setting up pkg-config (0.22-1) ...
Setting up libfontconfig1-dev (2.6.0-1ubuntu12) ...

Setting up libxft-dev (2.1.13-3ubuntu1) ...
Setting up libxi6 (2:1.2.0-1ubuntu1) ...

Setting up libxi-dev (2:1.2.0-1ubuntu1) ...
Setting up libxinerama1 (2:1.0.3-2) ...

Setting up x11proto-xinerama-dev (1.1.2-5ubuntu1) ...
Setting up libxinerama-dev (2:1.0.3-2) ...
Setting up libxrandr2 (2:1.3.0-1build1) ...

Setting up x11proto-randr-dev (1.3.0-1) ...
Setting up libxrandr-dev (2:1.3.0-1build1) ...
Setting up libgpg-error0 (1.4-2ubuntu7) ...

Setting up libgcrypt11 (1.4.1-2ubuntu1) ...

Setting up libtasn1-3 (1.5-1) ...

Setting up libgnutls26 (2.4.2-6) ...

Setting up libkeyutils1 (1.2-9) ...

Setting up libkrb53 (1.6.dfsg.4~beta1-5ubuntu2) ...

Setting up libncursesw5 (5.7+20090207-1ubuntu1) ...

Setting up readline-common (5.2-4) ...

Setting up libreadline5 (5.2-4) ...

Setting up libsqlite3-0 (3.6.10-1) ...

Setting up libssl0.9.8 (0.9.8g-15ubuntu3) ...

Setting up mime-support (3.44-1) ...

Setting up netbase (4.34ubuntu2) ...

Setting up python2.6 (2.6.2~rc1-0ubuntu1) ...

Setting up python (2.6.1-0ubuntu9) ...

Setting up bsdmainutils (6.1.10ubuntu3) ...

Setting up gettext-base (0.17-6ubuntu2) ...

Setting up groff-base (1.18.1.1-22build1) ...

Setting up libhtml-tagset-perl (3.20-2) ...
Setting up liburi-perl (1.37+dfsg-1ubuntu1) ...

Setting up libhtml-parser-perl (3.59-1ubuntu1) ...

Setting up libhtml-tree-perl (3.23-1) ...
Setting up libwww-perl (5.820-1) ...
Setting up libxml-parser-perl (2.36-1.1build2) ...
Setting up libxml2 (2.6.32.dfsg-5ubuntu4) ...

Setting up man-db (2.5.5-1build1) ...
Building database of manual pages ...
... skipping, since this is a buildd

Setting up python-central (0.6.11ubuntu6) ...

Setting up python-support (0.8.7ubuntu3) ...

Setting up m4 (1.4.11-1) ...

Setting up autoconf (2.63-2ubuntu1) ...

Setting up autotools-dev (20080123.2) ...
Setting up automake (1:1.10.2-0ubuntu2) ...

Setting up html2text (1.3.2a-5) ...

Setting up libcroco3 (0.6.1-2) ...

Setting up gettext (0.17-6ubuntu2) ...

Setting up intltool-debian (0.35.0+20060710.1) ...
Setting up po-debconf (1.0.15ubuntu1) ...

Setting up debhelper (7.0.17ubuntu4) ...

Setting up fdupes (1.50-PR2-1) ...
Setting up intltool (0.40.6-1) ...
Setting up cdbs (0.4.52ubuntu18) ...

Setting up fontconfig (2.6.0-1ubuntu12) ...
Updating font configuration of fontconfig...
Cleaning up category cid..
Cleaning up category truetype..
Cleaning up category type1..
Updating category type1..
Updating category truetype..
Updating category cid..
Updating fontconfig cache for /usr/share/fonts/truetype/ttf-dejavu
Cleaning up old fontconfig caches... done.
Regenerating fonts cache... done.

Setting up libatk1.0-0 (1.26.0-0ubuntu2) ...

Setting up libglib2.0-dev (2.20.0-1build2) ...
Setting up libatk1.0-dev (1.26.0-0ubuntu2) ...
Setting up libsysfs2 (2.1.0-5) ...

Setting up libts-0.0-0 (1.0-4ubuntu2) ...

Setting up libdirectfb-1.0-0 (1.0.1-11ubuntu1) ...

Setting up libpixman-1-0 (0.13.2-1) ...

Setting up libpng12-0 (1.2.27-2ubuntu2) ...

Setting up libxcb-render0 (1.1.93-0ubuntu3) ...

Setting up libxcb-render-util0 (0.2.1+git1-1) ...

Setting up libcairo2 (1.8.6-1ubuntu2) ...

Setting up libpng12-dev (1.2.27-2ubuntu2) ...
Setting up libjpeg62 (6b-14) ...

Setting up libdirectfb-extra (1.0.1-11ubuntu1) ...
Setting up libjpeg62-dev (6b-14) ...
Setting up libsysfs-dev (2.1.0-5) ...

Setting up libdirectfb-dev (1.0.1-11ubuntu1) ...
Setting up libpixman-1-dev (0.13.2-1) ...
Setting up libxcb-render0-dev (1.1.93-0ubuntu3) ...
Setting up libxcb-render-util0-dev (0.2.1+git1-1) ...
Setting up libcairo2-dev (1.8.6-1ubuntu2) ...
Setting up libcups2 (1.3.9-17) ...

Setting up libdatrie0 (0.1.3-2) ...

Setting up libdbus-1-3 (1.2.12-0ubuntu2) ...

Setting up libdbus-1-dev (1.2.12-0ubuntu2) ...
Setting up libdbus-glib-1-2 (0.80-3) ...

Setting up libdbus-glib-1-dev (0.80-3) ...
Setting up libgtk2.0-common (2.16.0-1ubuntu4) ...
Setting up libjasper1 (1.900.1-5.1) ...

Setting up libpango1.0-common (1.24.0-3ubuntu1) ...
Cleaning up font configuration of pango...
Updating font configuration of pango...
Cleaning up category xfont..
Updating category xfont..
*** You don't have any defomized font packages.
*** So we are trying to force to generate pangox.aliases...

Setting up libthai-data (0.1.9-4) ...
Setting up libthai0 (0.1.9-4) ...

Setting up libpango1.0-0 (1.24.0-3ubuntu1) ...

Setting up libtiff4 (3.8.2-11) ...

Setting up shared-mime-info (0.60-1) ...

Setting up libgtk2.0-0 (2.16.0-1ubuntu4) ...

Setting up libpango1.0-dev (1.24.0-3ubuntu1) ...
Setting up libxml2-utils (2.6.32.dfsg-5ubuntu4) ...
Setting up libgtk2.0-dev (2.16.0-1ubuntu4) ...
Setting up libnotify1 (0.4.5-0ubuntu1) ...

Setting up libnotify-dev (0.4.5-0ubuntu1) ...
Setting up libpython2.6 (2.6.2~rc1-0ubuntu1) ...

Setting up python2.5-minimal (2.5.4-1ubuntu4) ...
Linking and byte-compiling packages for runtime python2.5...

Setting up python2.5 (2.5.4-1ubuntu4) ...

Setting up python-all (2.6.1-0ubuntu9) ...
Setting up python2.6-dev (2.6.2~rc1-0ubuntu1) ...
Setting up python-dev (2.6.1-0ubuntu9) ...
Setting up python2.5-dev (2.5.4-1ubuntu4) ...
Setting up python-all-dev (2.6.1-0ubuntu9) ...
Setting up python-cairo (1.4.12-1.2ubuntu1) ...

Setting up libffi5 (3.0.7-1ubuntu1) ...

Setting up python-gobject (2.16.1-1ubuntu2) ...

Setting up libffi-dev (3.0.7-1ubuntu1) ...

Setting up python-gobject-dev (2.16.1-1ubuntu2) ...

Setting up python-gtk2 (2.14.1-1ubuntu1) ...

Setting up python-gtk2-dev (2.14.1-1ubuntu1) ...

Processing triggers for libc6 ...
ldconfig deferred processing now taking place
Processing triggers for python-support ...
Checking correctness of source dependencies...
Toolchain package versions: libc6-dev_2.9-4ubuntu6 make_3.81-5 dpkg-dev_1.14.24ubuntu1 linux-libc-dev_2.6.28-11.41 g++-4.3_4.3.3-5ubuntu4 gcc-4.3_4.3.3-5ubuntu4 binutils_2.19.1-0ubuntu3 libstdc++6_4.3.3-5ubuntu4 libstdc++6-4.3-dev_4.3.3-5ubuntu4
------------------------------------------------------------------------------
sh: gcc: not found
dpkg-source: warning: Couldn't determine gcc system type, falling back to default (native compilation)
gpg: Signature made Sun Feb 22 11:27:06 2009 GMT using DSA key ID 0F932C9C
gpg: Can't check signature: public key not found
dpkg-source: extracting notify-python in notify-python-0.1.1
dpkg-source: unpacking notify-python_0.1.1.orig.tar.gz
dpkg-source: applying /home/buildd/build-jaunty-autotest/notify-python_0.1.1-2build2.diff.gz
dpkg-buildpackage: set CFLAGS to default value: -g -O2
dpkg-buildpackage: set CPPFLAGS to default value: 
dpkg-buildpackage: set LDFLAGS to default value: -Wl,-Bsymbolic-functions
dpkg-buildpackage: set FFLAGS to default value: -g -O2
dpkg-buildpackage: set CXXFLAGS to default value: -g -O2
dpkg-buildpackage: source package notify-python
dpkg-buildpackage: source version 0.1.1-2build2
dpkg-buildpackage: host architecture amd64
 /usr/bin/fakeroot debian/rules clean
test -x debian/rules
test "`id -u`" = 0
for i in ./config.guess ./config.sub  ; do \
		if test -e $i.cdbs-orig ; then \
			mv $i.cdbs-orig $i ; \
		fi ; \
	done
/usr/bin/make -f debian/rules reverse-config
make[1]: Entering directory `/build/buildd/notify-python-0.1.1'
for i in ./config.guess ./config.sub  ; do \
		if test -e $i.cdbs-orig ; then \
			mv $i.cdbs-orig $i ; \
		fi ; \
	done
make[1]: Leaving directory `/build/buildd/notify-python-0.1.1'
if [ "reverse-patches" = "reverse-patches" ]; then rm -f debian/stamp-patched; fi
patches: 
if [ "reverse-patches" != "reverse-patches" ]; then touch debian/stamp-patched; fi
if [ "reverse-patches" != "reverse-patches" ] ; then \
		/usr/bin/make -f debian/rules update-config ; \
	fi
for dir in debian/patches ; do \
	    rm -f $dir/*.log ; \
	done
dh_testdir
dh_testroot
rm -rf build-2.6 build-2.5
dh_clean src/pynotify.c
 debian/rules build
test -x debian/rules
mkdir -p "."
/usr/bin/make -f debian/rules reverse-config
make[1]: Entering directory `/build/buildd/notify-python-0.1.1'
for i in ./config.guess ./config.sub  ; do \
		if test -e $i.cdbs-orig ; then \
			mv $i.cdbs-orig $i ; \
		fi ; \
	done
make[1]: Leaving directory `/build/buildd/notify-python-0.1.1'
if [ "debian/stamp-patched" = "reverse-patches" ]; then rm -f debian/stamp-patched; fi
patches: 
if [ "debian/stamp-patched" != "reverse-patches" ]; then touch debian/stamp-patched; fi
if [ "debian/stamp-patched" != "reverse-patches" ] ; then \
		/usr/bin/make -f debian/rules update-config ; \
	fi
make[1]: Entering directory `/build/buildd/notify-python-0.1.1'
if test -e /usr/share/misc/config.guess ; then \
		for i in ./config.guess ; do \
			if ! test -e $i.cdbs-orig ; then \
				mv $i $i.cdbs-orig ; \
				cp --remove-destination /usr/share/misc/config.guess $i ; \
			fi ; \
		done ; \
	fi
if test -e /usr/share/misc/config.sub ; then \
		for i in ./config.sub ; do \
			if ! test -e $i.cdbs-orig ; then \
				mv $i $i.cdbs-orig ; \
				cp --remove-destination /usr/share/misc/config.sub $i ; \
			fi ; \
		done ; \
	fi
make[1]: Leaving directory `/build/buildd/notify-python-0.1.1'
if test -e /usr/share/misc/config.guess ; then \
		for i in ./config.guess ; do \
			if ! test -e $i.cdbs-orig ; then \
				mv $i $i.cdbs-orig ; \
				cp --remove-destination /usr/share/misc/config.guess $i ; \
			fi ; \
		done ; \
	fi
if test -e /usr/share/misc/config.sub ; then \
		for i in ./config.sub ; do \
			if ! test -e $i.cdbs-orig ; then \
				mv $i $i.cdbs-orig ; \
				cp --remove-destination /usr/share/misc/config.sub $i ; \
			fi ; \
		done ; \
	fi
dh_testdir
mkdir -p build-2.6
cd build-2.6 && \
		PYTHON=/usr/bin/python2.6 CFLAGS="-g -O2 -Wall -g -O2" \
			/build/buildd/notify-python-0.1.1/configure --prefix=/usr --build=x86_64-linux-gnu
checking for a BSD-compatible install... /usr/bin/install -c
checking whether build environment is sane... yes
checking for gawk... no
checking for mawk... mawk
checking whether make sets $(MAKE)... yes
checking for gcc... gcc
checking for C compiler default output file name... a.out
checking whether the C compiler works... yes
checking whether we are cross compiling... no
checking for suffix of executables... 
checking for suffix of object files... o
checking whether we are using the GNU C compiler... yes
checking whether gcc accepts -g... yes
checking for gcc option to accept ANSI C... none needed
checking for style of include used by make... GNU
checking dependency style of gcc... gcc3
checking build system type... x86_64-pc-linux-gnu
checking host system type... x86_64-pc-linux-gnu
checking for a sed that does not truncate output... /bin/sed
checking for egrep... grep -E
checking for ld used by gcc... /usr/bin/ld
checking if the linker (/usr/bin/ld) is GNU ld... yes
checking for /usr/bin/ld option to reload object files... -r
checking for BSD-compatible nm... /usr/bin/nm -B
checking whether ln -s works... yes
checking how to recognise dependent libraries... pass_all
checking how to run the C preprocessor... gcc -E
checking for ANSI C header files... yes
checking for sys/types.h... yes
checking for sys/stat.h... yes
checking for stdlib.h... yes
checking for string.h... yes
checking for memory.h... yes
checking for strings.h... yes
checking for inttypes.h... yes
checking for stdint.h... yes
checking for unistd.h... yes
checking dlfcn.h usability... yes
checking dlfcn.h presence... yes
checking for dlfcn.h... yes
checking for g++... g++
checking whether we are using the GNU C++ compiler... yes
checking whether g++ accepts -g... yes
checking dependency style of g++... gcc3
checking how to run the C++ preprocessor... g++ -E
checking for g77... no
checking for f77... no
checking for xlf... no
checking for frt... no
checking for pgf77... no
checking for fort77... no
checking for fl32... no
checking for af77... no
checking for f90... no
checking for xlf90... no
checking for pgf90... no
checking for epcf90... no
checking for f95... no
checking for fort... no
checking for xlf95... no
checking for ifc... no
checking for efc... no
checking for pgf95... no
checking for lf95... no
checking for gfortran... no
checking whether we are using the GNU Fortran 77 compiler... no
checking whether  accepts -g... no
checking the maximum length of command line arguments... 32768
checking command to parse /usr/bin/nm -B output from gcc object... ok
checking for objdir... .libs
checking for ar... ar
checking for ranlib... ranlib
checking for strip... strip
checking if gcc supports -fno-rtti -fno-exceptions... no
checking for gcc option to produce PIC... -fPIC
checking if gcc PIC flag -fPIC works... yes
checking if gcc static flag -static works... yes
checking if gcc supports -c -o file.o... yes
checking whether the gcc linker (/usr/bin/ld -m elf_x86_64) supports shared libraries... yes
checking whether -lc should be explicitly linked in... no
checking dynamic linker characteristics... GNU/Linux ld.so
checking how to hardcode library paths into programs... immediate
checking whether stripping libraries is possible... yes
checking if libtool supports shared libraries... yes
checking whether to build shared libraries... yes
checking whether to build static libraries... no
configure: creating libtool
appending configuration tag "CXX" to libtool
checking for ld used by g++... /usr/bin/ld -m elf_x86_64
checking if the linker (/usr/bin/ld -m elf_x86_64) is GNU ld... yes
checking whether the g++ linker (/usr/bin/ld -m elf_x86_64) supports shared libraries... yes
checking for g++ option to produce PIC... -fPIC
checking if g++ PIC flag -fPIC works... yes
checking if g++ static flag -static works... yes
checking if g++ supports -c -o file.o... yes
checking whether the g++ linker (/usr/bin/ld -m elf_x86_64) supports shared libraries... yes
checking dynamic linker characteristics... GNU/Linux ld.so
checking how to hardcode library paths into programs... immediate
appending configuration tag "F77" to libtool
checking whether /usr/bin/python2.6 version >= 2.3.5... yes
checking for /usr/bin/python2.6 version... 2.6
checking for /usr/bin/python2.6 platform... linux2
checking for /usr/bin/python2.6 script directory... /usr/local/lib/python2.6/dist-packages
checking for /usr/bin/python2.6 extension module directory... /usr/local/lib/python2.6/dist-packages
checking for headers required to compile python extensions... found
checking for pkg-config... /usr/bin/pkg-config
checking pkg-config is at least version 0.9.0... yes
checking for NOTIFY_PYTHON... yes
checking for pygtk defs... /usr/share/pygtk/2.0/defs
checking for pygtk codegen... /usr/bin/python2.6 /usr/share/pygobject/2.0/codegen/codegen.py
configure: creating ./config.status
config.status: creating notify-python.pc
config.status: creating Makefile
config.status: creating src/Makefile
config.status: creating tests/Makefile
config.status: creating config.h
config.status: executing depfiles commands

notify-python v0.1.1

Now type make to compile
Then su to root and type: make install

touch build-2.6/configure-stamp
dh_testdir
/usr/bin/make -C build-2.6
make[1]: Entering directory `/build/buildd/notify-python-0.1.1/build-2.6'
/usr/bin/make  all-recursive
make[2]: Entering directory `/build/buildd/notify-python-0.1.1/build-2.6'
Making all in src
make[3]: Entering directory `/build/buildd/notify-python-0.1.1/build-2.6/src'
if /bin/bash ../libtool --tag=CC --mode=compile gcc -DHAVE_CONFIG_H -I. -I/build/buildd/notify-python-0.1.1/src -I.. -DG_LOG_DOMAIN=\"pynotify-python\" -DDATADIR=\"/usr/share\" -DLIBDIR=\"/usr/lib\" -D_REENTRANT -I/usr/include/pygtk-2.0 -I/usr/include/glib-2.0 -I/usr/lib/glib-2.0/include -I/usr/include/gtk-2.0 -I/usr/include/dbus-1.0 -I/usr/lib/dbus-1.0/include -I/usr/lib/gtk-2.0/include -I/usr/include/atk-1.0 -I/usr/include/cairo -I/usr/include/pango-1.0 -I/usr/include/pixman-1 -I/usr/include/freetype2 -I/usr/include/directfb -I/usr/include/libpng12   -I/usr/include/python2.6    -g -O2 -Wall -g -O2 -MT pynotifymodule.lo -MD -MP -MF ".deps/pynotifymodule.Tpo" -c -o pynotifymodule.lo /build/buildd/notify-python-0.1.1/src/pynotifymodule.c; \
	then mv -f ".deps/pynotifymodule.Tpo" ".deps/pynotifymodule.Plo"; else rm -f ".deps/pynotifymodule.Tpo"; exit 1; fi
mkdir .libs
 gcc -DHAVE_CONFIG_H -I. -I/build/buildd/notify-python-0.1.1/src -I.. -DG_LOG_DOMAIN=\"pynotify-python\" -DDATADIR=\"/usr/share\" -DLIBDIR=\"/usr/lib\" -D_REENTRANT -I/usr/include/pygtk-2.0 -I/usr/include/glib-2.0 -I/usr/lib/glib-2.0/include -I/usr/include/gtk-2.0 -I/usr/include/dbus-1.0 -I/usr/lib/dbus-1.0/include -I/usr/lib/gtk-2.0/include -I/usr/include/atk-1.0 -I/usr/include/cairo -I/usr/include/pango-1.0 -I/usr/include/pixman-1 -I/usr/include/freetype2 -I/usr/include/directfb -I/usr/include/libpng12 -I/usr/include/python2.6 -g -O2 -Wall -g -O2 -MT pynotifymodule.lo -MD -MP -MF .deps/pynotifymodule.Tpo -c /build/buildd/notify-python-0.1.1/src/pynotifymodule.c  -fPIC -DPIC -o .libs/pynotifymodule.o
/build/buildd/notify-python-0.1.1/src/pynotifymodule.c: In function 'init_pynotify':
/build/buildd/notify-python-0.1.1/src/pynotifymodule.c:19: warning: implicit declaration of function 'pypynotify_register_classes'
/build/buildd/notify-python-0.1.1/src/pynotifymodule.c:20: warning: implicit declaration of function 'pypynotify_add_constants'
(cd /build/buildd/notify-python-0.1.1/src \
	 && /usr/bin/python2.6 /usr/share/pygobject/2.0/codegen/codegen.py \
		--register /usr/share/pygtk/2.0/defs/gtk-types.defs \
		--register /usr/share/pygtk/2.0/defs/gdk-types.defs \
	    --override pynotify.override \
	    --prefix pypynotify pynotify.defs) > gen-pynotify.c \
	 && cp gen-pynotify.c pynotify.c \
	 && rm -f gen-pynotify.c
/usr/share/pygobject/2.0/codegen/definitions.py:42: DeprecationWarning: object.__init__() takes no parameters
  str.__init__(self, type_name)
Warning: generating old-style constructor for:notify_notification_new
Warning: Constructor for NotifyNotification needs to be updated to new API
         See http://live.gnome.org/PyGTK_2fWhatsNew28#update-constructors
***INFO*** The coverage of global functions is 100.00% (6/6)
***INFO*** The coverage of methods is 100.00% (18/18)
***INFO*** There are no declared virtual proxies.
***INFO*** There are no declared virtual accessors.
***INFO*** There are no declared interface proxies.
if /bin/bash ../libtool --tag=CC --mode=compile gcc -DHAVE_CONFIG_H -I. -I/build/buildd/notify-python-0.1.1/src -I.. -DG_LOG_DOMAIN=\"pynotify-python\" -DDATADIR=\"/usr/share\" -DLIBDIR=\"/usr/lib\" -D_REENTRANT -I/usr/include/pygtk-2.0 -I/usr/include/glib-2.0 -I/usr/lib/glib-2.0/include -I/usr/include/gtk-2.0 -I/usr/include/dbus-1.0 -I/usr/lib/dbus-1.0/include -I/usr/lib/gtk-2.0/include -I/usr/include/atk-1.0 -I/usr/include/cairo -I/usr/include/pango-1.0 -I/usr/include/pixman-1 -I/usr/include/freetype2 -I/usr/include/directfb -I/usr/include/libpng12   -I/usr/include/python2.6    -g -O2 -Wall -g -O2 -MT pynotify.lo -MD -MP -MF ".deps/pynotify.Tpo" -c -o pynotify.lo pynotify.c; \
	then mv -f ".deps/pynotify.Tpo" ".deps/pynotify.Plo"; else rm -f ".deps/pynotify.Tpo"; exit 1; fi
 gcc -DHAVE_CONFIG_H -I. -I/build/buildd/notify-python-0.1.1/src -I.. -DG_LOG_DOMAIN=\"pynotify-python\" -DDATADIR=\"/usr/share\" -DLIBDIR=\"/usr/lib\" -D_REENTRANT -I/usr/include/pygtk-2.0 -I/usr/include/glib-2.0 -I/usr/lib/glib-2.0/include -I/usr/include/gtk-2.0 -I/usr/include/dbus-1.0 -I/usr/lib/dbus-1.0/include -I/usr/lib/gtk-2.0/include -I/usr/include/atk-1.0 -I/usr/include/cairo -I/usr/include/pango-1.0 -I/usr/include/pixman-1 -I/usr/include/freetype2 -I/usr/include/directfb -I/usr/include/libpng12 -I/usr/include/python2.6 -g -O2 -Wall -g -O2 -MT pynotify.lo -MD -MP -MF .deps/pynotify.Tpo -c pynotify.c  -fPIC -DPIC -o .libs/pynotify.o
pynotify.override:45: warning: 'pygalago_wrap_gobj_list' defined but not used
pynotify.override: In function 'pygalago_unwrap_gobj_list':
pynotify.override:76: warning: 'items' may be used uninitialized in this function
/bin/bash ../libtool --tag=CC --mode=link gcc  -g -O2 -Wall -g -O2  -Wl,-Bsymbolic-functions -o _pynotify.la -rpath /usr/local/lib/python2.6/dist-packages/gtk-2.0/pynotify -module -avoid-version -export-symbols-regex init_pynotify pynotifymodule.lo pynotify.lo -L//lib -lnotify -lgtk-x11-2.0 -ldbus-glib-1 -lgdk-x11-2.0 -latk-1.0 -lpangoft2-1.0 -lgdk_pixbuf-2.0 -lm -lpangocairo-1.0 -lgio-2.0 -lcairo -lpango-1.0 -lfreetype -lfontconfig -lgmodule-2.0 -ldbus-1 -lgobject-2.0 -lglib-2.0   
generating symbol list for `_pynotify.la'
/usr/bin/nm -B  .libs/pynotifymodule.o .libs/pynotify.o  | sed -n -e 's/^.*[ 	]\([ABCDGIRSTW][ABCDGIRSTW]*\)[ 	][ 	]*\([_A-Za-z][_A-Za-z0-9]*\)$/\1 \2 \2/p' | /bin/sed 's/.* //' | sort | uniq > .libs/_pynotify.exp
grep -E -e "init_pynotify" ".libs/_pynotify.exp" > ".libs/_pynotify.expT"
mv -f ".libs/_pynotify.expT" ".libs/_pynotify.exp"
echo "{ global:" > .libs/_pynotify.ver
 cat .libs/_pynotify.exp | sed -e "s/\(.*\)/\1;/" >> .libs/_pynotify.ver
 echo "local: *; };" >> .libs/_pynotify.ver
 gcc -shared  .libs/pynotifymodule.o .libs/pynotify.o  -L//lib /usr/lib/libnotify.so /usr/lib/libgtk-x11-2.0.so -ldbus-glib-1 /usr/lib/libgdk-x11-2.0.so /usr/lib/libatk-1.0.so /usr/lib/libpangoft2-1.0.so /usr/lib/libgdk_pixbuf-2.0.so -lm /usr/lib/libpangocairo-1.0.so /usr/lib/libgio-2.0.so /usr/lib/libcairo.so /usr/lib/libpango-1.0.so /usr/lib/libfreetype.so -lfontconfig /usr/lib/libgmodule-2.0.so -ldbus-1 /usr/lib/libgobject-2.0.so /usr/lib/libglib-2.0.so  -Wl,-Bsymbolic-functions -Wl,-soname -Wl,_pynotify.so -Wl,-version-script -Wl,.libs/_pynotify.ver -o .libs/_pynotify.so
creating _pynotify.la
(cd .libs && rm -f _pynotify.la && ln -s ../_pynotify.la _pynotify.la)
make[3]: Leaving directory `/build/buildd/notify-python-0.1.1/build-2.6/src'
Making all in tests
make[3]: Entering directory `/build/buildd/notify-python-0.1.1/build-2.6/tests'
make[3]: Nothing to be done for `all'.
make[3]: Leaving directory `/build/buildd/notify-python-0.1.1/build-2.6/tests'
make[3]: Entering directory `/build/buildd/notify-python-0.1.1/build-2.6'
make[3]: Nothing to be done for `all-am'.
make[3]: Leaving directory `/build/buildd/notify-python-0.1.1/build-2.6'
make[2]: Leaving directory `/build/buildd/notify-python-0.1.1/build-2.6'
make[1]: Leaving directory `/build/buildd/notify-python-0.1.1/build-2.6'
touch build-2.6/build-stamp
dh_testdir
mkdir -p build-2.5
cd build-2.5 && \
		PYTHON=/usr/bin/python2.5 CFLAGS="-g -O2 -Wall -g -O2" \
			/build/buildd/notify-python-0.1.1/configure --prefix=/usr --build=x86_64-linux-gnu
checking for a BSD-compatible install... /usr/bin/install -c
checking whether build environment is sane... yes
checking for gawk... no
checking for mawk... mawk
checking whether make sets $(MAKE)... yes
checking for gcc... gcc
checking for C compiler default output file name... a.out
checking whether the C compiler works... yes
checking whether we are cross compiling... no
checking for suffix of executables... 
checking for suffix of object files... o
checking whether we are using the GNU C compiler... yes
checking whether gcc accepts -g... yes
checking for gcc option to accept ANSI C... none needed
checking for style of include used by make... GNU
checking dependency style of gcc... gcc3
checking build system type... x86_64-pc-linux-gnu
checking host system type... x86_64-pc-linux-gnu
checking for a sed that does not truncate output... /bin/sed
checking for egrep... grep -E
checking for ld used by gcc... /usr/bin/ld
checking if the linker (/usr/bin/ld) is GNU ld... yes
checking for /usr/bin/ld option to reload object files... -r
checking for BSD-compatible nm... /usr/bin/nm -B
checking whether ln -s works... yes
checking how to recognise dependent libraries... pass_all
checking how to run the C preprocessor... gcc -E
checking for ANSI C header files... yes
checking for sys/types.h... yes
checking for sys/stat.h... yes
checking for stdlib.h... yes
checking for string.h... yes
checking for memory.h... yes
checking for strings.h... yes
checking for inttypes.h... yes
checking for stdint.h... yes
checking for unistd.h... yes
checking dlfcn.h usability... yes
checking dlfcn.h presence... yes
checking for dlfcn.h... yes
checking for g++... g++
checking whether we are using the GNU C++ compiler... yes
checking whether g++ accepts -g... yes
checking dependency style of g++... gcc3
checking how to run the C++ preprocessor... g++ -E
checking for g77... no
checking for f77... no
checking for xlf... no
checking for frt... no
checking for pgf77... no
checking for fort77... no
checking for fl32... no
checking for af77... no
checking for f90... no
checking for xlf90... no
checking for pgf90... no
checking for epcf90... no
checking for f95... no
checking for fort... no
checking for xlf95... no
checking for ifc... no
checking for efc... no
checking for pgf95... no
checking for lf95... no
checking for gfortran... no
checking whether we are using the GNU Fortran 77 compiler... no
checking whether  accepts -g... no
checking the maximum length of command line arguments... 32768
checking command to parse /usr/bin/nm -B output from gcc object... ok
checking for objdir... .libs
checking for ar... ar
checking for ranlib... ranlib
checking for strip... strip
checking if gcc supports -fno-rtti -fno-exceptions... no
checking for gcc option to produce PIC... -fPIC
checking if gcc PIC flag -fPIC works... yes
checking if gcc static flag -static works... yes
checking if gcc supports -c -o file.o... yes
checking whether the gcc linker (/usr/bin/ld -m elf_x86_64) supports shared libraries... yes
checking whether -lc should be explicitly linked in... no
checking dynamic linker characteristics... GNU/Linux ld.so
checking how to hardcode library paths into programs... immediate
checking whether stripping libraries is possible... yes
checking if libtool supports shared libraries... yes
checking whether to build shared libraries... yes
checking whether to build static libraries... no
configure: creating libtool
appending configuration tag "CXX" to libtool
checking for ld used by g++... /usr/bin/ld -m elf_x86_64
checking if the linker (/usr/bin/ld -m elf_x86_64) is GNU ld... yes
checking whether the g++ linker (/usr/bin/ld -m elf_x86_64) supports shared libraries... yes
checking for g++ option to produce PIC... -fPIC
checking if g++ PIC flag -fPIC works... yes
checking if g++ static flag -static works... yes
checking if g++ supports -c -o file.o... yes
checking whether the g++ linker (/usr/bin/ld -m elf_x86_64) supports shared libraries... yes
checking dynamic linker characteristics... GNU/Linux ld.so
checking how to hardcode library paths into programs... immediate
appending configuration tag "F77" to libtool
checking whether /usr/bin/python2.5 version >= 2.3.5... yes
checking for /usr/bin/python2.5 version... 2.5
checking for /usr/bin/python2.5 platform... linux2
checking for /usr/bin/python2.5 script directory... ${prefix}/lib/python2.5/site-packages
checking for /usr/bin/python2.5 extension module directory... ${exec_prefix}/lib/python2.5/site-packages
checking for headers required to compile python extensions... found
checking for pkg-config... /usr/bin/pkg-config
checking pkg-config is at least version 0.9.0... yes
checking for NOTIFY_PYTHON... yes
checking for pygtk defs... /usr/share/pygtk/2.0/defs
checking for pygtk codegen... /usr/bin/python2.5 /usr/share/pygobject/2.0/codegen/codegen.py
configure: creating ./config.status
config.status: creating notify-python.pc
config.status: creating Makefile
config.status: creating src/Makefile
config.status: creating tests/Makefile
config.status: creating config.h
config.status: executing depfiles commands

notify-python v0.1.1

Now type make to compile
Then su to root and type: make install

touch build-2.5/configure-stamp
dh_testdir
/usr/bin/make -C build-2.5
make[1]: Entering directory `/build/buildd/notify-python-0.1.1/build-2.5'
/usr/bin/make  all-recursive
make[2]: Entering directory `/build/buildd/notify-python-0.1.1/build-2.5'
Making all in src
make[3]: Entering directory `/build/buildd/notify-python-0.1.1/build-2.5/src'
if /bin/bash ../libtool --tag=CC --mode=compile gcc -DHAVE_CONFIG_H -I. -I/build/buildd/notify-python-0.1.1/src -I.. -DG_LOG_DOMAIN=\"pynotify-python\" -DDATADIR=\"/usr/share\" -DLIBDIR=\"/usr/lib\" -D_REENTRANT -I/usr/include/pygtk-2.0 -I/usr/include/glib-2.0 -I/usr/lib/glib-2.0/include -I/usr/include/gtk-2.0 -I/usr/include/dbus-1.0 -I/usr/lib/dbus-1.0/include -I/usr/lib/gtk-2.0/include -I/usr/include/atk-1.0 -I/usr/include/cairo -I/usr/include/pango-1.0 -I/usr/include/pixman-1 -I/usr/include/freetype2 -I/usr/include/directfb -I/usr/include/libpng12   -I/usr/include/python2.5    -g -O2 -Wall -g -O2 -MT pynotifymodule.lo -MD -MP -MF ".deps/pynotifymodule.Tpo" -c -o pynotifymodule.lo /build/buildd/notify-python-0.1.1/src/pynotifymodule.c; \
	then mv -f ".deps/pynotifymodule.Tpo" ".deps/pynotifymodule.Plo"; else rm -f ".deps/pynotifymodule.Tpo"; exit 1; fi
mkdir .libs
 gcc -DHAVE_CONFIG_H -I. -I/build/buildd/notify-python-0.1.1/src -I.. -DG_LOG_DOMAIN=\"pynotify-python\" -DDATADIR=\"/usr/share\" -DLIBDIR=\"/usr/lib\" -D_REENTRANT -I/usr/include/pygtk-2.0 -I/usr/include/glib-2.0 -I/usr/lib/glib-2.0/include -I/usr/include/gtk-2.0 -I/usr/include/dbus-1.0 -I/usr/lib/dbus-1.0/include -I/usr/lib/gtk-2.0/include -I/usr/include/atk-1.0 -I/usr/include/cairo -I/usr/include/pango-1.0 -I/usr/include/pixman-1 -I/usr/include/freetype2 -I/usr/include/directfb -I/usr/include/libpng12 -I/usr/include/python2.5 -g -O2 -Wall -g -O2 -MT pynotifymodule.lo -MD -MP -MF .deps/pynotifymodule.Tpo -c /build/buildd/notify-python-0.1.1/src/pynotifymodule.c  -fPIC -DPIC -o .libs/pynotifymodule.o
/build/buildd/notify-python-0.1.1/src/pynotifymodule.c: In function 'init_pynotify':
/build/buildd/notify-python-0.1.1/src/pynotifymodule.c:19: warning: implicit declaration of function 'pypynotify_register_classes'
/build/buildd/notify-python-0.1.1/src/pynotifymodule.c:20: warning: implicit declaration of function 'pypynotify_add_constants'
(cd /build/buildd/notify-python-0.1.1/src \
	 && /usr/bin/python2.5 /usr/share/pygobject/2.0/codegen/codegen.py \
		--register /usr/share/pygtk/2.0/defs/gtk-types.defs \
		--register /usr/share/pygtk/2.0/defs/gdk-types.defs \
	    --override pynotify.override \
	    --prefix pypynotify pynotify.defs) > gen-pynotify.c \
	 && cp gen-pynotify.c pynotify.c \
	 && rm -f gen-pynotify.c
Warning: generating old-style constructor for:notify_notification_new
Warning: Constructor for NotifyNotification needs to be updated to new API
         See http://live.gnome.org/PyGTK_2fWhatsNew28#update-constructors
***INFO*** The coverage of global functions is 100.00% (6/6)
***INFO*** The coverage of methods is 100.00% (18/18)
***INFO*** There are no declared virtual proxies.
***INFO*** There are no declared virtual accessors.
***INFO*** There are no declared interface proxies.
if /bin/bash ../libtool --tag=CC --mode=compile gcc -DHAVE_CONFIG_H -I. -I/build/buildd/notify-python-0.1.1/src -I.. -DG_LOG_DOMAIN=\"pynotify-python\" -DDATADIR=\"/usr/share\" -DLIBDIR=\"/usr/lib\" -D_REENTRANT -I/usr/include/pygtk-2.0 -I/usr/include/glib-2.0 -I/usr/lib/glib-2.0/include -I/usr/include/gtk-2.0 -I/usr/include/dbus-1.0 -I/usr/lib/dbus-1.0/include -I/usr/lib/gtk-2.0/include -I/usr/include/atk-1.0 -I/usr/include/cairo -I/usr/include/pango-1.0 -I/usr/include/pixman-1 -I/usr/include/freetype2 -I/usr/include/directfb -I/usr/include/libpng12   -I/usr/include/python2.5    -g -O2 -Wall -g -O2 -MT pynotify.lo -MD -MP -MF ".deps/pynotify.Tpo" -c -o pynotify.lo pynotify.c; \
	then mv -f ".deps/pynotify.Tpo" ".deps/pynotify.Plo"; else rm -f ".deps/pynotify.Tpo"; exit 1; fi
 gcc -DHAVE_CONFIG_H -I. -I/build/buildd/notify-python-0.1.1/src -I.. -DG_LOG_DOMAIN=\"pynotify-python\" -DDATADIR=\"/usr/share\" -DLIBDIR=\"/usr/lib\" -D_REENTRANT -I/usr/include/pygtk-2.0 -I/usr/include/glib-2.0 -I/usr/lib/glib-2.0/include -I/usr/include/gtk-2.0 -I/usr/include/dbus-1.0 -I/usr/lib/dbus-1.0/include -I/usr/lib/gtk-2.0/include -I/usr/include/atk-1.0 -I/usr/include/cairo -I/usr/include/pango-1.0 -I/usr/include/pixman-1 -I/usr/include/freetype2 -I/usr/include/directfb -I/usr/include/libpng12 -I/usr/include/python2.5 -g -O2 -Wall -g -O2 -MT pynotify.lo -MD -MP -MF .deps/pynotify.Tpo -c pynotify.c  -fPIC -DPIC -o .libs/pynotify.o
pynotify.override:45: warning: 'pygalago_wrap_gobj_list' defined but not used
pynotify.override: In function 'pygalago_unwrap_gobj_list':
pynotify.override:76: warning: 'items' may be used uninitialized in this function
/bin/bash ../libtool --tag=CC --mode=link gcc  -g -O2 -Wall -g -O2  -Wl,-Bsymbolic-functions -o _pynotify.la -rpath /usr/lib/python2.5/site-packages/gtk-2.0/pynotify -module -avoid-version -export-symbols-regex init_pynotify pynotifymodule.lo pynotify.lo -L//lib -lnotify -lgtk-x11-2.0 -ldbus-glib-1 -lgdk-x11-2.0 -latk-1.0 -lpangoft2-1.0 -lgdk_pixbuf-2.0 -lm -lpangocairo-1.0 -lgio-2.0 -lcairo -lpango-1.0 -lfreetype -lfontconfig -lgmodule-2.0 -ldbus-1 -lgobject-2.0 -lglib-2.0   
generating symbol list for `_pynotify.la'
/usr/bin/nm -B  .libs/pynotifymodule.o .libs/pynotify.o  | sed -n -e 's/^.*[ 	]\([ABCDGIRSTW][ABCDGIRSTW]*\)[ 	][ 	]*\([_A-Za-z][_A-Za-z0-9]*\)$/\1 \2 \2/p' | /bin/sed 's/.* //' | sort | uniq > .libs/_pynotify.exp
grep -E -e "init_pynotify" ".libs/_pynotify.exp" > ".libs/_pynotify.expT"
mv -f ".libs/_pynotify.expT" ".libs/_pynotify.exp"
echo "{ global:" > .libs/_pynotify.ver
 cat .libs/_pynotify.exp | sed -e "s/\(.*\)/\1;/" >> .libs/_pynotify.ver
 echo "local: *; };" >> .libs/_pynotify.ver
 gcc -shared  .libs/pynotifymodule.o .libs/pynotify.o  -L//lib /usr/lib/libnotify.so /usr/lib/libgtk-x11-2.0.so -ldbus-glib-1 /usr/lib/libgdk-x11-2.0.so /usr/lib/libatk-1.0.so /usr/lib/libpangoft2-1.0.so /usr/lib/libgdk_pixbuf-2.0.so -lm /usr/lib/libpangocairo-1.0.so /usr/lib/libgio-2.0.so /usr/lib/libcairo.so /usr/lib/libpango-1.0.so /usr/lib/libfreetype.so -lfontconfig /usr/lib/libgmodule-2.0.so -ldbus-1 /usr/lib/libgobject-2.0.so /usr/lib/libglib-2.0.so  -Wl,-Bsymbolic-functions -Wl,-soname -Wl,_pynotify.so -Wl,-version-script -Wl,.libs/_pynotify.ver -o .libs/_pynotify.so
creating _pynotify.la
(cd .libs && rm -f _pynotify.la && ln -s ../_pynotify.la _pynotify.la)
make[3]: Leaving directory `/build/buildd/notify-python-0.1.1/build-2.5/src'
Making all in tests
make[3]: Entering directory `/build/buildd/notify-python-0.1.1/build-2.5/tests'
make[3]: Nothing to be done for `all'.
make[3]: Leaving directory `/build/buildd/notify-python-0.1.1/build-2.5/tests'
make[3]: Entering directory `/build/buildd/notify-python-0.1.1/build-2.5'
make[3]: Nothing to be done for `all-am'.
make[3]: Leaving directory `/build/buildd/notify-python-0.1.1/build-2.5'
make[2]: Leaving directory `/build/buildd/notify-python-0.1.1/build-2.5'
make[1]: Leaving directory `/build/buildd/notify-python-0.1.1/build-2.5'
touch build-2.5/build-stamp
rm build-2.5/configure-stamp build-2.6/configure-stamp
 /usr/bin/fakeroot debian/rules binary-arch
dh_testdir
dh_testroot
/usr/bin/make -C build-2.6 install DESTDIR=/build/buildd/notify-python-0.1.1/debian/python-notify
make[1]: Entering directory `/build/buildd/notify-python-0.1.1/build-2.6'
Making install in src
make[2]: Entering directory `/build/buildd/notify-python-0.1.1/build-2.6/src'
make[3]: Entering directory `/build/buildd/notify-python-0.1.1/build-2.6/src'
make[3]: Nothing to be done for `install-exec-am'.
test -z "/usr/share/pygtk/2.0/defs" || mkdir -p -- "/build/buildd/notify-python-0.1.1/debian/python-notify/usr/share/pygtk/2.0/defs"
 /usr/bin/install -c -m 644 '/build/buildd/notify-python-0.1.1/src/pynotify.defs' '/build/buildd/notify-python-0.1.1/debian/python-notify/usr/share/pygtk/2.0/defs/pynotify.defs'
test -z "/usr/local/lib/python2.6/dist-packages/gtk-2.0/pynotify" || mkdir -p -- "/build/buildd/notify-python-0.1.1/debian/python-notify/usr/local/lib/python2.6/dist-packages/gtk-2.0/pynotify"
 /usr/bin/install -c -m 644 '/build/buildd/notify-python-0.1.1/src/__init__.py' '/build/buildd/notify-python-0.1.1/debian/python-notify/usr/local/lib/python2.6/dist-packages/gtk-2.0/pynotify/__init__.py'
Byte-compiling python modules...
__init__.py
Byte-compiling python modules (optimized versions) ...
__init__.py
test -z "/usr/local/lib/python2.6/dist-packages/gtk-2.0/pynotify" || mkdir -p -- "/build/buildd/notify-python-0.1.1/debian/python-notify/usr/local/lib/python2.6/dist-packages/gtk-2.0/pynotify"
 /bin/bash ../libtool --mode=install /usr/bin/install -c  '_pynotify.la' '/build/buildd/notify-python-0.1.1/debian/python-notify/usr/local/lib/python2.6/dist-packages/gtk-2.0/pynotify/_pynotify.la'
/usr/bin/install -c .libs/_pynotify.so /build/buildd/notify-python-0.1.1/debian/python-notify/usr/local/lib/python2.6/dist-packages/gtk-2.0/pynotify/_pynotify.so
/usr/bin/install -c .libs/_pynotify.lai /build/buildd/notify-python-0.1.1/debian/python-notify/usr/local/lib/python2.6/dist-packages/gtk-2.0/pynotify/_pynotify.la
libtool: install: warning: remember to run `libtool --finish /usr/local/lib/python2.6/dist-packages/gtk-2.0/pynotify'
make[3]: Leaving directory `/build/buildd/notify-python-0.1.1/build-2.6/src'
make[2]: Leaving directory `/build/buildd/notify-python-0.1.1/build-2.6/src'
Making install in tests
make[2]: Entering directory `/build/buildd/notify-python-0.1.1/build-2.6/tests'
make[3]: Entering directory `/build/buildd/notify-python-0.1.1/build-2.6/tests'
make[3]: Nothing to be done for `install-exec-am'.
make[3]: Nothing to be done for `install-data-am'.
make[3]: Leaving directory `/build/buildd/notify-python-0.1.1/build-2.6/tests'
make[2]: Leaving directory `/build/buildd/notify-python-0.1.1/build-2.6/tests'
make[2]: Entering directory `/build/buildd/notify-python-0.1.1/build-2.6'
make[3]: Entering directory `/build/buildd/notify-python-0.1.1/build-2.6'
make[3]: Nothing to be done for `install-exec-am'.
test -z "/usr/lib/pkgconfig" || mkdir -p -- "/build/buildd/notify-python-0.1.1/debian/python-notify/usr/lib/pkgconfig"
 /usr/bin/install -c -m 644 'notify-python.pc' '/build/buildd/notify-python-0.1.1/debian/python-notify/usr/lib/pkgconfig/notify-python.pc'
make[3]: Leaving directory `/build/buildd/notify-python-0.1.1/build-2.6'
make[2]: Leaving directory `/build/buildd/notify-python-0.1.1/build-2.6'
make[1]: Leaving directory `/build/buildd/notify-python-0.1.1/build-2.6'
dh_testdir
dh_testroot
/usr/bin/make -C build-2.5 install DESTDIR=/build/buildd/notify-python-0.1.1/debian/python-notify
make[1]: Entering directory `/build/buildd/notify-python-0.1.1/build-2.5'
Making install in src
make[2]: Entering directory `/build/buildd/notify-python-0.1.1/build-2.5/src'
make[3]: Entering directory `/build/buildd/notify-python-0.1.1/build-2.5/src'
make[3]: Nothing to be done for `install-exec-am'.
test -z "/usr/share/pygtk/2.0/defs" || mkdir -p -- "/build/buildd/notify-python-0.1.1/debian/python-notify/usr/share/pygtk/2.0/defs"
 /usr/bin/install -c -m 644 '/build/buildd/notify-python-0.1.1/src/pynotify.defs' '/build/buildd/notify-python-0.1.1/debian/python-notify/usr/share/pygtk/2.0/defs/pynotify.defs'
test -z "/usr/lib/python2.5/site-packages/gtk-2.0/pynotify" || mkdir -p -- "/build/buildd/notify-python-0.1.1/debian/python-notify/usr/lib/python2.5/site-packages/gtk-2.0/pynotify"
 /usr/bin/install -c -m 644 '/build/buildd/notify-python-0.1.1/src/__init__.py' '/build/buildd/notify-python-0.1.1/debian/python-notify/usr/lib/python2.5/site-packages/gtk-2.0/pynotify/__init__.py'
Byte-compiling python modules...
__init__.py
Byte-compiling python modules (optimized versions) ...
__init__.py
test -z "/usr/lib/python2.5/site-packages/gtk-2.0/pynotify" || mkdir -p -- "/build/buildd/notify-python-0.1.1/debian/python-notify/usr/lib/python2.5/site-packages/gtk-2.0/pynotify"
 /bin/bash ../libtool --mode=install /usr/bin/install -c  '_pynotify.la' '/build/buildd/notify-python-0.1.1/debian/python-notify/usr/lib/python2.5/site-packages/gtk-2.0/pynotify/_pynotify.la'
/usr/bin/install -c .libs/_pynotify.so /build/buildd/notify-python-0.1.1/debian/python-notify/usr/lib/python2.5/site-packages/gtk-2.0/pynotify/_pynotify.so
/usr/bin/install -c .libs/_pynotify.lai /build/buildd/notify-python-0.1.1/debian/python-notify/usr/lib/python2.5/site-packages/gtk-2.0/pynotify/_pynotify.la
libtool: install: warning: remember to run `libtool --finish /usr/lib/python2.5/site-packages/gtk-2.0/pynotify'
make[3]: Leaving directory `/build/buildd/notify-python-0.1.1/build-2.5/src'
make[2]: Leaving directory `/build/buildd/notify-python-0.1.1/build-2.5/src'
Making install in tests
make[2]: Entering directory `/build/buildd/notify-python-0.1.1/build-2.5/tests'
make[3]: Entering directory `/build/buildd/notify-python-0.1.1/build-2.5/tests'
make[3]: Nothing to be done for `install-exec-am'.
make[3]: Nothing to be done for `install-data-am'.
make[3]: Leaving directory `/build/buildd/notify-python-0.1.1/build-2.5/tests'
make[2]: Leaving directory `/build/buildd/notify-python-0.1.1/build-2.5/tests'
make[2]: Entering directory `/build/buildd/notify-python-0.1.1/build-2.5'
make[3]: Entering directory `/build/buildd/notify-python-0.1.1/build-2.5'
make[3]: Nothing to be done for `install-exec-am'.
test -z "/usr/lib/pkgconfig" || mkdir -p -- "/build/buildd/notify-python-0.1.1/debian/python-notify/usr/lib/pkgconfig"
 /usr/bin/install -c -m 644 'notify-python.pc' '/build/buildd/notify-python-0.1.1/debian/python-notify/usr/lib/pkgconfig/notify-python.pc'
make[3]: Leaving directory `/build/buildd/notify-python-0.1.1/build-2.5'
make[2]: Leaving directory `/build/buildd/notify-python-0.1.1/build-2.5'
make[1]: Leaving directory `/build/buildd/notify-python-0.1.1/build-2.5'
test -x debian/rules
test "`id -u`" = 0
mkdir -p "."
if test -e /usr/share/misc/config.guess ; then \
		for i in ./config.guess ; do \
			if ! test -e $i.cdbs-orig ; then \
				mv $i $i.cdbs-orig ; \
				cp --remove-destination /usr/share/misc/config.guess $i ; \
			fi ; \
		done ; \
	fi
if test -e /usr/share/misc/config.sub ; then \
		for i in ./config.sub ; do \
			if ! test -e $i.cdbs-orig ; then \
				mv $i $i.cdbs-orig ; \
				cp --remove-destination /usr/share/misc/config.sub $i ; \
			fi ; \
		done ; \
	fi
dh_testdir
dh_testroot
dh_installdocs -s AUTHORS NEWS
dh_installexamples -s
dh_installchangelogs -s ChangeLog
dh_strip -s
dh_strip debug symbol extraction: disabling for archive rebuild test
dh_strip debug symbol extraction: not doing anything since NO_PKG_MANGLE is given
dh_compress -s
dh_fixperms -s
dh_pysupport -s
Traceback (most recent call last):
  File "/usr/bin/pysupport-movemodules", line 137, in <module>
    do_move (basedir, package, "usr/lib", "site-packages")
  File "/usr/bin/pysupport-movemodules", line 78, in do_move
    file_dict.addsum(relfile,pyvers,md5.new(file(absfile).read()).digest())
AttributeError: 'builtin_function_or_method' object has no attribute 'new'
dh_pysupport: command returned error code 256
make: *** [binary-arch] Error 1
dpkg-buildpackage: failure: /usr/bin/fakeroot debian/rules binary-arch gave error exit status 2
******************************************************************************
Build finished at 20090410-0607
FAILED [dpkg-buildpackage died]
Purging chroot-jaunty-autotest/build/buildd/notify-python-0.1.1
------------------------------------------------------------------------------
  /usr/bin/sudo dpkg --root=/home/buildd/build-jaunty-autotest/chroot-jaunty-autotest --purge groff-base python-gobject-dev libxfixes-dev libx11-data m4 fontconfig-config gettext file zlib1g-dev libhtml-parser-perl ttf-dejavu libcairo2 python2.5-minimal x11-common python2.6 libx11-dev libxi6 automake libjpeg62 libnotify-dev libxcursor1 python-gtk2 x11proto-input-dev libexpat1-dev libjasper1 libpixman-1-dev libjpeg62-dev libxcomposite-dev libfontconfig1 libgnutls26 libdbus-glib-1-2 python-cairo libsysfs-dev libx11-6 libkrb53 xtrans-dev x11proto-randr-dev libglib2.0-0 libnewt0.52 libxinerama-dev libpango1.0-common libxdamage1 libtasn1-3 libffi5 libxml2-utils libdbus-1-dev libhtml-tree-perl libglib2.0-dev libxcb-render-util0 libdirectfb-dev libhtml-tagset-perl libxml2 x11proto-xext-dev pkg-config libthai-data python-all libice6 intltool-debian libxrender1 libfontconfig1-dev libxrandr-dev libxext-dev libdirectfb-extra libcups2 libxau-dev libgpg-error0 libxcb-render-util0-dev libx
 render-dev ttf-dejavu-extra libpng12-dev libxft2 libreadline5 x11proto-render-dev libxext6 libsysfs2 libsqlite3-0 libnotify1 python2.5-dev libxinerama1 libdbus-glib-1-dev libxdamage-dev libsm-dev libncursesw5 defoma libxdmcp-dev ttf-dejavu-core readline-common libcairo2-dev python2.5 fontconfig libxcb-render0-dev liburi-perl autotools-dev libcroco3 python-support libpopt0 libfreetype6 libffi-dev libice-dev libatk1.0-0 libdbus-1-3 libssl0.9.8 x11proto-fixes-dev libfreetype6-dev libgtk2.0-0 x11proto-damage-dev libxcb1 html2text libgcrypt11 python2.6-dev debhelper libpthread-stubs0 libxrandr2 libkeyutils1 libthai0 python libmagic1 python-gobject libtiff4 libexpat1 libdirectfb-1.0-0 bsdmainutils fdupes libxau6 libpango1.0-dev libxcursor-dev libxcomposite1 x11proto-composite-dev mime-support x11proto-core-dev whiptail intltool libts-0.0-0 libxcb1-dev libxi-dev libwww-perl shared-mime-info libxdmcp6 libxfixes3 python-gtk2-dev libgtk2.0-dev po-debconf libatk1.0-dev libxml-parser-pe
 rl libxft-dev netbase libpython2.6 libpng12-0 python-all-dev python-dev man-db x11proto-kb-dev libpixman-1-0 x11proto-xinerama-dev libdatrie0 libpango1.0-0 libpthread-stubs0-dev ucf cdbs libgtk2.0-common gettext-base libsm6 python-central libxcb-render0 autoconf
(Reading database ... 17796 files and directories currently installed.)
Removing libnotify-dev ...
Removing libnotify1 ...
Purging configuration files for libnotify1 ...
Removing libdbus-glib-1-dev ...
Removing python-gtk2-dev ...
Removing libgtk2.0-dev ...
Removing libatk1.0-dev ...
Removing python-all-dev ...
Removing cdbs ...
Removing python-gobject-dev ...
dpkg - warning: while removing python-gobject-dev, directory `/usr/share/gtk-doc/html' not empty so not removed.
dpkg - warning: while removing python-gobject-dev, directory `/usr/share/gtk-doc' not empty so not removed.
Removing python-gtk2 ...
Removing libxcomposite-dev ...
Removing libdbus-glib-1-2 ...
Purging configuration files for libdbus-glib-1-2 ...
Removing python-cairo ...
Removing libxinerama-dev ...
Removing libxml2-utils ...
Removing libdbus-1-dev ...
Removing python-all ...
Removing libxrandr-dev ...
Removing python2.5-dev ...
Removing libxdamage-dev ...
Removing python2.5 ...
Purging configuration files for python2.5 ...
Removing libffi-dev ...
Removing libdbus-1-3 ...
Purging configuration files for libdbus-1-3 ...
Removing libgtk2.0-0 ...
Purging configuration files for libgtk2.0-0 ...
Removing x11proto-damage-dev ...
Removing debhelper ...
Removing libxrandr2 ...
Purging configuration files for libxrandr2 ...
Removing python-gobject ...
Purging configuration files for python-gobject ...
Removing libtiff4 ...
Purging configuration files for libtiff4 ...
Removing fdupes ...
Removing libpango1.0-dev ...
Removing libxcursor-dev ...
Removing libxcomposite1 ...
Purging configuration files for libxcomposite1 ...
Removing x11proto-composite-dev ...
Removing intltool ...
Removing libxi-dev ...
Removing shared-mime-info ...
Purging configuration files for shared-mime-info ...
dpkg - warning: while removing shared-mime-info, directory `/usr/share/mime' not empty so not removed.
Removing po-debconf ...
Removing libxml-parser-perl ...
Removing libxft-dev ...
Removing python-dev ...
Removing man-db ...
Purging configuration files for man-db ...
  Removing catpages as well as /var/cache/man hierarchy.
dpkg - warning: while removing man-db, directory `/usr/share/doc/man-db/examples' not empty so not removed.
dpkg - warning: while removing man-db, directory `/usr/share/doc/man-db' not empty so not removed.
dpkg - warning: while removing man-db, directory `/usr/share/man-db' not empty so not removed.
dpkg - warning: while removing man-db, directory `/usr/share/bug/man-db' not empty so not removed.
dpkg - warning: while removing man-db, directory `/usr/lib/man-db' not empty so not removed.
Removing x11proto-xinerama-dev ...
Removing libpango1.0-0 ...
Purging configuration files for libpango1.0-0 ...
Removing libgtk2.0-common ...
Removing python-central ...
Purging configuration files for python-central ...
Removing groff-base ...
Purging configuration files for groff-base ...
Removing libxfixes-dev ...
Removing python2.5-minimal ...
Unlinking and removing bytecode for runtime python2.5
Purging configuration files for python2.5-minimal ...
Removing libxi6 ...
Purging configuration files for libxi6 ...
Removing automake ...
Removing libxcursor1 ...
Purging configuration files for libxcursor1 ...
Removing libjasper1 ...
Purging configuration files for libjasper1 ...
Removing x11proto-randr-dev ...
Removing libpango1.0-common ...
Purging font configuration of pango...
Purging category xfont..
Purging configuration files for libpango1.0-common ...
Removing libxdamage1 ...
Purging configuration files for libxdamage1 ...
Removing libffi5 ...
Purging configuration files for libffi5 ...
Removing libglib2.0-dev ...
Removing intltool-debian ...
Removing libcups2 ...
Purging configuration files for libcups2 ...
dpkg - warning: while removing libcups2, directory `/etc/cups' not empty so not removed.
Removing libxft2 ...
Purging configuration files for libxft2 ...
Removing libxinerama1 ...
Purging configuration files for libxinerama1 ...
Removing libcairo2-dev ...
Removing fontconfig ...
Purging font configuration of fontconfig...
Purging category cid..
Purging category truetype..
Purging category type1..
Updating fontconfig cache for /usr/share/fonts/truetype/ttf-dejavu
Purging configuration files for fontconfig ...
Removing autotools-dev ...
Removing python-support ...
Purging configuration files for python-support ...
dpkg - warning: while removing python-support, directory `/usr/lib/python-support/private' not empty so not removed.
dpkg - warning: while removing python-support, directory `/usr/lib/python-support' not empty so not removed.
dpkg - warning: while removing python-support, directory `/usr/share/python/runtime.d' not empty so not removed.
dpkg - warning: while removing python-support, directory `/usr/share/doc/python-support' not empty so not removed.
dpkg - warning: while removing python-support, directory `/usr/share/python-support' not empty so not removed.
Removing libatk1.0-0 ...
Purging configuration files for libatk1.0-0 ...
Removing x11proto-fixes-dev ...
Removing html2text ...
Purging configuration files for html2text ...
Removing python2.6-dev ...
Removing libthai0 ...
Purging configuration files for libthai0 ...
Removing python ...
Purging configuration files for python ...
Removing bsdmainutils ...
Purging configuration files for bsdmainutils ...
Removing libwww-perl ...
Removing libxfixes3 ...
Purging configuration files for libxfixes3 ...
Removing netbase ...
Purging configuration files for netbase ...
Removing libpython2.6 ...
Purging configuration files for libpython2.6 ...
Removing libdatrie0 ...
Purging configuration files for libdatrie0 ...
Removing autoconf ...
Purging configuration files for autoconf ...
Removing m4 ...
Removing gettext ...
Removing libcairo2 ...
Purging configuration files for libcairo2 ...
Removing python2.6 ...
Purging configuration files for python2.6 ...
dpkg - warning: while removing python2.6, directory `/usr/share/applications' not empty so not removed.
Removing libpixman-1-dev ...
Removing libgnutls26 ...
Purging configuration files for libgnutls26 ...
Removing libkrb53 ...
Purging configuration files for libkrb53 ...
Removing libtasn1-3 ...
Purging configuration files for libtasn1-3 ...
Removing libhtml-tree-perl ...
Removing libdirectfb-dev ...
Removing libthai-data ...
Removing libfontconfig1-dev ...
Removing libxext-dev ...
Removing libdirectfb-extra ...
Removing libxcb-render-util0-dev ...
Removing libxrender-dev ...
Removing libpng12-dev ...
Removing libreadline5 ...
Purging configuration files for libreadline5 ...
Removing x11proto-render-dev ...
Removing libxext6 ...
Purging configuration files for libxext6 ...
Removing libsqlite3-0 ...
Purging configuration files for libsqlite3-0 ...
Removing libsm-dev ...
Removing libncursesw5 ...
Purging configuration files for libncursesw5 ...
Removing readline-common ...
Purging configuration files for readline-common ...
Removing libxcb-render0-dev ...
Removing libcroco3 ...
Purging configuration files for libcroco3 ...
Removing libice-dev ...
Removing libssl0.9.8 ...
Purging configuration files for libssl0.9.8 ...
Removing libfreetype6-dev ...
Removing libgcrypt11 ...
Purging configuration files for libgcrypt11 ...
Removing libkeyutils1 ...
Purging configuration files for libkeyutils1 ...
Removing libdirectfb-1.0-0 ...
Purging configuration files for libdirectfb-1.0-0 ...
Removing mime-support ...
Purging configuration files for mime-support ...
Removing libts-0.0-0 ...
Purging configuration files for libts-0.0-0 ...
Removing libpng12-0 ...
Purging configuration files for libpng12-0 ...
Removing libpixman-1-0 ...
Purging configuration files for libpixman-1-0 ...
Removing gettext-base ...
Removing libsm6 ...
Purging configuration files for libsm6 ...
Removing zlib1g-dev ...
Removing libhtml-parser-perl ...
Removing libx11-dev ...
Removing libexpat1-dev ...
Removing libjpeg62-dev ...
Removing libfontconfig1 ...
Purging configuration files for libfontconfig1 ...
Removing libsysfs-dev ...
Removing xtrans-dev ...
Removing libxcb-render-util0 ...
Purging configuration files for libxcb-render-util0 ...
Removing libhtml-tagset-perl ...
Removing libxml2 ...
Purging configuration files for libxml2 ...
Removing x11proto-xext-dev ...
Removing pkg-config ...
Removing libice6 ...
Purging configuration files for libice6 ...
Removing libxrender1 ...
Purging configuration files for libxrender1 ...
Removing libgpg-error0 ...
Purging configuration files for libgpg-error0 ...
Removing libsysfs2 ...
Purging configuration files for libsysfs2 ...
Removing liburi-perl ...
Removing libfreetype6 ...
Purging configuration files for libfreetype6 ...
Removing libexpat1 ...
Purging configuration files for libexpat1 ...
Removing libxcb1-dev ...
Removing x11proto-kb-dev ...
Removing libpthread-stubs0-dev ...
Removing libxcb-render0 ...
Purging configuration files for libxcb-render0 ...
Removing fontconfig-config ...
Purging configuration files for fontconfig-config ...
Removing ttf-dejavu ...
Removing libjpeg62 ...
Removing x11proto-input-dev ...
Removing libx11-6 ...
Purging configuration files for libx11-6 ...
Removing libglib2.0-0 ...
Purging configuration files for libglib2.0-0 ...
Removing libxau-dev ...
Removing ttf-dejavu-extra ...
Purging configuration files for ttf-dejavu-extra ...
Removing libxdmcp-dev ...
Removing ttf-dejavu-core ...
Purging configuration files for ttf-dejavu-core ...
Removing libxcb1 ...
Purging configuration files for libxcb1 ...
Removing libpthread-stubs0 ...
Removing libxau6 ...
Purging configuration files for libxau6 ...
Removing x11proto-core-dev ...
Removing libxdmcp6 ...
Purging configuration files for libxdmcp6 ...
Removing ucf ...
Purging configuration files for ucf ...
Removing libx11-data ...
Removing x11-common ...
Purging configuration files for x11-common ...
dpkg - warning: while removing x11-common, directory `/usr/X11R6' not empty so not removed.
dpkg - warning: while removing x11-common, directory `/etc/X11' not empty so not removed.
Removing defoma ...
Purging configuration files for defoma ...
dpkg - warning: while removing defoma, directory `/usr/share/debhelper/autoscripts' not empty so not removed.
dpkg - warning: while removing defoma, directory `/usr/share/debhelper' not empty so not removed.
Removing whiptail ...
Removing file ...
Purging configuration files for file ...
Removing libnewt0.52 ...
Purging configuration files for libnewt0.52 ...
Removing libpopt0 ...
Purging configuration files for libpopt0 ...
Removing libmagic1 ...
Purging configuration files for libmagic1 ...
Processing triggers for libc6 ...
ldconfig deferred processing now taking place
******************************************************************************
Finished at 20090410-0609
Build needed 00:00:28, 3300k disk space




More information about the ubuntu-autotest mailing list