Log for failed build of libaio_0.3.107-1ubuntu1 (dist=intrepid-autotest)

Build Daemon user noreply at buildd.ubuntu.com
Wed Oct 22 00:01:10 BST 2008


Automatic build of libaio_0.3.107-1ubuntu1 on royal by sbuild/powerpc 1.170.5
Build started at 20081022-0000
******************************************************************************
Checking available source versions...
Fetching source files...
Reading package lists...
Building dependency tree...
Reading state information...
Need to get 64.2kB of source archives.
Get:1 http://archive.internal intrepid-autotest/main libaio 0.3.107-1ubuntu1 (dsc) [1323B]
Get:2 http://archive.internal intrepid-autotest/main libaio 0.3.107-1ubuntu1 (tar) [51.5kB]
Get:3 http://archive.internal intrepid-autotest/main libaio 0.3.107-1ubuntu1 (diff) [11.3kB]
Fetched 64.2kB in 0s (4189kB/s)
Download complete and in download only mode
** Using build dependencies supplied by package:
Build-Depends: debhelper (>= 5), quilt (>= 0.40)
Checking for already installed source dependencies...
debhelper: missing
quilt: missing
Checking for source dependency conflicts...
  /usr/bin/sudo /usr/bin/apt-get --purge $CHROOT_OPTIONS -q -y install debhelper quilt
Reading package lists...
Building dependency tree...
Reading state information...
The following packages were automatically installed and are no longer required:
  dmsetup libdevmapper1.02.1 upstart-compat-sysv startup-tasks system-services
  sysvutils upstart perl-doc
Use 'apt-get autoremove' to remove them.
The following extra packages will be installed:
  bsdmainutils diffstat file gettext gettext-base groff-base html2text
  intltool-debian libmagic1 man-db po-debconf
Suggested packages:
  wamerican wordlist whois vacation dh-make cvs gettext-doc groff less
  www-browser procmail graphviz
Recommended packages:
  curl wget lynx libmail-sendmail-perl libcompress-zlib-perl libmail-box-perl
The following NEW packages will be installed:
  bsdmainutils debhelper diffstat file gettext gettext-base groff-base
  html2text intltool-debian libmagic1 man-db po-debconf quilt
0 upgraded, 13 newly installed, 0 to remove and 6 not upgraded.
Need to get 0B/6699kB of archives.
After unpacking 21.5MB of additional disk space will be used.
WARNING: The following packages cannot be authenticated!
  bsdmainutils libmagic1 file gettext-base groff-base man-db html2text gettext
  intltool-debian po-debconf debhelper diffstat quilt
Authentication warning overridden.
Selecting previously deselected package bsdmainutils.
(Reading database ... 10726 files and directories currently installed.)
Unpacking bsdmainutils (from .../bsdmainutils_6.1.10ubuntu2_powerpc.deb) ...
Selecting previously deselected package libmagic1.
Unpacking libmagic1 (from .../libmagic1_4.24-4_powerpc.deb) ...
Selecting previously deselected package file.
Unpacking file (from .../file_4.24-4_powerpc.deb) ...
Selecting previously deselected package gettext-base.
Unpacking gettext-base (from .../gettext-base_0.17-3ubuntu2_powerpc.deb) ...
Selecting previously deselected package groff-base.
Unpacking groff-base (from .../groff-base_1.18.1.1-20_powerpc.deb) ...
Selecting previously deselected package man-db.
Unpacking man-db (from .../man-db_2.5.2-2_powerpc.deb) ...
Selecting previously deselected package html2text.
Unpacking html2text (from .../html2text_1.3.2a-5_powerpc.deb) ...
Selecting previously deselected package gettext.
Unpacking gettext (from .../gettext_0.17-3ubuntu2_powerpc.deb) ...
Selecting previously deselected package intltool-debian.
Unpacking intltool-debian (from .../intltool-debian_0.35.0+20060710.1_all.deb) ...
Selecting previously deselected package po-debconf.
Unpacking po-debconf (from .../po-debconf_1.0.15_all.deb) ...
Selecting previously deselected package debhelper.
Unpacking debhelper (from .../debhelper_7.0.13ubuntu1_all.deb) ...
Selecting previously deselected package diffstat.
Unpacking diffstat (from .../diffstat_1.45-2_powerpc.deb) ...
Selecting previously deselected package quilt.
Unpacking quilt (from .../archives/quilt_0.46-6_all.deb) ...
Setting up bsdmainutils (6.1.10ubuntu2) ...

Setting up libmagic1 (4.24-4) ...

Setting up file (4.24-4) ...
Setting up gettext-base (0.17-3ubuntu2) ...

Setting up groff-base (1.18.1.1-20) ...

Setting up man-db (2.5.2-2) ...
Building database of manual pages ...
... skipping, since this is a buildd

Setting up html2text (1.3.2a-5) ...

Setting up gettext (0.17-3ubuntu2) ...

Setting up intltool-debian (0.35.0+20060710.1) ...
Setting up po-debconf (1.0.15) ...

Setting up debhelper (7.0.13ubuntu1) ...
Setting up diffstat (1.45-2) ...

Setting up quilt (0.46-6) ...

Checking correctness of source dependencies...
Toolchain package versions: libc6-dev_2.8~20080505-0ubuntu6 make_3.81-5 dpkg-dev_1.14.20ubuntu6 linux-libc-dev_2.6.25-2.3 g++-4.3_4.3.2-1ubuntu10 gcc-4.3_4.3.2-1ubuntu10 binutils_2.18.93.20081009-0ubuntu1 libstdc++6_4.3.2-1ubuntu10 libstdc++6-4.3-dev_4.3.2-1ubuntu10
------------------------------------------------------------------------------
dpkg-source: extracting libaio in libaio-0.3.107
dpkg-source: unpacking libaio_0.3.107.orig.tar.gz
dpkg-source: applying /srv/royal.buildd/home/buildd/build-intrepid-autotest/libaio_0.3.107-1ubuntu1.diff.gz
dpkg-buildpackage: set CFLAGS to default value: -g -O2
dpkg-buildpackage: set CPPFLAGS to default value: 
dpkg-buildpackage: set LDFLAGS to default value: -Wl,-Bsymbolic-functions
dpkg-buildpackage: set FFLAGS to default value: -g -O2
dpkg-buildpackage: set CXXFLAGS to default value: -g -O2
dpkg-buildpackage: source package libaio
dpkg-buildpackage: source version 0.3.107-1ubuntu1
dpkg-buildpackage: host architecture powerpc
 /usr/bin/fakeroot debian/rules clean
QUILT_PATCHES=debian/patches quilt --quiltrc /dev/null pop -a -R || test $? = 2 
No patch removed
rm -rf .pc debian/stamp-patched
dh_testdir
dh_testroot
[ ! -f Makefile ] || /usr/bin/make clean
make[1]: Entering directory `/build/buildd/libaio-0.3.107'
make[2]: Entering directory `/build/buildd/libaio-0.3.107/src'
rm -f libaio.a libaio.so.1.0.1 io_queue_init.ol io_queue_release.ol io_queue_wait.ol io_queue_run.ol io_getevents.ol io_submit.ol io_cancel.ol io_setup.ol io_destroy.ol raw_syscall.ol compat-0_1.ol io_queue_init.os io_queue_release.os io_queue_wait.os io_queue_run.os io_getevents.os io_submit.os io_cancel.os io_setup.os io_destroy.os raw_syscall.os compat-0_1.os libaio.so.1.new
rm -f *.so* *.a *.o
make[2]: Leaving directory `/build/buildd/libaio-0.3.107/src'
make[2]: Entering directory `/build/buildd/libaio-0.3.107/harness'
rm -f cases/2.p cases/3.p cases/4.p cases/5.p cases/6.p cases/7.p cases/11.p cases/12.p cases/13.p cases/14.p cases/15.p cases/16.p cases/8.p cases/10.p *.o runtests.out rofile wofile rwfile
make[2]: Leaving directory `/build/buildd/libaio-0.3.107/harness'
make[1]: Leaving directory `/build/buildd/libaio-0.3.107'
dh_clean
 debian/rules build
# quilt exits with 2 as return when there was nothing to do. 
# That's not an error here (but it's useful to break loops in crude scripts)
QUILT_PATCHES=debian/patches quilt --quiltrc /dev/null push -a || test $? = 2
Applying patch 00_arches.patch
patching file src/syscall-m68k.h
patching file src/syscall-sparc.h
patching file src/syscall.h
patching file src/syscall-mips.h
patching file src/libaio.h
patching file src/syscall-parisc.h
patching file src/syscall-arm.h

Applying patch 01_link_libgcc.patch
patching file src/Makefile

Applying patch 02_libdevdir.patch
patching file Makefile
patching file src/Makefile

Applying patch 90_ppc-name-clashing.patch
patching file src/syscall-ppc.h

Applying patch 91_ubuntu_arches.patch
patching file src/libaio.h
Hunk #1 succeeded at 57 (offset 1 line).
patching file src/Makefile
Hunk #1 succeeded at 5 with fuzz 1 (offset 2 lines).
patching file src/syscall.h
patching file src/syscall-sparc64.h

Now at patch 91_ubuntu_arches.patch
touch debian/stamp-patched
dh_testdir
/usr/bin/make
make[1]: Entering directory `/build/buildd/libaio-0.3.107'
make[2]: Entering directory `/build/buildd/libaio-0.3.107/src'
cc -Wall -I. -g -fomit-frame-pointer -O2 -fPIC -c -o io_queue_init.ol io_queue_init.c
cc -Wall -I. -g -fomit-frame-pointer -O2 -fPIC -c -o io_queue_release.ol io_queue_release.c
cc -Wall -I. -g -fomit-frame-pointer -O2 -fPIC -c -o io_queue_wait.ol io_queue_wait.c
cc -Wall -I. -g -fomit-frame-pointer -O2 -fPIC -c -o io_queue_run.ol io_queue_run.c
cc -Wall -I. -g -fomit-frame-pointer -O2 -fPIC -c -o io_getevents.ol io_getevents.c
cc -Wall -I. -g -fomit-frame-pointer -O2 -fPIC -c -o io_submit.ol io_submit.c
cc -Wall -I. -g -fomit-frame-pointer -O2 -fPIC -c -o io_cancel.ol io_cancel.c
cc -Wall -I. -g -fomit-frame-pointer -O2 -fPIC -c -o io_setup.ol io_setup.c
cc -Wall -I. -g -fomit-frame-pointer -O2 -fPIC -c -o io_destroy.ol io_destroy.c
cc -Wall -I. -g -fomit-frame-pointer -O2 -fPIC -c -o raw_syscall.ol raw_syscall.c
cc -Wall -I. -g -fomit-frame-pointer -O2 -fPIC -c -o compat-0_1.ol compat-0_1.c
rm -f libaio.a
ar r libaio.a io_queue_init.ol io_queue_release.ol io_queue_wait.ol io_queue_run.ol io_getevents.ol io_submit.ol io_cancel.ol io_setup.ol io_destroy.ol raw_syscall.ol compat-0_1.ol
ar: creating libaio.a
ranlib libaio.a
cc -shared -Wall -I. -g -fomit-frame-pointer -O2 -fPIC -c -o io_queue_init.os io_queue_init.c
cc -shared -Wall -I. -g -fomit-frame-pointer -O2 -fPIC -c -o io_queue_release.os io_queue_release.c
cc -shared -Wall -I. -g -fomit-frame-pointer -O2 -fPIC -c -o io_queue_wait.os io_queue_wait.c
cc -shared -Wall -I. -g -fomit-frame-pointer -O2 -fPIC -c -o io_queue_run.os io_queue_run.c
cc -shared -Wall -I. -g -fomit-frame-pointer -O2 -fPIC -c -o io_getevents.os io_getevents.c
cc -shared -Wall -I. -g -fomit-frame-pointer -O2 -fPIC -c -o io_submit.os io_submit.c
cc -shared -Wall -I. -g -fomit-frame-pointer -O2 -fPIC -c -o io_cancel.os io_cancel.c
cc -shared -Wall -I. -g -fomit-frame-pointer -O2 -fPIC -c -o io_setup.os io_setup.c
cc -shared -Wall -I. -g -fomit-frame-pointer -O2 -fPIC -c -o io_destroy.os io_destroy.c
cc -shared -Wall -I. -g -fomit-frame-pointer -O2 -fPIC -c -o raw_syscall.os raw_syscall.c
cc -shared -Wall -I. -g -fomit-frame-pointer -O2 -fPIC -c -o compat-0_1.os compat-0_1.c
cc -shared -Wall -I. -g -fomit-frame-pointer -O2 -fPIC -Wl,--version-script=libaio.map -Wl,-soname=libaio.so.1 -o libaio.so.1.0.1 io_queue_init.os io_queue_release.os io_queue_wait.os io_queue_run.os io_getevents.os io_submit.os io_cancel.os io_setup.os io_destroy.os raw_syscall.os compat-0_1.os -lgcc
make[2]: Leaving directory `/build/buildd/libaio-0.3.107/src'
make[1]: Leaving directory `/build/buildd/libaio-0.3.107'
 /usr/bin/fakeroot debian/rules binary-arch
dh_testdir
/usr/bin/make
make[1]: Entering directory `/build/buildd/libaio-0.3.107'
make[2]: Entering directory `/build/buildd/libaio-0.3.107/src'
make[2]: Nothing to be done for `all'.
make[2]: Leaving directory `/build/buildd/libaio-0.3.107/src'
make[1]: Leaving directory `/build/buildd/libaio-0.3.107'
dh_testdir
/usr/bin/make partcheck
make[1]: Entering directory `/build/buildd/libaio-0.3.107'
make[2]: Entering directory `/build/buildd/libaio-0.3.107/src'
make[2]: Nothing to be done for `all'.
make[2]: Leaving directory `/build/buildd/libaio-0.3.107/src'
make[2]: Entering directory `/build/buildd/libaio-0.3.107/harness'
cc -Wall -Werror -I../src -g -O -DTEST_NAME=\"cases/2.t\" -o cases/2.p main.c ../src/libaio.a
cc1: warnings being treated as errors
In file included from main.c:24:
cases/2.t: In function 'test_main':
cases/2.t:29: error: integer constant is too large for 'long' type
cases/2.t:30: error: integer constant is too large for 'long' type
cases/2.t:31: error: integer constant is too large for 'long' type
make[2]: *** [cases/2.p] Error 1
make[2]: Leaving directory `/build/buildd/libaio-0.3.107/harness'
make[1]: *** [partcheck] Error 2
make[1]: Leaving directory `/build/buildd/libaio-0.3.107'
make: *** [check-arch] Error 2
dpkg-buildpackage: failure: /usr/bin/fakeroot debian/rules binary-arch gave error exit status 2
******************************************************************************
Build finished at 20081022-0001
FAILED [dpkg-buildpackage died]
Purging chroot-intrepid-autotest/build/buildd/libaio-0.3.107
------------------------------------------------------------------------------
  /usr/bin/sudo dpkg --root=/srv/royal.buildd/home/buildd/build-intrepid-autotest/chroot-intrepid-autotest --purge po-debconf intltool-debian groff-base quilt libmagic1 gettext file bsdmainutils diffstat html2text gettext-base man-db debhelper
(Reading database ... 11920 files and directories currently installed.)
Removing quilt ...
Purging configuration files for quilt ...
Removing diffstat ...
Removing debhelper ...
Removing po-debconf ...
Removing intltool-debian ...
Removing gettext ...
Removing file ...
Purging configuration files for file ...
Removing html2text ...
Purging configuration files for html2text ...
Removing gettext-base ...
Removing man-db ...
Purging configuration files for man-db ...
Removing groff-base ...
Purging configuration files for groff-base ...
Removing libmagic1 ...
Purging configuration files for libmagic1 ...
Removing bsdmainutils ...
Purging configuration files for bsdmainutils ...
******************************************************************************
Finished at 20081022-0001
Build needed 00:00:03, 1300k disk space




More information about the ubuntu-autotest mailing list