Log for failed build of libxtst_2:1.0.3-1 (dist=intrepid-autotest)

Build Daemon user noreply at buildd.ubuntu.com
Sun Oct 5 02:02:29 BST 2008


Automatic build of libxtst_2:1.0.3-1 on terranova by sbuild/i386 1.170.5
Build started at 20081005-0201
******************************************************************************
Checking available source versions...
Fetching source files...
Reading package lists...
Building dependency tree...
Reading state information...
Need to get 525kB of source archives.
Get:1 http://archive.internal intrepid-autotest/main libxtst 2:1.0.3-1 (dsc) [970B]
Get:2 http://archive.internal intrepid-autotest/main libxtst 2:1.0.3-1 (tar) [335kB]
Get:3 http://archive.internal intrepid-autotest/main libxtst 2:1.0.3-1 (diff) [189kB]
Fetched 525kB in 0s (5613kB/s)
Download complete and in download only mode
** Using build dependencies supplied by package:
Build-Depends: debhelper (>= 5.0.0), libx11-dev (>= 2:0.99.3-1), libxext-dev (>= 1:0.99.2-1), x11proto-record-dev, x11proto-xext-dev, pkg-config, xmlto, quilt
Checking for already installed source dependencies...
debhelper: missing
libx11-dev: missing
libxext-dev: missing
x11proto-record-dev: missing
x11proto-xext-dev: missing
pkg-config: missing
xmlto: missing
quilt: missing
Checking for source dependency conflicts...
  /usr/bin/sudo /usr/bin/apt-get --purge $CHROOT_OPTIONS -q -y install debhelper libx11-dev libxext-dev x11proto-record-dev x11proto-xext-dev pkg-config xmlto quilt
Reading package lists...
Building dependency tree...
Reading state information...
The following packages were automatically installed and are no longer required:
  upstart-compat-sysv startup-tasks system-services sysvutils upstart perl-doc
Use 'apt-get autoremove' to remove them.
The following extra packages will be installed:
  bsdmainutils diffstat docbook-xml docbook-xsl file gettext gettext-base
  groff-base html2text intltool-debian libgcrypt11 libglib2.0-0 libgpg-error0
  libmagic1 libpthread-stubs0 libpthread-stubs0-dev libreadline5 libx11-6
  libx11-data libxau-dev libxau6 libxcb-xlib0 libxcb-xlib0-dev libxcb1
  libxcb1-dev libxdmcp-dev libxdmcp6 libxext6 libxml2 libxml2-utils libxslt1.1
  man-db po-debconf readline-common sgml-base sgml-data x11-common
  x11proto-core-dev x11proto-input-dev x11proto-kb-dev xml-core xsltproc
  xtrans-dev
Suggested packages:
  wamerican wordlist whois vacation dh-make docbook docbook-dsssl
  docbook-defguide fop libsaxon-java libxalan2-java xalan cvs gettext-doc
  groff rng-tools less www-browser procmail graphviz sgml-base-doc perlsgml
  doc-html-w3 opensp
Recommended packages:
  docbook-xsl-doc-html docbook-xsl-doc-pdf docbook-xsl-doc-text
  docbook-xsl-doc curl wget lynx libglib2.0-data libmail-sendmail-perl
  libcompress-zlib-perl libmail-box-perl libpaper-utils
The following NEW packages will be installed:
  bsdmainutils debhelper diffstat docbook-xml docbook-xsl file gettext
  gettext-base groff-base html2text intltool-debian libgcrypt11 libglib2.0-0
  libgpg-error0 libmagic1 libpthread-stubs0 libpthread-stubs0-dev libreadline5
  libx11-6 libx11-data libx11-dev libxau-dev libxau6 libxcb-xlib0
  libxcb-xlib0-dev libxcb1 libxcb1-dev libxdmcp-dev libxdmcp6 libxext-dev
  libxext6 libxml2 libxml2-utils libxslt1.1 man-db pkg-config po-debconf quilt
  readline-common sgml-base sgml-data x11-common x11proto-core-dev
  x11proto-input-dev x11proto-kb-dev x11proto-record-dev x11proto-xext-dev
  xml-core xmlto xsltproc xtrans-dev
0 upgraded, 51 newly installed, 0 to remove and 0 not upgraded.
Need to get 0B/14.4MB of archives.
After unpacking 53.6MB of additional disk space will be used.
WARNING: The following packages cannot be authenticated!
  x11-common libxau6 libxdmcp6 libxcb1 libxcb-xlib0 libx11-data libx11-6
  x11proto-core-dev libxau-dev libxdmcp-dev x11proto-input-dev x11proto-kb-dev
  xtrans-dev libpthread-stubs0 libpthread-stubs0-dev libxcb1-dev
  libxcb-xlib0-dev libx11-dev libxext6 x11proto-xext-dev libxext-dev
  x11proto-record-dev libgpg-error0 libgcrypt11 readline-common libreadline5
  bsdmainutils libmagic1 file gettext-base groff-base man-db html2text gettext
  intltool-debian po-debconf debhelper diffstat sgml-base xml-core sgml-data
  docbook-xml docbook-xsl libglib2.0-0 libxml2 libxml2-utils libxslt1.1
  pkg-config quilt xsltproc xmlto
Authentication warning overridden.
Selecting previously deselected package x11-common.
(Reading database ... 10718 files and directories currently installed.)
Unpacking x11-common (from .../x11-common_1%3a7.4~2ubuntu5_all.deb) ...
Selecting previously deselected package libxau6.
Unpacking libxau6 (from .../libxau6_1%3a1.0.3-3_i386.deb) ...
Selecting previously deselected package libxdmcp6.
Unpacking libxdmcp6 (from .../libxdmcp6_1%3a1.0.2-3_i386.deb) ...
Selecting previously deselected package libxcb1.
Unpacking libxcb1 (from .../libxcb1_1.1-1.1_i386.deb) ...
Selecting previously deselected package libxcb-xlib0.
Unpacking libxcb-xlib0 (from .../libxcb-xlib0_1.1-1.1_i386.deb) ...
Selecting previously deselected package libx11-data.
Unpacking libx11-data (from .../libx11-data_2%3a1.1.5-1ubuntu1_all.deb) ...
Selecting previously deselected package libx11-6.
Unpacking libx11-6 (from .../libx11-6_2%3a1.1.5-1ubuntu1_i386.deb) ...
Setting up x11-common (7.4~2ubuntu5) ...

Selecting previously deselected package x11proto-core-dev.
(Reading database ... 11051 files and directories currently installed.)
Unpacking x11proto-core-dev (from .../x11proto-core-dev_7.0.12-1_all.deb) ...
Selecting previously deselected package libxau-dev.
Unpacking libxau-dev (from .../libxau-dev_1%3a1.0.3-3_i386.deb) ...
Selecting previously deselected package libxdmcp-dev.
Unpacking libxdmcp-dev (from .../libxdmcp-dev_1%3a1.0.2-3_i386.deb) ...
Selecting previously deselected package x11proto-input-dev.
Unpacking x11proto-input-dev (from .../x11proto-input-dev_1.4.3-2ubuntu2_all.deb) ...
Selecting previously deselected package x11proto-kb-dev.
Unpacking x11proto-kb-dev (from .../x11proto-kb-dev_1.0.3-3ubuntu1_all.deb) ...
Selecting previously deselected package xtrans-dev.
Unpacking xtrans-dev (from .../xtrans-dev_1.2-2_all.deb) ...
Selecting previously deselected package libpthread-stubs0.
Unpacking libpthread-stubs0 (from .../libpthread-stubs0_0.1-2_i386.deb) ...
Selecting previously deselected package libpthread-stubs0-dev.
Unpacking libpthread-stubs0-dev (from .../libpthread-stubs0-dev_0.1-2_i386.deb) ...
Selecting previously deselected package libxcb1-dev.
Unpacking libxcb1-dev (from .../libxcb1-dev_1.1-1.1_i386.deb) ...
Selecting previously deselected package libxcb-xlib0-dev.
Unpacking libxcb-xlib0-dev (from .../libxcb-xlib0-dev_1.1-1.1_i386.deb) ...
Selecting previously deselected package libx11-dev.
Unpacking libx11-dev (from .../libx11-dev_2%3a1.1.5-1ubuntu1_i386.deb) ...
Selecting previously deselected package libxext6.
Unpacking libxext6 (from .../libxext6_2%3a1.0.4-1_i386.deb) ...
Selecting previously deselected package x11proto-xext-dev.
Unpacking x11proto-xext-dev (from .../x11proto-xext-dev_7.0.2-6build1_all.deb) ...
Selecting previously deselected package libxext-dev.
Unpacking libxext-dev (from .../libxext-dev_2%3a1.0.4-1_i386.deb) ...
Selecting previously deselected package x11proto-record-dev.
Unpacking x11proto-record-dev (from .../x11proto-record-dev_1.13.2-5ubuntu1_all.deb) ...
Selecting previously deselected package libgpg-error0.
Unpacking libgpg-error0 (from .../libgpg-error0_1.4-2ubuntu7_i386.deb) ...
Selecting previously deselected package libgcrypt11.
Unpacking libgcrypt11 (from .../libgcrypt11_1.4.1-1ubuntu1_i386.deb) ...
Selecting previously deselected package readline-common.
Unpacking readline-common (from .../readline-common_5.2-3build1_all.deb) ...
Selecting previously deselected package libreadline5.
Unpacking libreadline5 (from .../libreadline5_5.2-3build1_i386.deb) ...
Selecting previously deselected package bsdmainutils.
Unpacking bsdmainutils (from .../bsdmainutils_6.1.10ubuntu2_i386.deb) ...
Selecting previously deselected package libmagic1.
Unpacking libmagic1 (from .../libmagic1_4.24-4_i386.deb) ...
Selecting previously deselected package file.
Unpacking file (from .../archives/file_4.24-4_i386.deb) ...
Selecting previously deselected package gettext-base.
Unpacking gettext-base (from .../gettext-base_0.17-3ubuntu2_i386.deb) ...
Selecting previously deselected package groff-base.
Unpacking groff-base (from .../groff-base_1.18.1.1-20_i386.deb) ...
Selecting previously deselected package man-db.
Unpacking man-db (from .../man-db_2.5.2-2_i386.deb) ...
Selecting previously deselected package html2text.
Unpacking html2text (from .../html2text_1.3.2a-5_i386.deb) ...
Selecting previously deselected package gettext.
Unpacking gettext (from .../gettext_0.17-3ubuntu2_i386.deb) ...
Selecting previously deselected package intltool-debian.
Unpacking intltool-debian (from .../intltool-debian_0.35.0+20060710.1_all.deb) ...
Selecting previously deselected package po-debconf.
Unpacking po-debconf (from .../po-debconf_1.0.15_all.deb) ...
Selecting previously deselected package debhelper.
Unpacking debhelper (from .../debhelper_7.0.13ubuntu1_all.deb) ...
Selecting previously deselected package diffstat.
Unpacking diffstat (from .../diffstat_1.45-2_i386.deb) ...
Selecting previously deselected package sgml-base.
Unpacking sgml-base (from .../sgml-base_1.26_all.deb) ...
Selecting previously deselected package xml-core.
Unpacking xml-core (from .../archives/xml-core_0.11_all.deb) ...
Selecting previously deselected package sgml-data.
Unpacking sgml-data (from .../sgml-data_2.0.3_all.deb) ...
Selecting previously deselected package docbook-xml.
Unpacking docbook-xml (from .../docbook-xml_4.5-5_all.deb) ...
Selecting previously deselected package docbook-xsl.
Unpacking docbook-xsl (from .../docbook-xsl_1.73.2.dfsg.1-4_all.deb) ...
Selecting previously deselected package libglib2.0-0.
Unpacking libglib2.0-0 (from .../libglib2.0-0_2.18.1-1_i386.deb) ...
Selecting previously deselected package libxml2.
Unpacking libxml2 (from .../libxml2_2.6.32.dfsg-4ubuntu1_i386.deb) ...
Selecting previously deselected package libxml2-utils.
Unpacking libxml2-utils (from .../libxml2-utils_2.6.32.dfsg-4ubuntu1_i386.deb) ...
Selecting previously deselected package libxslt1.1.
Unpacking libxslt1.1 (from .../libxslt1.1_1.1.24-1ubuntu2_i386.deb) ...
Selecting previously deselected package pkg-config.
Unpacking pkg-config (from .../pkg-config_0.22-1_i386.deb) ...
Selecting previously deselected package quilt.
Unpacking quilt (from .../archives/quilt_0.46-6_all.deb) ...
Selecting previously deselected package xsltproc.
Unpacking xsltproc (from .../xsltproc_1.1.24-1ubuntu2_i386.deb) ...
Selecting previously deselected package xmlto.
Unpacking xmlto (from .../xmlto_0.0.20-1_i386.deb) ...
Setting up libxau6 (1.0.3-3) ...

Setting up libxdmcp6 (1.0.2-3) ...

Setting up libxcb1 (1.1-1.1) ...

Setting up libxcb-xlib0 (1.1-1.1) ...

Setting up libx11-data (1.1.5-1ubuntu1) ...
Setting up libx11-6 (1.1.5-1ubuntu1) ...

Setting up x11proto-core-dev (7.0.12-1) ...
Setting up libxau-dev (1.0.3-3) ...
Setting up libxdmcp-dev (1.0.2-3) ...
Setting up x11proto-input-dev (1.4.3-2ubuntu2) ...
Setting up x11proto-kb-dev (1.0.3-3ubuntu1) ...
Setting up xtrans-dev (1.2-2) ...
Setting up libpthread-stubs0 (0.1-2) ...
Setting up libpthread-stubs0-dev (0.1-2) ...
Setting up libxcb1-dev (1.1-1.1) ...
Setting up libxcb-xlib0-dev (1.1-1.1) ...
Setting up libx11-dev (1.1.5-1ubuntu1) ...
Setting up libxext6 (1.0.4-1) ...

Setting up x11proto-xext-dev (7.0.2-6build1) ...
Setting up libxext-dev (1.0.4-1) ...
Setting up x11proto-record-dev (1.13.2-5ubuntu1) ...
Setting up libgpg-error0 (1.4-2ubuntu7) ...

Setting up libgcrypt11 (1.4.1-1ubuntu1) ...

Setting up readline-common (5.2-3build1) ...

Setting up libreadline5 (5.2-3build1) ...

Setting up bsdmainutils (6.1.10ubuntu2) ...

Setting up libmagic1 (4.24-4) ...

Setting up file (4.24-4) ...
Setting up gettext-base (0.17-3ubuntu2) ...

Setting up groff-base (1.18.1.1-20) ...

Setting up man-db (2.5.2-2) ...
Building database of manual pages ...
... skipping, since this is a buildd

Setting up html2text (1.3.2a-5) ...

Setting up gettext (0.17-3ubuntu2) ...

Setting up intltool-debian (0.35.0+20060710.1) ...
Setting up po-debconf (1.0.15) ...

Setting up debhelper (7.0.13ubuntu1) ...
Setting up diffstat (1.45-2) ...

Setting up sgml-base (1.26) ...

Setting up xml-core (0.11) ...

Setting up sgml-data (2.0.3) ...

Setting up docbook-xml (4.5-5) ...

Setting up docbook-xsl (1.73.2.dfsg.1-4) ...

Setting up libglib2.0-0 (2.18.1-1) ...

Setting up libxml2 (2.6.32.dfsg-4ubuntu1) ...

Setting up libxml2-utils (2.6.32.dfsg-4ubuntu1) ...
Setting up libxslt1.1 (1.1.24-1ubuntu2) ...

Setting up pkg-config (0.22-1) ...
Setting up quilt (0.46-6) ...

Setting up xsltproc (1.1.24-1ubuntu2) ...
Setting up xmlto (0.0.20-1) ...
Checking correctness of source dependencies...
Toolchain package versions: libc6-dev_2.8~20080505-0ubuntu7 make_3.81-5 dpkg-dev_1.14.20ubuntu6 linux-libc-dev_2.6.27-5.8 g++-4.3_4.3.2-1ubuntu9 gcc-4.3_4.3.2-1ubuntu9 binutils_2.18.92.20081003-0ubuntu1 libstdc++6_4.3.2-1ubuntu9 libstdc++6-4.3-dev_4.3.2-1ubuntu9
------------------------------------------------------------------------------
dpkg-source: extracting libxtst in libxtst-1.0.3
dpkg-source: unpacking libxtst_1.0.3.orig.tar.gz
dpkg-source: applying /home/buildd/build-intrepid-autotest/libxtst_1.0.3-1.diff.gz
tar: Read 7168 bytes from -
dpkg-buildpackage: set CFLAGS to default value: -g -O2
dpkg-buildpackage: set CPPFLAGS to default value: 
dpkg-buildpackage: set LDFLAGS to default value: -Wl,-Bsymbolic-functions
dpkg-buildpackage: set FFLAGS to default value: -g -O2
dpkg-buildpackage: set CXXFLAGS to default value: -g -O2
dpkg-buildpackage: source package libxtst
dpkg-buildpackage: source version 2:1.0.3-1
dpkg-buildpackage: host architecture i386
 /usr/bin/fakeroot debian/rules clean
rm -f stampdir/genscripts
rm -f debian/*.config \
	      debian/*.postinst \
	      debian/*.postrm \
	      debian/*.preinst \
	      debian/*.prerm
rm -f stampdir/patch
Unapplying patches...nothing to do.
dh_testdir
rm -f .pc patches
rm -rf stampdir build-tree
rm -rf imports
dh_clean debian/shlibs.local \
	         debian/MANIFEST.i386 debian/MANIFEST.i386.new \
	         debian/po/pothead
dh_testdir
dh_testroot
rm -f build-stamp
rm -f config.cache config.log config.status
rm -f */config.cache */config.log */config.status
rm -f conftest* */conftest*
rm -rf autom4te.cache */autom4te.cache
rm -rf obj-*
dh_clean
 debian/rules build
mkdir stampdir
>stampdir/stampdir
if [ ! -e stampdir/patches ]; then \
		mkdir stampdir/patches; \
		ln -s stampdir/patches .pc; \
		echo 2 >stampdir/patches/.version; \
	fi; \
	if [ ! -e stampdir/log ]; then \
		mkdir stampdir/log; \
	fi; \
	if [ -e debian/patches ] && [ ! -e patches ]; then \
		ln -s debian/patches patches; \
	fi; \
	>stampdir/prepare
if ! [ `which quilt` ]; then \
		echo "Couldn't find quilt. Please install it or add it to the build-depends for this package."; \
		exit 1; \
	fi; \
	if quilt next; then \
	  echo -n "Applying patches..."; \
	  if quilt push -a -v >stampdir/log/patch 2>&1; then \
	    echo "successful."; \
	  else \
	    echo "failed! (check stampdir/log/patch for details)"; \
	    exit 1; \
	  fi; \
	else \
	  echo "No patches to apply"; \
	fi; \
	>stampdir/patch
01_fix_date_in_manpages.diff
Applying patches...successful.
dh_testdir
test -d obj-i486-linux-gnu || mkdir obj-i486-linux-gnu
cd obj-i486-linux-gnu && \
	../configure --prefix=/usr --mandir=\${prefix}/share/man \
	             --infodir=\${prefix}/share/info --build=i486-linux-gnu \
	             CFLAGS="-Wall -g -O2" 
checking for a BSD-compatible install... /usr/bin/install -c
checking whether build environment is sane... yes
checking for a thread-safe mkdir -p... /bin/mkdir -p
checking for gawk... no
checking for mawk... mawk
checking whether make sets $(MAKE)... yes
checking whether to enable maintainer-specific portions of Makefiles... no
checking for gcc... gcc
checking for C compiler default output file name... a.out
checking whether the C compiler works... yes
checking whether we are cross compiling... no
checking for suffix of executables... 
checking for suffix of object files... o
checking whether we are using the GNU C compiler... yes
checking whether gcc accepts -g... yes
checking for gcc option to accept ISO C89... none needed
checking for style of include used by make... GNU
checking dependency style of gcc... gcc3
checking build system type... i486-pc-linux-gnu
checking host system type... i486-pc-linux-gnu
checking for a sed that does not truncate output... /bin/sed
checking for grep that handles long lines and -e... /bin/grep
checking for egrep... /bin/grep -E
checking for ld used by gcc... /usr/bin/ld
checking if the linker (/usr/bin/ld) is GNU ld... yes
checking for /usr/bin/ld option to reload object files... -r
checking for BSD-compatible nm... /usr/bin/nm -B
checking whether ln -s works... yes
checking how to recognize dependent libraries... pass_all
checking how to run the C preprocessor... gcc -E
checking for ANSI C header files... yes
checking for sys/types.h... yes
checking for sys/stat.h... yes
checking for stdlib.h... yes
checking for string.h... yes
checking for memory.h... yes
checking for strings.h... yes
checking for inttypes.h... yes
checking for stdint.h... yes
checking for unistd.h... yes
checking dlfcn.h usability... yes
checking dlfcn.h presence... yes
checking for dlfcn.h... yes
checking for g++... g++
checking whether we are using the GNU C++ compiler... yes
checking whether g++ accepts -g... yes
checking dependency style of g++... gcc3
checking how to run the C++ preprocessor... g++ -E
checking for g77... no
checking for xlf... no
checking for f77... no
checking for frt... no
checking for pgf77... no
checking for cf77... no
checking for fort77... no
checking for fl32... no
checking for af77... no
checking for xlf90... no
checking for f90... no
checking for pgf90... no
checking for pghpf... no
checking for epcf90... no
checking for gfortran... no
checking for g95... no
checking for xlf95... no
checking for f95... no
checking for fort... no
checking for ifort... no
checking for ifc... no
checking for efc... no
checking for pgf95... no
checking for lf95... no
checking for ftn... no
checking whether we are using the GNU Fortran 77 compiler... no
checking whether  accepts -g... no
checking the maximum length of command line arguments... 98304
checking command to parse /usr/bin/nm -B output from gcc object... ok
checking for objdir... .libs
checking for ar... ar
checking for ranlib... ranlib
checking for strip... strip
checking if gcc supports -fno-rtti -fno-exceptions... no
checking for gcc option to produce PIC... -fPIC
checking if gcc PIC flag -fPIC works... yes
checking if gcc static flag -static works... yes
checking if gcc supports -c -o file.o... yes
checking whether the gcc linker (/usr/bin/ld) supports shared libraries... yes
checking whether -lc should be explicitly linked in... no
checking dynamic linker characteristics... GNU/Linux ld.so
checking how to hardcode library paths into programs... immediate
checking whether stripping libraries is possible... yes
checking if libtool supports shared libraries... yes
checking whether to build shared libraries... yes
checking whether to build static libraries... yes
configure: creating libtool
appending configuration tag "CXX" to libtool
checking for ld used by g++... /usr/bin/ld
checking if the linker (/usr/bin/ld) is GNU ld... yes
checking whether the g++ linker (/usr/bin/ld) supports shared libraries... yes
checking for g++ option to produce PIC... -fPIC
checking if g++ PIC flag -fPIC works... yes
checking if g++ static flag -static works... yes
checking if g++ supports -c -o file.o... yes
checking whether the g++ linker (/usr/bin/ld) supports shared libraries... yes
checking dynamic linker characteristics... GNU/Linux ld.so
checking how to hardcode library paths into programs... immediate
appending configuration tag "F77" to libtool
checking for xmlto... /usr/bin/xmlto
checking for pkg-config... /usr/bin/pkg-config
checking pkg-config is at least version 0.9.0... yes
checking for XTST... yes
configure: creating ./config.status
config.status: creating Makefile
config.status: creating man/Makefile
config.status: creating src/Makefile
config.status: creating xtst.pc
config.status: creating config.h
config.status: executing depfiles commands
cd obj-i486-linux-gnu && /usr/bin/make
make[1]: Entering directory `/build/buildd/libxtst-1.0.3/obj-i486-linux-gnu'
/usr/bin/make  all-recursive
make[2]: Entering directory `/build/buildd/libxtst-1.0.3/obj-i486-linux-gnu'
Making all in src
make[3]: Entering directory `/build/buildd/libxtst-1.0.3/obj-i486-linux-gnu/src'
/bin/bash ../libtool --tag=CC   --mode=compile gcc -DHAVE_CONFIG_H -I. -I.. -I../../src     -Wall -g -O2 -MT XRecord.lo -MD -MP -MF .deps/XRecord.Tpo -c -o XRecord.lo ../../src/XRecord.c
mkdir .libs
 gcc -DHAVE_CONFIG_H -I. -I.. -I../../src -Wall -g -O2 -MT XRecord.lo -MD -MP -MF .deps/XRecord.Tpo -c ../../src/XRecord.c  -fPIC -DPIC -o .libs/XRecord.o
 gcc -DHAVE_CONFIG_H -I. -I.. -I../../src -Wall -g -O2 -MT XRecord.lo -MD -MP -MF .deps/XRecord.Tpo -c ../../src/XRecord.c -o XRecord.o >/dev/null 2>&1
mv -f .deps/XRecord.Tpo .deps/XRecord.Plo
/bin/bash ../libtool --tag=CC   --mode=compile gcc -DHAVE_CONFIG_H -I. -I.. -I../../src     -Wall -g -O2 -MT XTest.lo -MD -MP -MF .deps/XTest.Tpo -c -o XTest.lo ../../src/XTest.c
 gcc -DHAVE_CONFIG_H -I. -I.. -I../../src -Wall -g -O2 -MT XTest.lo -MD -MP -MF .deps/XTest.Tpo -c ../../src/XTest.c  -fPIC -DPIC -o .libs/XTest.o
In file included from ../../src/XTest.c:37:
/usr/include/X11/extensions/XTest.h:50:35: error: X11/extensions/XInput.h: No such file or directory
In file included from ../../src/XTest.c:37:
/usr/include/X11/extensions/XTest.h:104: error: expected declaration specifiers or '...' before 'XDevice'
/usr/include/X11/extensions/XTest.h:114: error: expected declaration specifiers or '...' before 'XDevice'
/usr/include/X11/extensions/XTest.h:124: error: expected declaration specifiers or '...' before 'XDevice'
/usr/include/X11/extensions/XTest.h:133: error: expected declaration specifiers or '...' before 'XDevice'
../../src/XTest.c: In function 'get_xinput_base':
../../src/XTest.c:82: error: 'INAME' undeclared (first use in this function)
../../src/XTest.c:82: error: (Each undeclared identifier is reported only once
../../src/XTest.c:82: error: for each function it appears in.)
../../src/XTest.c: At top level:
../../src/XTest.c:278: error: expected declaration specifiers or '...' before 'XDevice'
../../src/XTest.c: In function 'send_axes':
../../src/XTest.c:289: error: 'dev' undeclared (first use in this function)
../../src/XTest.c: In function 'XTestFakeDeviceKeyEvent':
../../src/XTest.c:320: error: expected declaration specifiers before 'XDevice'
../../src/XTest.c:326: error: argument 'dev' doesn't match prototype
/usr/include/X11/extensions/XTest.h:102: error: prototype declaration
../../src/XTest.c:326: error: argument 'keycode' doesn't match prototype
/usr/include/X11/extensions/XTest.h:102: error: prototype declaration
../../src/XTest.c:326: error: argument 'is_press' doesn't match prototype
/usr/include/X11/extensions/XTest.h:102: error: prototype declaration
../../src/XTest.c:326: error: argument 'axes' doesn't match prototype
/usr/include/X11/extensions/XTest.h:102: error: prototype declaration
../../src/XTest.c:326: error: argument 'n_axes' doesn't match prototype
/usr/include/X11/extensions/XTest.h:102: error: prototype declaration
../../src/XTest.c:326: error: number of arguments doesn't match prototype
/usr/include/X11/extensions/XTest.h:102: error: prototype declaration
../../src/XTest.c:340: error: invalid type argument of '->' (have 'int')
../../src/XTest.c:342: error: too many arguments to function 'send_axes'
../../src/XTest.c: In function 'XTestFakeDeviceButtonEvent':
../../src/XTest.c:351: error: expected declaration specifiers before 'XDevice'
../../src/XTest.c:357: error: argument 'dev' doesn't match prototype
/usr/include/X11/extensions/XTest.h:112: error: prototype declaration
../../src/XTest.c:357: error: argument 'button' doesn't match prototype
/usr/include/X11/extensions/XTest.h:112: error: prototype declaration
../../src/XTest.c:357: error: argument 'is_press' doesn't match prototype
/usr/include/X11/extensions/XTest.h:112: error: prototype declaration
../../src/XTest.c:357: error: argument 'axes' doesn't match prototype
/usr/include/X11/extensions/XTest.h:112: error: prototype declaration
../../src/XTest.c:357: error: argument 'n_axes' doesn't match prototype
/usr/include/X11/extensions/XTest.h:112: error: prototype declaration
../../src/XTest.c:357: error: number of arguments doesn't match prototype
/usr/include/X11/extensions/XTest.h:112: error: prototype declaration
../../src/XTest.c:371: error: invalid type argument of '->' (have 'int')
../../src/XTest.c:373: error: too many arguments to function 'send_axes'
../../src/XTest.c: In function 'XTestFakeProximityEvent':
../../src/XTest.c:382: error: expected declaration specifiers before 'XDevice'
../../src/XTest.c:387: error: argument 'in_prox' doesn't match prototype
/usr/include/X11/extensions/XTest.h:122: error: prototype declaration
../../src/XTest.c:387: error: argument 'axes' doesn't match prototype
/usr/include/X11/extensions/XTest.h:122: error: prototype declaration
../../src/XTest.c:387: error: argument 'n_axes' doesn't match prototype
/usr/include/X11/extensions/XTest.h:122: error: prototype declaration
../../src/XTest.c:387: error: number of arguments doesn't match prototype
/usr/include/X11/extensions/XTest.h:122: error: prototype declaration
../../src/XTest.c:400: error: invalid type argument of '->' (have 'int')
../../src/XTest.c:402: error: too many arguments to function 'send_axes'
../../src/XTest.c: In function 'XTestFakeDeviceMotionEvent':
../../src/XTest.c:412: error: expected declaration specifiers before 'XDevice'
../../src/XTest.c:418: error: argument 'first_axis' doesn't match prototype
/usr/include/X11/extensions/XTest.h:131: error: prototype declaration
../../src/XTest.c:418: error: argument 'axes' doesn't match prototype
/usr/include/X11/extensions/XTest.h:131: error: prototype declaration
../../src/XTest.c:418: error: argument 'n_axes' doesn't match prototype
/usr/include/X11/extensions/XTest.h:131: error: prototype declaration
../../src/XTest.c:418: error: number of arguments doesn't match prototype
/usr/include/X11/extensions/XTest.h:131: error: prototype declaration
../../src/XTest.c:431: error: invalid type argument of '->' (have 'int')
../../src/XTest.c:432: error: too many arguments to function 'send_axes'
make[3]: *** [XTest.lo] Error 1
make[3]: Leaving directory `/build/buildd/libxtst-1.0.3/obj-i486-linux-gnu/src'
make[2]: *** [all-recursive] Error 1
make[2]: Leaving directory `/build/buildd/libxtst-1.0.3/obj-i486-linux-gnu'
make[1]: *** [all] Error 2
make[1]: Leaving directory `/build/buildd/libxtst-1.0.3/obj-i486-linux-gnu'
make: *** [build-stamp] Error 2
dpkg-buildpackage: failure: debian/rules build gave error exit status 2
******************************************************************************
Build finished at 20081005-0202
FAILED [dpkg-buildpackage died]
Purging chroot-intrepid-autotest/build/buildd/libxtst-1.0.3
------------------------------------------------------------------------------
  /usr/bin/sudo dpkg --root=/home/buildd/build-intrepid-autotest/chroot-intrepid-autotest --purge groff-base xtrans-dev libx11-data libglib2.0-0 libxdmcp-dev x11proto-core-dev readline-common gettext file libxcb1-dev libxcb-xlib0-dev libxcb-xlib0 libxdmcp6 sgml-data libxml2-utils x11-common x11proto-record-dev po-debconf quilt libx11-dev libxml2 x11proto-xext-dev pkg-config man-db x11proto-kb-dev intltool-debian libxcb1 x11proto-input-dev xml-core libpthread-stubs0-dev libxext-dev libgpg-error0 libxau-dev diffstat html2text libgcrypt11 gettext-base debhelper libpthread-stubs0 xmlto sgml-base docbook-xml libxslt1.1 libmagic1 libreadline5 libxext6 bsdmainutils libxau6 xsltproc libx11-6 docbook-xsl
(Reading database ... 14453 files and directories currently installed.)
Removing x11proto-record-dev ...
Removing quilt ...
Purging configuration files for quilt ...
Removing pkg-config ...
Removing libxext-dev ...
Removing diffstat ...
Removing debhelper ...
Removing xmlto ...
Removing docbook-xml ...
Purging configuration files for docbook-xml ...
Removing libxext6 ...
Purging configuration files for libxext6 ...
Removing xsltproc ...
Removing docbook-xsl ...
Purging configuration files for docbook-xsl ...
Removing libglib2.0-0 ...
Purging configuration files for libglib2.0-0 ...
Removing file ...
Purging configuration files for file ...
Removing sgml-data ...
Purging configuration files for sgml-data ...
Removing libxml2-utils ...
Removing po-debconf ...
Removing libx11-dev ...
Removing x11proto-xext-dev ...
Removing man-db ...
Purging configuration files for man-db ...
Removing x11proto-kb-dev ...
Removing intltool-debian ...
Removing x11proto-input-dev ...
Removing xml-core ...
Purging configuration files for xml-core ...
dpkg - warning: while removing xml-core, directory `/etc/sgml' not empty so not removed.
Removing html2text ...
Purging configuration files for html2text ...
Removing sgml-base ...
Purging configuration files for sgml-base ...
Removing libxslt1.1 ...
Purging configuration files for libxslt1.1 ...
Removing libmagic1 ...
Purging configuration files for libmagic1 ...
Removing libreadline5 ...
Purging configuration files for libreadline5 ...
Removing bsdmainutils ...
Purging configuration files for bsdmainutils ...
Removing libx11-6 ...
Purging configuration files for libx11-6 ...
Removing groff-base ...
Purging configuration files for groff-base ...
Removing xtrans-dev ...
Removing libx11-data ...
Removing readline-common ...
Purging configuration files for readline-common ...
Removing gettext ...
Removing libxcb-xlib0-dev ...
Removing libxcb-xlib0 ...
Purging configuration files for libxcb-xlib0 ...
Removing libxml2 ...
Purging configuration files for libxml2 ...
Removing libgcrypt11 ...
Purging configuration files for libgcrypt11 ...
Removing gettext-base ...
Removing libxcb1-dev ...
Removing libxcb1 ...
Purging configuration files for libxcb1 ...
Removing libpthread-stubs0-dev ...
Removing libgpg-error0 ...
Purging configuration files for libgpg-error0 ...
Removing libxau-dev ...
Removing libpthread-stubs0 ...
Removing libxau6 ...
Purging configuration files for libxau6 ...
Removing libxdmcp-dev ...
Removing x11proto-core-dev ...
Removing libxdmcp6 ...
Purging configuration files for libxdmcp6 ...
Removing x11-common ...
Purging configuration files for x11-common ...
dpkg - warning: while removing x11-common, directory `/usr/X11R6' not empty so not removed.
dpkg - warning: while removing x11-common, directory `/etc/X11' not empty so not removed.
******************************************************************************
Finished at 20081005-0202
Build needed 00:00:10, 2232k disk space




More information about the ubuntu-autotest mailing list