Log for failed build of open-iscsi_2.0.865-1ubuntu4 (dist=intrepid-autotest)

Build Daemon user noreply at buildd.ubuntu.com
Sat Oct 4 22:53:30 BST 2008


Automatic build of open-iscsi_2.0.865-1ubuntu4 on king by sbuild/amd64 1.170.5
Build started at 20081004-2253
******************************************************************************
Checking available source versions...
Fetching source files...
Reading package lists...
Building dependency tree...
Reading state information...
Need to get 232kB of source archives.
Get:1 http://archive.internal intrepid-autotest/main open-iscsi 2.0.865-1ubuntu4 (dsc) [695B]
Get:2 http://archive.internal intrepid-autotest/main open-iscsi 2.0.865-1ubuntu4 (tar) [224kB]
Get:3 http://archive.internal intrepid-autotest/main open-iscsi 2.0.865-1ubuntu4 (diff) [7218B]
Fetched 232kB in 0s (1755kB/s)
Download complete and in download only mode
** Using build dependencies supplied by package:
Build-Depends: bzip2, debhelper (>= 4.0.0)
Checking for already installed source dependencies...
bzip2: already installed (1.0.5-0.1ubuntu1)
debhelper: missing
Checking for source dependency conflicts...
  /usr/bin/sudo /usr/bin/apt-get --purge $CHROOT_OPTIONS -q -y install debhelper
Reading package lists...
Building dependency tree...
Reading state information...
The following packages were automatically installed and are no longer required:
  upstart-compat-sysv system-services startup-tasks sysvutils upstart perl-doc
Use 'apt-get autoremove' to remove them.
The following extra packages will be installed:
  bsdmainutils file gettext gettext-base groff-base html2text intltool-debian
  libmagic1 man-db po-debconf
Suggested packages:
  wamerican wordlist whois vacation dh-make cvs gettext-doc groff less
  www-browser
Recommended packages:
  curl wget lynx libmail-sendmail-perl libcompress-zlib-perl libmail-box-perl
The following NEW packages will be installed:
  bsdmainutils debhelper file gettext gettext-base groff-base html2text
  intltool-debian libmagic1 man-db po-debconf
0 upgraded, 11 newly installed, 0 to remove and 8 not upgraded.
Need to get 0B/6378kB of archives.
After unpacking 20.4MB of additional disk space will be used.
WARNING: The following packages cannot be authenticated!
  bsdmainutils libmagic1 file gettext-base groff-base man-db html2text gettext
  intltool-debian po-debconf debhelper
Authentication warning overridden.
Selecting previously deselected package bsdmainutils.
(Reading database ... 10710 files and directories currently installed.)
Unpacking bsdmainutils (from .../bsdmainutils_6.1.10ubuntu2_amd64.deb) ...
Selecting previously deselected package libmagic1.
Unpacking libmagic1 (from .../libmagic1_4.24-4_amd64.deb) ...
Selecting previously deselected package file.
Unpacking file (from .../archives/file_4.24-4_amd64.deb) ...
Selecting previously deselected package gettext-base.
Unpacking gettext-base (from .../gettext-base_0.17-3ubuntu2_amd64.deb) ...
Selecting previously deselected package groff-base.
Unpacking groff-base (from .../groff-base_1.18.1.1-20_amd64.deb) ...
Selecting previously deselected package man-db.
Unpacking man-db (from .../man-db_2.5.2-2_amd64.deb) ...
Selecting previously deselected package html2text.
Unpacking html2text (from .../html2text_1.3.2a-5_amd64.deb) ...
Selecting previously deselected package gettext.
Unpacking gettext (from .../gettext_0.17-3ubuntu2_amd64.deb) ...
Selecting previously deselected package intltool-debian.
Unpacking intltool-debian (from .../intltool-debian_0.35.0+20060710.1_all.deb) ...
Selecting previously deselected package po-debconf.
Unpacking po-debconf (from .../po-debconf_1.0.15_all.deb) ...
Selecting previously deselected package debhelper.
Unpacking debhelper (from .../debhelper_7.0.13ubuntu1_all.deb) ...
Setting up bsdmainutils (6.1.10ubuntu2) ...

Setting up libmagic1 (4.24-4) ...

Setting up file (4.24-4) ...
Setting up gettext-base (0.17-3ubuntu2) ...

Setting up groff-base (1.18.1.1-20) ...

Setting up man-db (2.5.2-2) ...
Building database of manual pages ...
... skipping, since this is a buildd

Setting up html2text (1.3.2a-5) ...

Setting up gettext (0.17-3ubuntu2) ...

Setting up intltool-debian (0.35.0+20060710.1) ...
Setting up po-debconf (1.0.15) ...

Setting up debhelper (7.0.13ubuntu1) ...
Checking correctness of source dependencies...
Toolchain package versions: libc6-dev_2.8~20080505-0ubuntu7 make_3.81-5 dpkg-dev_1.14.20ubuntu6 linux-libc-dev_2.6.27-5.8 g++-4.3_4.3.2-1ubuntu8 gcc-4.3_4.3.2-1ubuntu8 binutils_2.18.92.20081003-0ubuntu1 libstdc++6_4.3.2-1ubuntu8 libstdc++6-4.3-dev_4.3.2-1ubuntu8
------------------------------------------------------------------------------
dpkg-source: extracting open-iscsi in open-iscsi-2.0.865
dpkg-source: unpacking open-iscsi_2.0.865.orig.tar.gz
dpkg-source: applying /home/buildd/build-intrepid-autotest/open-iscsi_2.0.865-1ubuntu4.diff.gz
dpkg-buildpackage: set CFLAGS to default value: -g -O2
dpkg-buildpackage: set CPPFLAGS to default value: 
dpkg-buildpackage: set LDFLAGS to default value: -Wl,-Bsymbolic-functions
dpkg-buildpackage: set FFLAGS to default value: -g -O2
dpkg-buildpackage: set CXXFLAGS to default value: -g -O2
dpkg-buildpackage: source package open-iscsi
dpkg-buildpackage: source version 2.0.865-1ubuntu4
dpkg-buildpackage: host architecture amd64
 /usr/bin/fakeroot debian/rules clean
dh_testdir
dh_testroot
rm -f build-arch-stamp build-indep-stamp configure-stamp
# Add here commands to clean up after the build process.
/usr/bin/make -C usr clean
cat: /lib/modules/2.6.15.7/build/Makefile: No such file or directory
cat: /lib/modules/2.6.15.7/build/Makefile: No such file or directory
make[1]: Entering directory `/build/buildd/open-iscsi-2.0.865/usr'
rm -f *.o iscsid iscsiadm iscsistart
make[1]: Leaving directory `/build/buildd/open-iscsi-2.0.865/usr'
/usr/bin/make -C utils clean
make[1]: Entering directory `/build/buildd/open-iscsi-2.0.865/utils'
rm -f *.o iscsi-iname
make[1]: Leaving directory `/build/buildd/open-iscsi-2.0.865/utils'
rm -rf modules
dh_clean 
 debian/rules build
dh_testdir
# Add here commands to configure the package.
touch configure-stamp
# Add here commands to compile the arch part of the package.
/usr/bin/make -C usr
cat: /lib/modules/2.6.15.7/build/Makefile: No such file or directory
cat: /lib/modules/2.6.15.7/build/Makefile: No such file or directory
make[1]: Entering directory `/build/buildd/open-iscsi-2.0.865/usr'
cc -Wall -g -O2 -DDISCOVERY_FILE=\"/var/lib/open-iscsi/discovery\" -DNODE_FILE=\"/var/lib/open-iscsi/node\" -Wall -Wstrict-prototypes -I../include -DLinux -DNETLINK_ISCSI=8 -D_GNU_SOURCE   -c -o util.o util.c
util.c: In function 'daemon_init':
util.c:41: warning: ignoring return value of 'chdir', declared with attribute warn_unused_result
util.c: In function 'oom_adjust':
util.c:49: warning: ignoring return value of 'nice', declared with attribute warn_unused_result
util.c:55: warning: ignoring return value of 'write', declared with attribute warn_unused_result
util.c:56: warning: ignoring return value of 'write', declared with attribute warn_unused_result
cc -Wall -g -O2 -DDISCOVERY_FILE=\"/var/lib/open-iscsi/discovery\" -DNODE_FILE=\"/var/lib/open-iscsi/node\" -Wall -Wstrict-prototypes -I../include -DLinux -DNETLINK_ISCSI=8 -D_GNU_SOURCE   -c -o io.o io.c
io.c:86: warning: 'get_hwaddress_from_netdev' defined but not used
cc -Wall -g -O2 -DDISCOVERY_FILE=\"/var/lib/open-iscsi/discovery\" -DNODE_FILE=\"/var/lib/open-iscsi/node\" -Wall -Wstrict-prototypes -I../include -DLinux -DNETLINK_ISCSI=8 -D_GNU_SOURCE   -c -o auth.o auth.c
auth.c: In function 'get_random_bytes':
auth.c:197: warning: ignoring return value of 'read', declared with attribute warn_unused_result
auth.c:205: warning: ignoring return value of 'read', declared with attribute warn_unused_result
auth.c:213: warning: ignoring return value of 'read', declared with attribute warn_unused_result
cc -Wall -g -O2 -DDISCOVERY_FILE=\"/var/lib/open-iscsi/discovery\" -DNODE_FILE=\"/var/lib/open-iscsi/node\" -Wall -Wstrict-prototypes -I../include -DLinux -DNETLINK_ISCSI=8 -D_GNU_SOURCE   -c -o login.o login.c
cc -Wall -g -O2 -DDISCOVERY_FILE=\"/var/lib/open-iscsi/discovery\" -DNODE_FILE=\"/var/lib/open-iscsi/node\" -Wall -Wstrict-prototypes -I../include -DLinux -DNETLINK_ISCSI=8 -D_GNU_SOURCE   -c -o log.o log.c
log.c:304: warning: '__dump_char' defined but not used
cc -Wall -g -O2 -DDISCOVERY_FILE=\"/var/lib/open-iscsi/discovery\" -DNODE_FILE=\"/var/lib/open-iscsi/node\" -Wall -Wstrict-prototypes -I../include -DLinux -DNETLINK_ISCSI=8 -D_GNU_SOURCE   -c -o md5.o md5.c
cc -Wall -g -O2 -DDISCOVERY_FILE=\"/var/lib/open-iscsi/discovery\" -DNODE_FILE=\"/var/lib/open-iscsi/node\" -Wall -Wstrict-prototypes -I../include -DLinux -DNETLINK_ISCSI=8 -D_GNU_SOURCE   -c -o sha1.o sha1.c
cc -Wall -g -O2 -DDISCOVERY_FILE=\"/var/lib/open-iscsi/discovery\" -DNODE_FILE=\"/var/lib/open-iscsi/node\" -Wall -Wstrict-prototypes -I../include -DLinux -DNETLINK_ISCSI=8 -D_GNU_SOURCE   -c -o iscsi_sysfs.o iscsi_sysfs.c
iscsi_sysfs.c: In function 'delete_device':
iscsi_sysfs.c:850: warning: ignoring return value of 'write', declared with attribute warn_unused_result
iscsi_sysfs.c: In function 'scan_host':
iscsi_sysfs.c:873: warning: ignoring return value of 'write', declared with attribute warn_unused_result
cc -Wall -g -O2 -DDISCOVERY_FILE=\"/var/lib/open-iscsi/discovery\" -DNODE_FILE=\"/var/lib/open-iscsi/node\" -Wall -Wstrict-prototypes -I../include -DLinux -DNETLINK_ISCSI=8 -D_GNU_SOURCE   -c -o idbm.o idbm.c
idbm.c: In function 'iface_get_next_id':
idbm.c:1002: error: 'INT_MAX' undeclared (first use in this function)
idbm.c:1002: error: (Each undeclared identifier is reported only once
idbm.c:1002: error: for each function it appears in.)
make[1]: *** [idbm.o] Error 1
make[1]: Leaving directory `/build/buildd/open-iscsi-2.0.865/usr'
make: *** [build-arch-stamp] Error 2
dpkg-buildpackage: failure: debian/rules build gave error exit status 2
******************************************************************************
Build finished at 20081004-2253
FAILED [dpkg-buildpackage died]
Purging chroot-intrepid-autotest/build/buildd/open-iscsi-2.0.865
------------------------------------------------------------------------------
  /usr/bin/sudo dpkg --root=/home/buildd/build-intrepid-autotest/chroot-intrepid-autotest --purge po-debconf intltool-debian groff-base libmagic1 gettext file bsdmainutils html2text gettext-base man-db debhelper
(Reading database ... 11828 files and directories currently installed.)
Removing debhelper ...
Removing po-debconf ...
Removing intltool-debian ...
Removing gettext ...
Removing file ...
Purging configuration files for file ...
Removing html2text ...
Purging configuration files for html2text ...
Removing gettext-base ...
Removing man-db ...
Purging configuration files for man-db ...
Removing groff-base ...
Purging configuration files for groff-base ...
Removing libmagic1 ...
Purging configuration files for libmagic1 ...
Removing bsdmainutils ...
Purging configuration files for bsdmainutils ...
******************************************************************************
Finished at 20081004-2253
Build needed 00:00:04, 1764k disk space




More information about the ubuntu-autotest mailing list