Log for failed build of desktop-effects-kde_0.4.3 (dist=intrepid-autotest)
Build Daemon user
noreply at buildd.ubuntu.com
Thu Oct 2 19:18:06 BST 2008
Automatic build of desktop-effects-kde_0.4.3 on terranova by sbuild/i386 1.170.5
Build started at 20081002-1917
******************************************************************************
Checking available source versions...
Fetching source files...
Reading package lists...
Building dependency tree...
Reading state information...
Need to get 92.1kB of source archives.
Get:1 http://archive.internal intrepid-autotest/main desktop-effects-kde 0.4.3 (dsc) [1072B]
Get:2 http://archive.internal intrepid-autotest/main desktop-effects-kde 0.4.3 (tar) [91.0kB]
Fetched 92.1kB in 0s (3017kB/s)
Download complete and in download only mode
** Using build dependencies supplied by package:
Build-Depends: cdbs (>= 0.4.43), debhelper (>= 5.0.38), python-central (>= 0.5.6)
Checking for already installed source dependencies...
cdbs: missing
debhelper: missing
python-central: missing
Checking for source dependency conflicts...
/usr/bin/sudo /usr/bin/apt-get --purge $CHROOT_OPTIONS -q -y install cdbs debhelper python-central
Reading package lists...
Building dependency tree...
Reading state information...
The following packages were automatically installed and are no longer required:
upstart-compat-sysv startup-tasks system-services sysvutils upstart perl-doc
Use 'apt-get autoremove' to remove them.
The following extra packages will be installed:
autoconf automake1.7 autotools-dev bsdmainutils fdupes file gettext
gettext-base groff-base html2text ifupdown intltool intltool-debian
libexpat1 libhtml-parser-perl libhtml-tagset-perl libhtml-tree-perl
libmagic1 libncursesw5 libreadline5 libsqlite3-0 libssl0.9.8 liburi-perl
libwww-perl libxml-parser-perl m4 man-db mime-support net-tools netbase
po-debconf python python2.5 readline-common
Suggested packages:
autoconf2.13 autobook autoconf-archive gnu-standards autoconf-doc libtool
wamerican wordlist whois vacation devscripts doc-base dh-make cvs
gettext-doc groff iproute dhcp3-client dhcp-client ppp libio-socket-ssl-perl
less www-browser python-doc python-tk python-profiler python2.5-doc
Recommended packages:
automake automaken curl wget lynx libgpmg1 libmailtools-perl
libhtml-format-perl libcompress-zlib-perl libmail-sendmail-perl
libmail-box-perl
The following NEW packages will be installed:
autoconf automake1.7 autotools-dev bsdmainutils cdbs debhelper fdupes file
gettext gettext-base groff-base html2text ifupdown intltool intltool-debian
libexpat1 libhtml-parser-perl libhtml-tagset-perl libhtml-tree-perl
libmagic1 libncursesw5 libreadline5 libsqlite3-0 libssl0.9.8 liburi-perl
libwww-perl libxml-parser-perl m4 man-db mime-support net-tools netbase
po-debconf python python-central python2.5 readline-common
0 upgraded, 37 newly installed, 0 to remove and 0 not upgraded.
Need to get 0B/16.6MB of archives.
After unpacking 49.8MB of additional disk space will be used.
WARNING: The following packages cannot be authenticated!
net-tools netbase ifupdown libncursesw5 readline-common libreadline5
libsqlite3-0 libssl0.9.8 mime-support python2.5 python bsdmainutils
libmagic1 file gettext-base groff-base libexpat1 libhtml-tagset-perl
liburi-perl libhtml-parser-perl libhtml-tree-perl libwww-perl
libxml-parser-perl man-db python-central m4 autoconf autotools-dev
automake1.7 html2text gettext intltool-debian po-debconf debhelper fdupes
intltool cdbs
Authentication warning overridden.
Selecting previously deselected package net-tools.
(Reading database ... 10709 files and directories currently installed.)
Unpacking net-tools (from .../net-tools_1.60-19ubuntu3_i386.deb) ...
Selecting previously deselected package netbase.
Unpacking netbase (from .../netbase_4.32ubuntu1_all.deb) ...
Selecting previously deselected package ifupdown.
Unpacking ifupdown (from .../ifupdown_0.6.8ubuntu9_i386.deb) ...
Selecting previously deselected package libncursesw5.
Unpacking libncursesw5 (from .../libncursesw5_5.6+20071124-1ubuntu2_i386.deb) ...
Selecting previously deselected package readline-common.
Unpacking readline-common (from .../readline-common_5.2-3build1_all.deb) ...
Selecting previously deselected package libreadline5.
Unpacking libreadline5 (from .../libreadline5_5.2-3build1_i386.deb) ...
Selecting previously deselected package libsqlite3-0.
Unpacking libsqlite3-0 (from .../libsqlite3-0_3.5.9-3_i386.deb) ...
Selecting previously deselected package libssl0.9.8.
Unpacking libssl0.9.8 (from .../libssl0.9.8_0.9.8g-10.1ubuntu2_i386.deb) ...
Selecting previously deselected package mime-support.
Unpacking mime-support (from .../mime-support_3.44-1_all.deb) ...
Selecting previously deselected package python2.5.
Unpacking python2.5 (from .../python2.5_2.5.2-11ubuntu3_i386.deb) ...
Selecting previously deselected package python.
Unpacking python (from .../python_2.5.2-1ubuntu1_all.deb) ...
Selecting previously deselected package bsdmainutils.
Unpacking bsdmainutils (from .../bsdmainutils_6.1.10ubuntu2_i386.deb) ...
Selecting previously deselected package libmagic1.
Unpacking libmagic1 (from .../libmagic1_4.24-4_i386.deb) ...
Selecting previously deselected package file.
Unpacking file (from .../archives/file_4.24-4_i386.deb) ...
Selecting previously deselected package gettext-base.
Unpacking gettext-base (from .../gettext-base_0.17-3ubuntu2_i386.deb) ...
Selecting previously deselected package groff-base.
Unpacking groff-base (from .../groff-base_1.18.1.1-20_i386.deb) ...
Selecting previously deselected package libexpat1.
Unpacking libexpat1 (from .../libexpat1_2.0.1-4_i386.deb) ...
Selecting previously deselected package libhtml-tagset-perl.
Unpacking libhtml-tagset-perl (from .../libhtml-tagset-perl_3.20-2_all.deb) ...
Selecting previously deselected package liburi-perl.
Unpacking liburi-perl (from .../liburi-perl_1.35.dfsg.1-1_all.deb) ...
Selecting previously deselected package libhtml-parser-perl.
Unpacking libhtml-parser-perl (from .../libhtml-parser-perl_3.56-1ubuntu2_i386.deb) ...
Selecting previously deselected package libhtml-tree-perl.
Unpacking libhtml-tree-perl (from .../libhtml-tree-perl_3.23-1_all.deb) ...
Selecting previously deselected package libwww-perl.
Unpacking libwww-perl (from .../libwww-perl_5.812-1_all.deb) ...
Selecting previously deselected package libxml-parser-perl.
Unpacking libxml-parser-perl (from .../libxml-parser-perl_2.36-1.1build2_i386.deb) ...
Selecting previously deselected package man-db.
Unpacking man-db (from .../man-db_2.5.2-2_i386.deb) ...
Selecting previously deselected package python-central.
Unpacking python-central (from .../python-central_0.6.7ubuntu1_all.deb) ...
Selecting previously deselected package m4.
Unpacking m4 (from .../archives/m4_1.4.11-1_i386.deb) ...
Selecting previously deselected package autoconf.
Unpacking autoconf (from .../autoconf_2.61-7ubuntu1_all.deb) ...
Selecting previously deselected package autotools-dev.
Unpacking autotools-dev (from .../autotools-dev_20080123.1_all.deb) ...
Selecting previously deselected package automake1.7.
Unpacking automake1.7 (from .../automake1.7_1.7.9-9_all.deb) ...
Selecting previously deselected package html2text.
Unpacking html2text (from .../html2text_1.3.2a-5_i386.deb) ...
Selecting previously deselected package gettext.
Unpacking gettext (from .../gettext_0.17-3ubuntu2_i386.deb) ...
Selecting previously deselected package intltool-debian.
Unpacking intltool-debian (from .../intltool-debian_0.35.0+20060710.1_all.deb) ...
Selecting previously deselected package po-debconf.
Unpacking po-debconf (from .../po-debconf_1.0.15_all.deb) ...
Selecting previously deselected package debhelper.
Unpacking debhelper (from .../debhelper_7.0.13ubuntu1_all.deb) ...
Selecting previously deselected package fdupes.
Unpacking fdupes (from .../fdupes_1.50-PR2-1_i386.deb) ...
Selecting previously deselected package intltool.
Unpacking intltool (from .../intltool_0.40.4-0ubuntu1_all.deb) ...
Selecting previously deselected package cdbs.
Unpacking cdbs (from .../cdbs_0.4.52ubuntu7_all.deb) ...
Setting up net-tools (1.60-19ubuntu3) ...
Setting up libncursesw5 (5.6+20071124-1ubuntu2) ...
Setting up readline-common (5.2-3build1) ...
Setting up libreadline5 (5.2-3build1) ...
Setting up libsqlite3-0 (3.5.9-3) ...
Setting up libssl0.9.8 (0.9.8g-10.1ubuntu2) ...
Setting up mime-support (3.44-1) ...
Setting up python2.5 (2.5.2-11ubuntu3) ...
Setting up python (2.5.2-1ubuntu1) ...
Setting up bsdmainutils (6.1.10ubuntu2) ...
Setting up libmagic1 (4.24-4) ...
Setting up file (4.24-4) ...
Setting up gettext-base (0.17-3ubuntu2) ...
Setting up groff-base (1.18.1.1-20) ...
Setting up libexpat1 (2.0.1-4) ...
Setting up libhtml-tagset-perl (3.20-2) ...
Setting up liburi-perl (1.35.dfsg.1-1) ...
Setting up libhtml-parser-perl (3.56-1ubuntu2) ...
Setting up libhtml-tree-perl (3.23-1) ...
Setting up man-db (2.5.2-2) ...
Building database of manual pages ...
... skipping, since this is a buildd
Setting up python-central (0.6.7ubuntu1) ...
Setting up m4 (1.4.11-1) ...
Setting up autoconf (2.61-7ubuntu1) ...
Setting up autotools-dev (20080123.1) ...
Setting up automake1.7 (1.7.9-9) ...
Setting up html2text (1.3.2a-5) ...
Setting up gettext (0.17-3ubuntu2) ...
Setting up intltool-debian (0.35.0+20060710.1) ...
Setting up po-debconf (1.0.15) ...
Setting up debhelper (7.0.13ubuntu1) ...
Setting up fdupes (1.50-PR2-1) ...
Setting up netbase (4.32ubuntu1) ...
Setting up libwww-perl (5.812-1) ...
Setting up libxml-parser-perl (2.36-1.1build2) ...
Setting up intltool (0.40.4-0ubuntu1) ...
Setting up cdbs (0.4.52ubuntu7) ...
Setting up ifupdown (0.6.8ubuntu9) ...
ifupdown.postinst: Warning: No 'iface lo' definition found in /etc/network/interfaces
ifupdown.postinst: Warning: No 'auto lo' statement found in /etc/network/interfaces
Checking correctness of source dependencies...
Toolchain package versions: libc6-dev_2.8~20080505-0ubuntu7 make_3.81-5 dpkg-dev_1.14.20ubuntu6 linux-libc-dev_2.6.27-4.6 g++-4.3_4.3.2-1ubuntu8 gcc-4.3_4.3.2-1ubuntu8 binutils_2.18.91.20080923-0ubuntu1 libstdc++6_4.3.2-1ubuntu8 libstdc++6-4.3-dev_4.3.2-1ubuntu8
------------------------------------------------------------------------------
dpkg-source: extracting desktop-effects-kde in desktop-effects-kde-0.4.3
dpkg-source: unpacking desktop-effects-kde_0.4.3.tar.gz
dpkg-buildpackage: set CFLAGS to default value: -g -O2
dpkg-buildpackage: set CPPFLAGS to default value:
dpkg-buildpackage: set LDFLAGS to default value: -Wl,-Bsymbolic-functions
dpkg-buildpackage: set FFLAGS to default value: -g -O2
dpkg-buildpackage: set CXXFLAGS to default value: -g -O2
dpkg-buildpackage: source package desktop-effects-kde
dpkg-buildpackage: source version 0.4.3
dpkg-buildpackage: host architecture i386
/usr/bin/fakeroot debian/rules clean
test -x debian/rules
dh_testroot
dh_clean
debian/rules build
test -x debian/rules
mkdir -p "."
/usr/bin/fakeroot debian/rules binary
test -x debian/rules
dh_testroot
dh_clean -k
dh_installdirs -A
mkdir -p "."
dh_installdirs -pdesktop-effects-kde
dh_installdocs -pdesktop-effects-kde
dh_installexamples -pdesktop-effects-kde
dh_installman -pdesktop-effects-kde
dh_installinfo -pdesktop-effects-kde
dh_installmenu -pdesktop-effects-kde
dh_installcron -pdesktop-effects-kde
dh_installinit -pdesktop-effects-kde
dh_installdebconf -pdesktop-effects-kde
dh_installemacsen -pdesktop-effects-kde
dh_installcatalogs -pdesktop-effects-kde
dh_installpam -pdesktop-effects-kde
dh_installlogrotate -pdesktop-effects-kde
dh_installlogcheck -pdesktop-effects-kde
dh_installchangelogs -pdesktop-effects-kde
dh_installudev -pdesktop-effects-kde
dh_lintian -pdesktop-effects-kde
dh_install -pdesktop-effects-kde
dh_link -pdesktop-effects-kde
dh_installmime -pdesktop-effects-kde
dh_pycentral -pdesktop-effects-kde
dh_strip -pdesktop-effects-kde
dh_strip debug symbol extraction: disabling for archive rebuild test
dh_strip debug symbol extraction: not doing anything since NO_PKG_MANGLE is given
dh_compress -pdesktop-effects-kde
dh_fixperms -pdesktop-effects-kde
dh_makeshlibs -pdesktop-effects-kde
dh_installdeb -pdesktop-effects-kde
dh_perl -pdesktop-effects-kde
dh_shlibdeps -pdesktop-effects-kde
dh_gencontrol -pdesktop-effects-kde
dpkg-gencontrol: warning: can't parse dependency python-central (>= 0.6.7) kdesudo
dpkg-gencontrol: error: error occurred while parsing python, python-central (>= 0.6.7) kdesudo
dh_gencontrol: command returned error code 65280
make: *** [binary-makedeb-IMPL/desktop-effects-kde] Error 1
dpkg-buildpackage: failure: /usr/bin/fakeroot debian/rules binary gave error exit status 2
******************************************************************************
Build finished at 20081002-1917
FAILED [dpkg-buildpackage died]
Purging chroot-intrepid-autotest/build/buildd/desktop-effects-kde-0.4.3
------------------------------------------------------------------------------
/usr/bin/sudo dpkg --root=/home/buildd/build-intrepid-autotest/chroot-intrepid-autotest --purge groff-base mime-support m4 readline-common gettext file libhtml-parser-perl intltool python2.5 libwww-perl liburi-perl libhtml-tree-perl ifupdown autotools-dev po-debconf net-tools libxml-parser-perl libhtml-tagset-perl netbase man-db libssl0.9.8 intltool-debian automake1.7 cdbs html2text gettext-base debhelper python python-central libmagic1 libreadline5 libexpat1 libsqlite3-0 bsdmainutils fdupes autoconf libncursesw5
(Reading database ... 13261 files and directories currently installed.)
Removing cdbs ...
Removing debhelper ...
Removing python-central ...
Purging configuration files for python-central ...
Removing fdupes ...
Removing intltool ...
Removing po-debconf ...
Removing libxml-parser-perl ...
Removing man-db ...
Purging configuration files for man-db ...
Removing intltool-debian ...
Removing automake1.7 ...
Removing html2text ...
Purging configuration files for html2text ...
Removing python ...
Purging configuration files for python ...
Removing libexpat1 ...
Purging configuration files for libexpat1 ...
Removing bsdmainutils ...
Purging configuration files for bsdmainutils ...
Removing autoconf ...
Purging configuration files for autoconf ...
Removing groff-base ...
Purging configuration files for groff-base ...
Removing m4 ...
Removing gettext ...
Removing file ...
Purging configuration files for file ...
Removing python2.5 ...
Purging configuration files for python2.5 ...
dpkg - warning: while removing python2.5, directory `/usr/share/applications' not empty so not removed.
Removing libwww-perl ...
Removing libhtml-tree-perl ...
Removing autotools-dev ...
Removing libssl0.9.8 ...
Purging configuration files for libssl0.9.8 ...
Removing gettext-base ...
Removing libmagic1 ...
Purging configuration files for libmagic1 ...
Removing libreadline5 ...
Purging configuration files for libreadline5 ...
Removing libsqlite3-0 ...
Purging configuration files for libsqlite3-0 ...
Removing libncursesw5 ...
Purging configuration files for libncursesw5 ...
Removing mime-support ...
Purging configuration files for mime-support ...
Removing readline-common ...
Purging configuration files for readline-common ...
Removing libhtml-parser-perl ...
Removing liburi-perl ...
Removing libhtml-tagset-perl ...
Removing netbase ...
Purging configuration files for netbase ...
Removing ifupdown ...
Purging configuration files for ifupdown ...
Removing net-tools ...
******************************************************************************
Finished at 20081002-1918
Build needed 00:00:05, 580k disk space
More information about the ubuntu-autotest
mailing list