Log for failed build of ossp-uuid_1.5.1-1.1ubuntu2 (dist=intrepid-autotest)
Build Daemon user
noreply at buildd.ubuntu.com
Thu Oct 2 13:34:49 BST 2008
Automatic build of ossp-uuid_1.5.1-1.1ubuntu2 on king by sbuild/amd64 1.170.5
Build started at 20081002-1333
******************************************************************************
Checking available source versions...
Fetching source files...
Reading package lists...
Building dependency tree...
Reading state information...
Need to get 408kB of source archives.
Get:1 http://archive.internal intrepid-autotest/main ossp-uuid 1.5.1-1.1ubuntu2 (dsc) [788B]
Get:2 http://archive.internal intrepid-autotest/main ossp-uuid 1.5.1-1.1ubuntu2 (tar) [402kB]
Get:3 http://archive.internal intrepid-autotest/main ossp-uuid 1.5.1-1.1ubuntu2 (diff) [5527B]
Fetched 408kB in 0s (8374kB/s)
Download complete and in download only mode
** Using build dependencies supplied by package:
Build-Depends: cdbs, chrpath, debhelper (>= 5), libtool, perl (>= 5.8), php5-cli, php5-dev
Checking for already installed source dependencies...
cdbs: missing
chrpath: missing
debhelper: missing
libtool: missing
perl: already installed (5.10.0-11.1ubuntu2 >= 5.8 is satisfied)
php5-cli: missing
php5-dev: missing
Checking for source dependency conflicts...
/usr/bin/sudo /usr/bin/apt-get --purge $CHROOT_OPTIONS -q -y install cdbs chrpath debhelper libtool php5-cli php5-dev
Reading package lists...
Building dependency tree...
Reading state information...
The following packages were automatically installed and are no longer required:
upstart-compat-sysv system-services startup-tasks sysvutils upstart perl-doc
Use 'apt-get autoremove' to remove them.
The following extra packages will be installed:
autoconf automake1.4 automake1.7 autotools-dev bsdmainutils fdupes file
gettext gettext-base groff-base html2text ifupdown intltool intltool-debian
libedit2 libexpat1 libhtml-parser-perl libhtml-tagset-perl libhtml-tree-perl
libkeyutils1 libkrb53 libmagic1 libssl-dev libssl0.9.8 liburi-perl
libwww-perl libxml-parser-perl libxml2 m4 man-db mime-support net-tools
netbase php5-common po-debconf shtool zlib1g-dev
Suggested packages:
autoconf2.13 autobook autoconf-archive gnu-standards autoconf-doc wamerican
wordlist whois vacation devscripts doc-base dh-make cvs gettext-doc groff
iproute dhcp3-client dhcp-client ppp krb5-doc krb5-user libtool-doc gfortran
fortran95-compiler gcj libio-socket-ssl-perl less www-browser php-pear
php5-timezonedb
Recommended packages:
automake automaken curl wget lynx libltdl7-dev libmailtools-perl
libhtml-format-perl libcompress-zlib-perl xml-core libmail-sendmail-perl
libmail-box-perl
The following NEW packages will be installed:
autoconf automake1.4 automake1.7 autotools-dev bsdmainutils cdbs chrpath
debhelper fdupes file gettext gettext-base groff-base html2text ifupdown
intltool intltool-debian libedit2 libexpat1 libhtml-parser-perl
libhtml-tagset-perl libhtml-tree-perl libkeyutils1 libkrb53 libmagic1
libssl-dev libssl0.9.8 libtool liburi-perl libwww-perl libxml-parser-perl
libxml2 m4 man-db mime-support net-tools netbase php5-cli php5-common
php5-dev po-debconf shtool zlib1g-dev
0 upgraded, 43 newly installed, 0 to remove and 0 not upgraded.
Need to get 4553kB/19.2MB of archives.
After unpacking 56.5MB of additional disk space will be used.
WARNING: The following packages cannot be authenticated!
net-tools netbase ifupdown libkeyutils1 libkrb53 libssl0.9.8 mime-support
bsdmainutils libmagic1 file gettext-base groff-base libedit2 libexpat1
libhtml-tagset-perl liburi-perl libhtml-parser-perl libhtml-tree-perl
libwww-perl libxml-parser-perl man-db m4 autoconf autotools-dev automake1.4
automake1.7 html2text gettext intltool-debian po-debconf debhelper fdupes
intltool cdbs chrpath zlib1g-dev libssl-dev libtool libxml2 php5-common
php5-cli shtool php5-dev
Authentication warning overridden.
Get:1 http://archive.internal intrepid-autotest/main libxml2 2.6.32.dfsg-4ubuntu1 [863kB]
Get:2 http://ftpmaster.internal intrepid/main automake1.4 1:1.4-p6-13 [233kB]
Get:3 http://ftpmaster.internal intrepid/main php5-common 5.2.6-2ubuntu3 [368kB]
Get:4 http://ftpmaster.internal intrepid/main php5-cli 5.2.6-2ubuntu3 [2569kB]
Get:5 http://ftpmaster.internal intrepid/main shtool 2.0.7-3 [159kB]
Get:6 http://ftpmaster.internal intrepid/main php5-dev 5.2.6-2ubuntu3 [362kB]
Fetched 4553kB in 0s (6376kB/s)
Selecting previously deselected package net-tools.
(Reading database ... 10701 files and directories currently installed.)
Unpacking net-tools (from .../net-tools_1.60-19ubuntu3_amd64.deb) ...
Selecting previously deselected package netbase.
Unpacking netbase (from .../netbase_4.32ubuntu1_all.deb) ...
Selecting previously deselected package ifupdown.
Unpacking ifupdown (from .../ifupdown_0.6.8ubuntu9_amd64.deb) ...
Selecting previously deselected package libkeyutils1.
Unpacking libkeyutils1 (from .../libkeyutils1_1.2-7_amd64.deb) ...
Selecting previously deselected package libkrb53.
Unpacking libkrb53 (from .../libkrb53_1.6.dfsg.4~beta1-3_amd64.deb) ...
Selecting previously deselected package libssl0.9.8.
Unpacking libssl0.9.8 (from .../libssl0.9.8_0.9.8g-10.1ubuntu2_amd64.deb) ...
Selecting previously deselected package mime-support.
Unpacking mime-support (from .../mime-support_3.44-1_all.deb) ...
Selecting previously deselected package bsdmainutils.
Unpacking bsdmainutils (from .../bsdmainutils_6.1.10ubuntu2_amd64.deb) ...
Selecting previously deselected package libmagic1.
Unpacking libmagic1 (from .../libmagic1_4.24-4_amd64.deb) ...
Selecting previously deselected package file.
Unpacking file (from .../archives/file_4.24-4_amd64.deb) ...
Selecting previously deselected package gettext-base.
Unpacking gettext-base (from .../gettext-base_0.17-3ubuntu2_amd64.deb) ...
Selecting previously deselected package groff-base.
Unpacking groff-base (from .../groff-base_1.18.1.1-20_amd64.deb) ...
Selecting previously deselected package libedit2.
Unpacking libedit2 (from .../libedit2_2.11~20080614-1ubuntu1_amd64.deb) ...
Selecting previously deselected package libexpat1.
Unpacking libexpat1 (from .../libexpat1_2.0.1-4_amd64.deb) ...
Selecting previously deselected package libhtml-tagset-perl.
Unpacking libhtml-tagset-perl (from .../libhtml-tagset-perl_3.20-2_all.deb) ...
Selecting previously deselected package liburi-perl.
Unpacking liburi-perl (from .../liburi-perl_1.35.dfsg.1-1_all.deb) ...
Selecting previously deselected package libhtml-parser-perl.
Unpacking libhtml-parser-perl (from .../libhtml-parser-perl_3.56-1ubuntu2_amd64.deb) ...
Selecting previously deselected package libhtml-tree-perl.
Unpacking libhtml-tree-perl (from .../libhtml-tree-perl_3.23-1_all.deb) ...
Selecting previously deselected package libwww-perl.
Unpacking libwww-perl (from .../libwww-perl_5.812-1_all.deb) ...
Selecting previously deselected package libxml-parser-perl.
Unpacking libxml-parser-perl (from .../libxml-parser-perl_2.36-1.1build2_amd64.deb) ...
Selecting previously deselected package man-db.
Unpacking man-db (from .../man-db_2.5.2-2_amd64.deb) ...
Selecting previously deselected package m4.
Unpacking m4 (from .../archives/m4_1.4.11-1_amd64.deb) ...
Selecting previously deselected package autoconf.
Unpacking autoconf (from .../autoconf_2.61-7ubuntu1_all.deb) ...
Selecting previously deselected package autotools-dev.
Unpacking autotools-dev (from .../autotools-dev_20080123.1_all.deb) ...
Selecting previously deselected package automake1.4.
Unpacking automake1.4 (from .../automake1.4_1%3a1.4-p6-13_all.deb) ...
Selecting previously deselected package automake1.7.
Unpacking automake1.7 (from .../automake1.7_1.7.9-9_all.deb) ...
Selecting previously deselected package html2text.
Unpacking html2text (from .../html2text_1.3.2a-5_amd64.deb) ...
Selecting previously deselected package gettext.
Unpacking gettext (from .../gettext_0.17-3ubuntu2_amd64.deb) ...
Selecting previously deselected package intltool-debian.
Unpacking intltool-debian (from .../intltool-debian_0.35.0+20060710.1_all.deb) ...
Selecting previously deselected package po-debconf.
Unpacking po-debconf (from .../po-debconf_1.0.15_all.deb) ...
Selecting previously deselected package debhelper.
Unpacking debhelper (from .../debhelper_7.0.13ubuntu1_all.deb) ...
Selecting previously deselected package fdupes.
Unpacking fdupes (from .../fdupes_1.50-PR2-1_amd64.deb) ...
Selecting previously deselected package intltool.
Unpacking intltool (from .../intltool_0.40.4-0ubuntu1_all.deb) ...
Selecting previously deselected package cdbs.
Unpacking cdbs (from .../cdbs_0.4.52ubuntu7_all.deb) ...
Selecting previously deselected package chrpath.
Unpacking chrpath (from .../chrpath_0.13-2_amd64.deb) ...
Selecting previously deselected package zlib1g-dev.
Unpacking zlib1g-dev (from .../zlib1g-dev_1%3a1.2.3.3.dfsg-12ubuntu1_amd64.deb) ...
Selecting previously deselected package libssl-dev.
Unpacking libssl-dev (from .../libssl-dev_0.9.8g-10.1ubuntu2_amd64.deb) ...
Selecting previously deselected package libtool.
Unpacking libtool (from .../libtool_2.2.4-0ubuntu4_amd64.deb) ...
Selecting previously deselected package libxml2.
Unpacking libxml2 (from .../libxml2_2.6.32.dfsg-4ubuntu1_amd64.deb) ...
Selecting previously deselected package php5-common.
Unpacking php5-common (from .../php5-common_5.2.6-2ubuntu3_amd64.deb) ...
Selecting previously deselected package php5-cli.
Unpacking php5-cli (from .../php5-cli_5.2.6-2ubuntu3_amd64.deb) ...
Selecting previously deselected package shtool.
Unpacking shtool (from .../shtool_2.0.7-3_all.deb) ...
Selecting previously deselected package php5-dev.
Unpacking php5-dev (from .../php5-dev_5.2.6-2ubuntu3_amd64.deb) ...
Setting up net-tools (1.60-19ubuntu3) ...
Setting up libkeyutils1 (1.2-7) ...
Setting up libkrb53 (1.6.dfsg.4~beta1-3) ...
Setting up libssl0.9.8 (0.9.8g-10.1ubuntu2) ...
Setting up mime-support (3.44-1) ...
Setting up bsdmainutils (6.1.10ubuntu2) ...
Setting up libmagic1 (4.24-4) ...
Setting up file (4.24-4) ...
Setting up gettext-base (0.17-3ubuntu2) ...
Setting up groff-base (1.18.1.1-20) ...
Setting up libedit2 (2.11~20080614-1ubuntu1) ...
Setting up libexpat1 (2.0.1-4) ...
Setting up libhtml-tagset-perl (3.20-2) ...
Setting up liburi-perl (1.35.dfsg.1-1) ...
Setting up libhtml-parser-perl (3.56-1ubuntu2) ...
Setting up libhtml-tree-perl (3.23-1) ...
Setting up man-db (2.5.2-2) ...
Building database of manual pages ...
... skipping, since this is a buildd
Setting up m4 (1.4.11-1) ...
Setting up autoconf (2.61-7ubuntu1) ...
Setting up autotools-dev (20080123.1) ...
Setting up automake1.4 (1.4-p6-13) ...
Setting up automake1.7 (1.7.9-9) ...
Setting up html2text (1.3.2a-5) ...
Setting up gettext (0.17-3ubuntu2) ...
Setting up intltool-debian (0.35.0+20060710.1) ...
Setting up po-debconf (1.0.15) ...
Setting up debhelper (7.0.13ubuntu1) ...
Setting up fdupes (1.50-PR2-1) ...
Setting up chrpath (0.13-2) ...
Setting up zlib1g-dev (1.2.3.3.dfsg-12ubuntu1) ...
Setting up libssl-dev (0.9.8g-10.1ubuntu2) ...
Setting up libtool (2.2.4-0ubuntu4) ...
Setting up libxml2 (2.6.32.dfsg-4ubuntu1) ...
Setting up php5-common (5.2.6-2ubuntu3) ...
Setting up php5-cli (5.2.6-2ubuntu3) ...
Creating config file /etc/php5/cli/php.ini with new version
Setting up shtool (2.0.7-3) ...
Setting up php5-dev (5.2.6-2ubuntu3) ...
Setting up netbase (4.32ubuntu1) ...
Setting up libwww-perl (5.812-1) ...
Setting up libxml-parser-perl (2.36-1.1build2) ...
Setting up intltool (0.40.4-0ubuntu1) ...
Setting up cdbs (0.4.52ubuntu7) ...
Setting up ifupdown (0.6.8ubuntu9) ...
ifupdown.postinst: Warning: No 'iface lo' definition found in /etc/network/interfaces
ifupdown.postinst: Warning: No 'auto lo' statement found in /etc/network/interfaces
Checking correctness of source dependencies...
Toolchain package versions: libc6-dev_2.8~20080505-0ubuntu7 make_3.81-5 dpkg-dev_1.14.20ubuntu6 linux-libc-dev_2.6.27-4.6 g++-4.3_4.3.2-1ubuntu8 gcc-4.3_4.3.2-1ubuntu8 binutils_2.18.91.20080923-0ubuntu1 libstdc++6_4.3.2-1ubuntu8 libstdc++6-4.3-dev_4.3.2-1ubuntu8
------------------------------------------------------------------------------
dpkg-source: extracting ossp-uuid in ossp-uuid-1.5.1
dpkg-source: unpacking ossp-uuid_1.5.1.orig.tar.gz
dpkg-source: applying /home/buildd/build-intrepid-autotest/ossp-uuid_1.5.1-1.1ubuntu2.diff.gz
dpkg-buildpackage: set CFLAGS to default value: -g -O2
dpkg-buildpackage: set CPPFLAGS to default value:
dpkg-buildpackage: set LDFLAGS to default value: -Wl,-Bsymbolic-functions
dpkg-buildpackage: set FFLAGS to default value: -g -O2
dpkg-buildpackage: set CXXFLAGS to default value: -g -O2
dpkg-buildpackage: source package ossp-uuid
dpkg-buildpackage: source version 1.5.1-1.1ubuntu2
dpkg-buildpackage: host architecture amd64
/usr/bin/fakeroot debian/rules clean
test -x debian/rules
test "`id -u`" = 0
for i in ./config.guess ./config.sub ; do \
if test -e $i.cdbs-orig ; then \
mv $i.cdbs-orig $i ; \
fi ; \
done
/usr/bin/make -C . -k distclean
make[1]: Entering directory `/build/buildd/ossp-uuid-1.5.1'
make[1]: *** No rule to make target `distclean'.
make[1]: Leaving directory `/build/buildd/ossp-uuid-1.5.1'
make: [makefile-clean] Error 2 (ignored)
rm -f debian/stamp-makefile-build
rm -f debian/stamp-autotools-files
dh_clean
/usr/bin/make -f debian/rules reverse-config
make[1]: Entering directory `/build/buildd/ossp-uuid-1.5.1'
for i in ./config.guess ./config.sub ; do \
if test -e $i.cdbs-orig ; then \
mv $i.cdbs-orig $i ; \
fi ; \
done
make[1]: Leaving directory `/build/buildd/ossp-uuid-1.5.1'
if [ "reverse-patches" = "reverse-patches" ]; then rm -f debian/stamp-patched; fi
patches: debian/patches/001-ossp-uuid_library_name.patch debian/patches/101-encode_base64_empty_string.diff
Patch debian/patches/101-encode_base64_empty_string.diff is not applied.
Patch debian/patches/001-ossp-uuid_library_name.patch is not applied.
if [ "reverse-patches" != "reverse-patches" ]; then touch debian/stamp-patched; fi
if [ "reverse-patches" != "reverse-patches" ] ; then \
/usr/bin/make -f debian/rules update-config ; \
fi
for dir in debian/patches ; do \
rm -f $dir/*.log ; \
done
cd perl; test -f Makefile && touch Makefile && make distclean || true
rm -rf php/build-php?
cd php; phpize --clean || true
Cleaning..
test -f Makefile && touch Makefile && make distclean || true
rm -f build-stamp-ext
debian/rules build
test -x debian/rules
mkdir -p "."
/usr/bin/make -f debian/rules reverse-config
make[1]: Entering directory `/build/buildd/ossp-uuid-1.5.1'
for i in ./config.guess ./config.sub ; do \
if test -e $i.cdbs-orig ; then \
mv $i.cdbs-orig $i ; \
fi ; \
done
make[1]: Leaving directory `/build/buildd/ossp-uuid-1.5.1'
if [ "debian/stamp-patched" = "reverse-patches" ]; then rm -f debian/stamp-patched; fi
patches: debian/patches/001-ossp-uuid_library_name.patch debian/patches/101-encode_base64_empty_string.diff
Trying patch debian/patches/001-ossp-uuid_library_name.patch at level 1 ... success.
Trying patch debian/patches/101-encode_base64_empty_string.diff at level 1 ... success.
if [ "debian/stamp-patched" != "reverse-patches" ]; then touch debian/stamp-patched; fi
if [ "debian/stamp-patched" != "reverse-patches" ] ; then \
/usr/bin/make -f debian/rules update-config ; \
fi
make[1]: Entering directory `/build/buildd/ossp-uuid-1.5.1'
if test -e /usr/share/misc/config.guess ; then \
for i in ./config.guess ; do \
if ! test -e $i.cdbs-orig ; then \
mv $i $i.cdbs-orig ; \
cp --remove-destination /usr/share/misc/config.guess $i ; \
fi ; \
done ; \
fi
if test -e /usr/share/misc/config.sub ; then \
for i in ./config.sub ; do \
if ! test -e $i.cdbs-orig ; then \
mv $i $i.cdbs-orig ; \
cp --remove-destination /usr/share/misc/config.sub $i ; \
fi ; \
done ; \
fi
make[1]: Leaving directory `/build/buildd/ossp-uuid-1.5.1'
if test -e /usr/share/misc/config.guess ; then \
for i in ./config.guess ; do \
if ! test -e $i.cdbs-orig ; then \
mv $i $i.cdbs-orig ; \
cp --remove-destination /usr/share/misc/config.guess $i ; \
fi ; \
done ; \
fi
if test -e /usr/share/misc/config.sub ; then \
for i in ./config.sub ; do \
if ! test -e $i.cdbs-orig ; then \
mv $i $i.cdbs-orig ; \
cp --remove-destination /usr/share/misc/config.sub $i ; \
fi ; \
done ; \
fi
touch debian/stamp-autotools-files
chmod a+x /build/buildd/ossp-uuid-1.5.1/./configure
cd . && CC="cc" CXX="g++" CFLAGS="-g -O2 -g -Wall -O2" CXXFLAGS="-g -O2 -g -Wall -O2" CPPFLAGS="" LDFLAGS="-Wl,-Bsymbolic-functions" /build/buildd/ossp-uuid-1.5.1/./configure --build=x86_64-linux-gnu --prefix=/usr --includedir="\${prefix}/include" --mandir="\${prefix}/share/man" --infodir="\${prefix}/share/info" --sysconfdir=/etc --localstatedir=/var --libexecdir="\${prefix}/lib/ossp-uuid" --disable-maintainer-mode --disable-dependency-tracking --srcdir=. --srcdir= --includedir=/usr/include/ossp --without-perl --without-dce --with-cxx
shtool:echo:Warning: unable to determine terminal sequence for bold mode
Configuring OSSP uuid (Universally Unique Identifier), version 1.5.1 (31-Jul-2006)
checking whether make sets $(MAKE)... yes
checking for gcc... cc
checking for C compiler default output file name... a.out
checking whether the C compiler works... yes
checking whether we are cross compiling... no
checking for suffix of executables...
checking for suffix of object files... o
checking whether we are using the GNU C compiler... yes
checking whether cc accepts -g... yes
checking for cc option to accept ISO C89... none needed
checking whether compiler option(s) -pipe work... yes
checking for compilation debug mode... disabled
checking build system type... x86_64-pc-linux-gnu
checking host system type... x86_64-pc-linux-gnu
checking for a sed that does not truncate output... /bin/sed
checking for grep that handles long lines and -e... /bin/grep
checking for egrep... /bin/grep -E
checking for ld used by cc... /usr/bin/ld
checking if the linker (/usr/bin/ld) is GNU ld... yes
checking for /usr/bin/ld option to reload object files... -r
checking for BSD-compatible nm... /usr/bin/nm -B
checking whether ln -s works... yes
checking how to recognise dependent libraries... pass_all
checking how to run the C preprocessor... cc -E
checking for ANSI C header files... yes
checking for sys/types.h... yes
checking for sys/stat.h... yes
checking for stdlib.h... yes
checking for string.h... yes
checking for memory.h... yes
checking for strings.h... yes
checking for inttypes.h... yes
checking for stdint.h... yes
checking for unistd.h... yes
checking dlfcn.h usability... yes
checking dlfcn.h presence... yes
checking for dlfcn.h... yes
checking whether we are using the GNU C++ compiler... yes
checking whether g++ accepts -g... yes
checking how to run the C++ preprocessor... g++ -E
checking for g77... no
checking for f77... no
checking for xlf... no
checking for frt... no
checking for pgf77... no
checking for cf77... no
checking for fort77... no
checking for fl32... no
checking for af77... no
checking for f90... no
checking for xlf90... no
checking for pgf90... no
checking for pghpf... no
checking for epcf90... no
checking for gfortran... no
checking for g95... no
checking for f95... no
checking for fort... no
checking for xlf95... no
checking for ifort... no
checking for ifc... no
checking for efc... no
checking for pgf95... no
checking for lf95... no
checking for ftn... no
checking whether we are using the GNU Fortran 77 compiler... no
checking whether accepts -g... no
checking the maximum length of command line arguments... 32768
checking command to parse /usr/bin/nm -B output from cc object... ok
checking for objdir... .libs
checking for ar... ar
checking for ranlib... ranlib
checking for strip... strip
checking if cc supports -fno-rtti -fno-exceptions... no
checking for cc option to produce PIC... -fPIC
checking if cc PIC flag -fPIC works... yes
checking if cc static flag -static works... yes
checking if cc supports -c -o file.o... yes
checking whether the cc linker (/usr/bin/ld -m elf_x86_64) supports shared libraries... yes
checking whether -lc should be explicitly linked in... no
checking dynamic linker characteristics... GNU/Linux ld.so
checking how to hardcode library paths into programs... immediate
checking whether stripping libraries is possible... yes
checking if libtool supports shared libraries... yes
checking whether to build shared libraries... yes
checking whether to build static libraries... yes
configure: creating libtool
checking for gethostname in -lnsl... yes
checking for accept in -lsocket... no
checking for va_copy() function... yes
checking for sys/types.h... (cached) yes
checking sys/param.h usability... yes
checking sys/param.h presence... yes
checking for sys/param.h... yes
checking sys/time.h usability... yes
checking sys/time.h presence... yes
checking for sys/time.h... yes
checking sys/socket.h usability... yes
checking sys/socket.h presence... yes
checking for sys/socket.h... yes
checking sys/sockio.h usability... no
checking sys/sockio.h presence... no
checking for sys/sockio.h... no
checking sys/ioctl.h usability... yes
checking sys/ioctl.h presence... yes
checking for sys/ioctl.h... yes
checking for netdb.h... yes
checking for ifaddrs.h... yes
checking for net/if.h... yes
checking for net/if_dl.h... no
checking for net/if_arp.h... yes
checking for netinet/in.h... yes
checking for arpa/inet.h... yes
checking for getifaddrs... yes
checking for nanosleep... yes
checking for long long... yes
checking for long double... yes
checking for char... yes
checking size of char... 1
checking for unsigned char... yes
checking size of unsigned char... 1
checking for short... yes
checking size of short... 2
checking for unsigned short... yes
checking size of unsigned short... 2
checking for int... yes
checking size of int... 4
checking for unsigned int... yes
checking size of unsigned int... 4
checking for long... yes
checking size of long... 8
checking for unsigned long... yes
checking size of unsigned long... 8
checking for long long... (cached) yes
checking size of long long... 8
checking for unsigned long long... yes
checking size of unsigned long long... 8
checking whether to build DCE 1.1 backward compatibility API... (cached) no
checking whether to build C++ bindings to C API... (cached) yes
checking whether we are using the GNU C++ compiler... (cached) yes
checking whether g++ accepts -g... (cached) yes
checking whether to build Perl bindings to C API... (cached) no
checking whether to build Perl compatibility API... (cached) no
checking for perl... /usr/bin/perl
checking whether to build PHP bindings to C API... (cached) no
checking for php5... /usr/bin/php5
checking whether to build PostgreSQL bindings to C API... (cached) no
checking for pg_config... no
configure: creating ./config.status
config.status: creating Makefile
config.status: WARNING: Makefile.in seems to ignore the --datarootdir setting
config.status: creating uuid-config
config.status: WARNING: uuid-config.in seems to ignore the --datarootdir setting
config.status: creating uuid.pc
config.status: creating uuid.h
config.status: creating config.h
config.status: executing adjustment commands
/usr/bin/make -C .
make[1]: Entering directory `/build/buildd/ossp-uuid-1.5.1'
mkdir .libs
cc -I. -I. -DHAVE_CONFIG_H -O2 -Wall -O2 -pipe -c uuid.c -fPIC -DPIC -o .libs/uuid.o
cc -I. -I. -DHAVE_CONFIG_H -O2 -Wall -O2 -pipe -c uuid.c -o uuid.o >/dev/null 2>&1
cc -I. -I. -DHAVE_CONFIG_H -O2 -Wall -O2 -pipe -c uuid_md5.c -fPIC -DPIC -o .libs/uuid_md5.o
cc -I. -I. -DHAVE_CONFIG_H -O2 -Wall -O2 -pipe -c uuid_md5.c -o uuid_md5.o >/dev/null 2>&1
cc -I. -I. -DHAVE_CONFIG_H -O2 -Wall -O2 -pipe -c uuid_sha1.c -fPIC -DPIC -o .libs/uuid_sha1.o
cc -I. -I. -DHAVE_CONFIG_H -O2 -Wall -O2 -pipe -c uuid_sha1.c -o uuid_sha1.o >/dev/null 2>&1
cc -I. -I. -DHAVE_CONFIG_H -O2 -Wall -O2 -pipe -c uuid_prng.c -fPIC -DPIC -o .libs/uuid_prng.o
cc -I. -I. -DHAVE_CONFIG_H -O2 -Wall -O2 -pipe -c uuid_prng.c -o uuid_prng.o >/dev/null 2>&1
cc -I. -I. -DHAVE_CONFIG_H -O2 -Wall -O2 -pipe -c uuid_mac.c -fPIC -DPIC -o .libs/uuid_mac.o
cc -I. -I. -DHAVE_CONFIG_H -O2 -Wall -O2 -pipe -c uuid_mac.c -o uuid_mac.o >/dev/null 2>&1
cc -I. -I. -DHAVE_CONFIG_H -O2 -Wall -O2 -pipe -c uuid_ui64.c -fPIC -DPIC -o .libs/uuid_ui64.o
cc -I. -I. -DHAVE_CONFIG_H -O2 -Wall -O2 -pipe -c uuid_ui64.c -o uuid_ui64.o >/dev/null 2>&1
cc -I. -I. -DHAVE_CONFIG_H -O2 -Wall -O2 -pipe -c uuid_ui128.c -fPIC -DPIC -o .libs/uuid_ui128.o
cc -I. -I. -DHAVE_CONFIG_H -O2 -Wall -O2 -pipe -c uuid_ui128.c -o uuid_ui128.o >/dev/null 2>&1
cc -I. -I. -DHAVE_CONFIG_H -O2 -Wall -O2 -pipe -c uuid_str.c -fPIC -DPIC -o .libs/uuid_str.o
cc -I. -I. -DHAVE_CONFIG_H -O2 -Wall -O2 -pipe -c uuid_str.c -o uuid_str.o >/dev/null 2>&1
cc -shared .libs/uuid.o .libs/uuid_md5.o .libs/uuid_sha1.o .libs/uuid_prng.o .libs/uuid_mac.o .libs/uuid_ui64.o .libs/uuid_ui128.o .libs/uuid_str.o -Wl,-soname -Wl,libossp-uuid.so.15 -o .libs/libossp-uuid.so.15.0.21
(cd .libs && rm -f libossp-uuid.so.15 && ln -s libossp-uuid.so.15.0.21 libossp-uuid.so.15)
(cd .libs && rm -f libossp-uuid.so && ln -s libossp-uuid.so.15.0.21 libossp-uuid.so)
ar cru .libs/libossp-uuid.a uuid.o uuid_md5.o uuid_sha1.o uuid_prng.o uuid_mac.o uuid_ui64.o uuid_ui128.o uuid_str.o
ranlib .libs/libossp-uuid.a
creating libossp-uuid.la
(cd .libs && rm -f libossp-uuid.la && ln -s ../libossp-uuid.la libossp-uuid.la)
g++ -I. -I. -DHAVE_CONFIG_H -O2 -Wall -O2 -c uuid++.cc -fPIC -DPIC -o .libs/uuid++.o
g++ -I. -I. -DHAVE_CONFIG_H -O2 -Wall -O2 -c uuid++.cc -o uuid++.o >/dev/null 2>&1
cc -shared .libs/uuid++.o .libs/uuid.o .libs/uuid_md5.o .libs/uuid_sha1.o .libs/uuid_prng.o .libs/uuid_mac.o .libs/uuid_ui64.o .libs/uuid_ui128.o .libs/uuid_str.o -Wl,-soname -Wl,libossp-uuid++.so.15 -o .libs/libossp-uuid++.so.15.0.21
(cd .libs && rm -f libossp-uuid++.so.15 && ln -s libossp-uuid++.so.15.0.21 libossp-uuid++.so.15)
(cd .libs && rm -f libossp-uuid++.so && ln -s libossp-uuid++.so.15.0.21 libossp-uuid++.so)
ar cru .libs/libossp-uuid++.a uuid++.o uuid.o uuid_md5.o uuid_sha1.o uuid_prng.o uuid_mac.o uuid_ui64.o uuid_ui128.o uuid_str.o
ranlib .libs/libossp-uuid++.a
creating libossp-uuid++.la
(cd .libs && rm -f libossp-uuid++.la && ln -s ../libossp-uuid++.la libossp-uuid++.la)
cc -I. -I. -DHAVE_CONFIG_H -O2 -Wall -O2 -pipe -c uuid_cli.c
uuid_cli.c: In function 'main':
uuid_cli.c:252: warning: ignoring return value of 'fwrite', declared with attribute warn_unused_result
cc -Wl,-Bsymbolic-functions -o .libs/uuid uuid_cli.o ./.libs/libossp-uuid.so -lnsl
creating uuid
make[1]: Leaving directory `/build/buildd/ossp-uuid-1.5.1'
touch debian/stamp-makefile-build
DEB_MAKE_CHECK_TARGET unset, not running checks
# build perl bindings
cd perl; \
/usr/bin/perl Makefile.PL INSTALLDIRS=vendor COMPAT=1; \
make CC="cc" OPTIMIZE="-g -O2 -g -Wall -O2"; \
make test
Checking if your kit is complete...
Looks good
Warning: -L../.libs changed to -L/build/buildd/ossp-uuid-1.5.1/perl/../.libs
Warning: -L.. changed to -L/build/buildd/ossp-uuid-1.5.1/perl/..
Writing Makefile for OSSP::uuid
make[1]: Entering directory `/build/buildd/ossp-uuid-1.5.1/perl'
cp uuid.pod blib/lib/OSSP/uuid.pod
cp uuid_compat.pm blib/lib/OSSP/../Data/UUID.pm
cp uuid.pm blib/lib/OSSP/uuid.pm
cp uuid_compat.pod blib/lib/OSSP/../Data/UUID.pod
/usr/bin/perl /usr/share/perl/5.10/ExtUtils/xsubpp -typemap /usr/share/perl/5.10/ExtUtils/typemap -typemap uuid.tm uuid.xs > uuid.xsc && mv uuid.xsc uuid.c
cc -c -I. -I.. -D_REENTRANT -D_GNU_SOURCE -DDEBIAN -fno-strict-aliasing -pipe -I/usr/local/include -D_LARGEFILE_SOURCE -D_FILE_OFFSET_BITS=64 -g -O2 -g -Wall -O2 -DVERSION=\"1.0501\" -DXS_VERSION=\"1.0501\" -fPIC "-I/usr/lib/perl/5.10/CORE" uuid.c
Running Mkbootstrap for OSSP::uuid ()
chmod 644 uuid.bs
rm -f blib/arch/auto/OSSP/uuid/uuid.so
LD_RUN_PATH="/build/buildd/ossp-uuid-1.5.1/perl/../.libs" cc -shared -O2 -g -L/usr/local/lib uuid.o -o blib/arch/auto/OSSP/uuid/uuid.so \
-L/build/buildd/ossp-uuid-1.5.1/perl/../.libs -L/build/buildd/ossp-uuid-1.5.1/perl/.. -lossp-uuid \
chmod 755 blib/arch/auto/OSSP/uuid/uuid.so
cp uuid.bs blib/arch/auto/OSSP/uuid/uuid.bs
chmod 644 blib/arch/auto/OSSP/uuid/uuid.bs
Manifying blib/man3/OSSP::uuid.3pm
Manifying blib/man3/Data::UUID.3pm
make[1]: Leaving directory `/build/buildd/ossp-uuid-1.5.1/perl'
make[1]: Entering directory `/build/buildd/ossp-uuid-1.5.1/perl'
PERL_DL_NONLAZY=1 /usr/bin/perl "-MExtUtils::Command::MM" "-e" "test_harness(0, 'blib/lib', 'blib/arch')" uuid.ts uuid_compat.ts
uuid...........ok
uuid_compat....ok
All tests successful.
Files=2, Tests=50, 0 wallclock secs ( 0.06 cusr + 0.02 csys = 0.08 CPU)
make[1]: Leaving directory `/build/buildd/ossp-uuid-1.5.1/perl'
# build php bindings
cd php; \
phpize5; \
mkdir build-php5; \
cd build-php5; \
CC="cc" CFLAGS="-g -O2 -g -Wall -O2 -I../.. -L../.. -L../../.libs" ../configure \
--cache-file=../config.cache \
--enable-uuid \
--disable-static \
--with-php-config=php-config5; \
make; \
cd ..; \
LD_LIBRARY_PATH=`pwd`/../.libs \
php5 -q -d "safe_mode=0" -d "extension=modules/uuid.so" -d "extension_dir=./build-php5" uuid.ts 5
Configuring for:
PHP Api Version: 20041225
Zend Module Api No: 20060613
Zend Extension Api No: 220060519
configure.in:77: warning: LTOPTIONS_VERSION is m4_require'd but not m4_defun'd
aclocal.m4:2912: LT_INIT is expanded from...
aclocal.m4:2947: AC_PROG_LIBTOOL is expanded from...
configure.in:77: the top level
configure.in:77: warning: LTSUGAR_VERSION is m4_require'd but not m4_defun'd
configure.in:77: warning: LTVERSION_VERSION is m4_require'd but not m4_defun'd
configure.in:77: warning: LTOBSOLETE_VERSION is m4_require'd but not m4_defun'd
configure:4375: error: possibly undefined macro: m4_ifval
If this token and others are legitimate, please use m4_pattern_allow.
See the Autoconf documentation.
configure:7385: error: possibly undefined macro: _LT_SET_OPTIONS
configure:7385: error: possibly undefined macro: LT_INIT
configure: creating cache ../config.cache
checking for grep that handles long lines and -e... /bin/grep
checking for egrep... /bin/grep -E
checking for a sed that does not truncate output... /bin/sed
checking for gcc... cc
checking for C compiler default output file name... a.out
checking whether the C compiler works... yes
checking whether we are cross compiling... no
checking for suffix of executables...
checking for suffix of object files... o
checking whether we are using the GNU C compiler... yes
checking whether cc accepts -g... yes
checking for cc option to accept ISO C89... none needed
checking whether cc understands -c and -o together... yes
checking for system library directory... lib
checking if compiler supports -R... no
checking if compiler supports -Wl,-rpath,... yes
checking build system type... x86_64-unknown-linux-gnu
checking host system type... x86_64-unknown-linux-gnu
checking target system type... x86_64-unknown-linux-gnu
checking for PHP prefix... /usr
checking for PHP includes... -I/usr/include/php5 -I/usr/include/php5/main -I/usr/include/php5/TSRM -I/usr/include/php5/Zend -I/usr/include/php5/ext -I/usr/include/php5/ext/date/lib
checking for PHP extension directory... /usr/lib/php5/20060613
checking for PHP installed headers prefix... /usr/include/php5
checking for re2c... no
configure: WARNING: You will need re2c 0.12.0 or later if you want to regenerate PHP parsers.
checking for gawk... no
checking for nawk... nawk
checking if nawk is broken... no
checking OSSP uuid module... yes, shared
../configure: line 4280: LTOPTIONS_VERSION: command not found
../configure: line 4281: LTSUGAR_VERSION: command not found
../configure: line 4282: LTVERSION_VERSION: command not found
../configure: line 4283: LTOBSOLETE_VERSION: command not found
checking for a sed that does not truncate output... (cached) /bin/sed
../configure: line 4373: syntax error near unexpected token `lt_decl_varnames,'
../configure: line 4373: `lt_if_append_uniq(lt_decl_varnames, SED, , ,'
make[1]: Entering directory `/build/buildd/ossp-uuid-1.5.1/php/build-php5'
make[1]: *** No targets specified and no makefile found. Stop.
make[1]: Leaving directory `/build/buildd/ossp-uuid-1.5.1/php/build-php5'
PHP Warning: PHP Startup: Unable to load dynamic library './build-php5/pdo.so' - ./build-php5/pdo.so: cannot open shared object file: No such file or directory in Unknown on line 0
PHP Warning: PHP Startup: Unable to load dynamic library './build-php5/modules/uuid.so' - ./build-php5/modules/uuid.so: cannot open shared object file: No such file or directory in Unknown on line 0
No entry for terminal type "unknown";
using dumb terminal settings.
++ loading DSO uuid.so (low-level API)
Warning: dl(): Dynamically loaded extensions aren't enabled in /build/buildd/ossp-uuid-1.5.1/php/uuid.ts on line 39
++ loading PHP uuid.php5 (high-level API)
++ establishing assertion environment
++ testing low-level C-style API:
Fatal error: Call to undefined function uuid_create() in /build/buildd/ossp-uuid-1.5.1/php/uuid.ts on line 63
make: *** [build-stamp-ext] Error 255
dpkg-buildpackage: failure: debian/rules build gave error exit status 2
******************************************************************************
Build finished at 20081002-1334
FAILED [dpkg-buildpackage died]
Purging chroot-intrepid-autotest/build/buildd/ossp-uuid-1.5.1
------------------------------------------------------------------------------
/usr/bin/sudo dpkg --root=/home/buildd/build-intrepid-autotest/chroot-intrepid-autotest --purge groff-base php5-cli mime-support m4 gettext file zlib1g-dev libhtml-parser-perl intltool automake1.4 shtool php5-common libwww-perl liburi-perl libhtml-tree-perl ifupdown autotools-dev po-debconf net-tools libxml-parser-perl libhtml-tagset-perl libxml2 netbase libedit2 chrpath man-db libssl0.9.8 libtool intltool-debian php5-dev automake1.7 cdbs html2text gettext-base debhelper libkeyutils1 libmagic1 libexpat1 libssl-dev bsdmainutils fdupes autoconf libkrb53
(Reading database ... 14348 files and directories currently installed.)
Removing php5-cli ...
Purging configuration files for php5-cli ...
Removing mime-support ...
Purging configuration files for mime-support ...
Removing libxml2 ...
Purging configuration files for libxml2 ...
Removing libedit2 ...
Purging configuration files for libedit2 ...
Removing chrpath ...
Removing php5-dev ...
Removing cdbs ...
Removing debhelper ...
Removing libssl-dev ...
Removing fdupes ...
Removing libkrb53 ...
Purging configuration files for libkrb53 ...
Removing zlib1g-dev ...
Removing intltool ...
Removing automake1.4 ...
Removing shtool ...
Removing php5-common ...
Purging configuration files for php5-common ...
Removing po-debconf ...
Removing libxml-parser-perl ...
Removing man-db ...
Purging configuration files for man-db ...
Removing libssl0.9.8 ...
Purging configuration files for libssl0.9.8 ...
Removing libtool ...
Removing intltool-debian ...
Removing automake1.7 ...
Removing html2text ...
Purging configuration files for html2text ...
Removing libkeyutils1 ...
Purging configuration files for libkeyutils1 ...
Removing libexpat1 ...
Purging configuration files for libexpat1 ...
Removing bsdmainutils ...
Purging configuration files for bsdmainutils ...
Removing autoconf ...
Purging configuration files for autoconf ...
Removing groff-base ...
Purging configuration files for groff-base ...
Removing m4 ...
Removing gettext ...
Removing file ...
Purging configuration files for file ...
Removing libwww-perl ...
Removing libhtml-tree-perl ...
Removing autotools-dev ...
Removing gettext-base ...
Removing libmagic1 ...
Purging configuration files for libmagic1 ...
Removing libhtml-parser-perl ...
Removing liburi-perl ...
Removing libhtml-tagset-perl ...
Removing netbase ...
Purging configuration files for netbase ...
Removing ifupdown ...
Purging configuration files for ifupdown ...
Removing net-tools ...
******************************************************************************
Finished at 20081002-1334
Build needed 00:00:25, 5732k disk space
More information about the ubuntu-autotest
mailing list