Log for failed build of upx-ucl_3.01-2.1 (dist=intrepid-autotest)
Build Daemon user
noreply at buildd.ubuntu.com
Sun Jul 6 16:09:07 BST 2008
Automatic build of upx-ucl_3.01-2.1 on king by sbuild/amd64 1.170.5
Build started at 20080706-1608
******************************************************************************
Checking available source versions...
Fetching source files...
Reading package lists...
Building dependency tree...
Reading state information...
Need to get 1035kB of source archives.
Get:1 http://archive.internal intrepid-autotest/main upx-ucl 3.01-2.1 (dsc) [993B]
Get:2 http://archive.internal intrepid-autotest/main upx-ucl 3.01-2.1 (tar) [1024kB]
Get:3 http://archive.internal intrepid-autotest/main upx-ucl 3.01-2.1 (diff) [9479B]
Fetched 1035kB in 0s (28.7MB/s)
Download complete and in download only mode
** Using build dependencies supplied by package:
Build-Depends: debhelper (>= 6), libucl-dev (>= 1.03), zlib1g-dev (>= 1:1.1.4)
Checking for already installed source dependencies...
debhelper: missing
libucl-dev: missing
zlib1g-dev: missing
Checking for source dependency conflicts...
/usr/bin/sudo /usr/bin/apt-get --purge $CHROOT_OPTIONS -q -y install debhelper libucl-dev zlib1g-dev
Reading package lists...
Building dependency tree...
Reading state information...
The following packages were automatically installed and are no longer required:
upstart-compat-sysv system-services startup-tasks sysvutils upstart
Use 'apt-get autoremove' to remove them.
The following extra packages will be installed:
bsdmainutils file gettext gettext-base groff-base html2text intltool-debian
libmagic1 libucl1 man-db po-debconf
Suggested packages:
vacation wamerican wordlist whois dh-make cvs gettext-doc groff less
www-browser
Recommended packages:
curl wget lynx libmail-sendmail-perl libcompress-zlib-perl libmail-box-perl
The following NEW packages will be installed:
bsdmainutils debhelper file gettext gettext-base groff-base html2text
intltool-debian libmagic1 libucl-dev libucl1 man-db po-debconf zlib1g-dev
0 upgraded, 14 newly installed, 0 to remove and 0 not upgraded.
Need to get 61.8kB/6509kB of archives.
After unpacking 21.1MB of additional disk space will be used.
WARNING: The following packages cannot be authenticated!
gettext-base bsdmainutils libmagic1 file groff-base man-db html2text gettext
intltool-debian po-debconf debhelper libucl1 libucl-dev zlib1g-dev
Authentication warning overridden.
Get:1 http://ftpmaster.internal intrepid/main libucl1 1.03-3 [24.3kB]
Get:2 http://ftpmaster.internal intrepid/main libucl-dev 1.03-3 [37.5kB]
Fetched 61.8kB in 0s (2373kB/s)
Selecting previously deselected package gettext-base.
(Reading database ... 10564 files and directories currently installed.)
Unpacking gettext-base (from .../gettext-base_0.17-3ubuntu1_amd64.deb) ...
Selecting previously deselected package bsdmainutils.
Unpacking bsdmainutils (from .../bsdmainutils_6.1.10ubuntu2_amd64.deb) ...
Selecting previously deselected package libmagic1.
Unpacking libmagic1 (from .../libmagic1_4.24-2ubuntu1_amd64.deb) ...
Selecting previously deselected package file.
Unpacking file (from .../file_4.24-2ubuntu1_amd64.deb) ...
Selecting previously deselected package groff-base.
Unpacking groff-base (from .../groff-base_1.18.1.1-20_amd64.deb) ...
Selecting previously deselected package man-db.
Unpacking man-db (from .../man-db_2.5.2-1_amd64.deb) ...
Selecting previously deselected package html2text.
Unpacking html2text (from .../html2text_1.3.2a-3build2_amd64.deb) ...
Selecting previously deselected package gettext.
Unpacking gettext (from .../gettext_0.17-3ubuntu1_amd64.deb) ...
Selecting previously deselected package intltool-debian.
Unpacking intltool-debian (from .../intltool-debian_0.35.0+20060710.1_all.deb) ...
Selecting previously deselected package po-debconf.
Unpacking po-debconf (from .../po-debconf_1.0.15_all.deb) ...
Selecting previously deselected package debhelper.
Unpacking debhelper (from .../debhelper_7.0.13ubuntu1_all.deb) ...
Selecting previously deselected package libucl1.
Unpacking libucl1 (from .../libucl1_1.03-3_amd64.deb) ...
Selecting previously deselected package libucl-dev.
Unpacking libucl-dev (from .../libucl-dev_1.03-3_amd64.deb) ...
Selecting previously deselected package zlib1g-dev.
Unpacking zlib1g-dev (from .../zlib1g-dev_1%3a1.2.3.3.dfsg-12ubuntu1_amd64.deb) ...
Setting up gettext-base (0.17-3ubuntu1) ...
Setting up bsdmainutils (6.1.10ubuntu2) ...
Setting up libmagic1 (4.24-2ubuntu1) ...
Setting up file (4.24-2ubuntu1) ...
Setting up groff-base (1.18.1.1-20) ...
Setting up man-db (2.5.2-1) ...
Building database of manual pages ...
Setting up html2text (1.3.2a-3build2) ...
Setting up gettext (0.17-3ubuntu1) ...
Setting up intltool-debian (0.35.0+20060710.1) ...
Setting up po-debconf (1.0.15) ...
Setting up debhelper (7.0.13ubuntu1) ...
Setting up libucl1 (1.03-3) ...
Setting up libucl-dev (1.03-3) ...
Setting up zlib1g-dev (1.2.3.3.dfsg-12ubuntu1) ...
modified:
sbuild.conf
Checking correctness of source dependencies...
Toolchain package versions: libc6-dev_2.8~20080505-0ubuntu6 make_3.81-5 dpkg-dev_1.14.20ubuntu1 linux-libc-dev_2.6.26-3.9 gcc-4.3_4.3.1-3ubuntu1 g++-4.3_4.3.1-3ubuntu1 binutils_2.18.50.20080610-0ubuntu1 libstdc++6_4.3.1-3ubuntu1 libstdc++6-4.3-dev_4.3.1-3ubuntu1
------------------------------------------------------------------------------
dpkg-source: extracting upx-ucl in upx-ucl-3.01
dpkg-source: unpacking upx-ucl_3.01.orig.tar.gz
dpkg-source: applying /home/buildd/build-intrepid-autotest/upx-ucl_3.01-2.1.diff.gz
dpkg-buildpackage: set CFLAGS to default value: -g -O2
dpkg-buildpackage: set CPPFLAGS to default value:
dpkg-buildpackage: set LDFLAGS to default value: -Wl,-Bsymbolic-functions
dpkg-buildpackage: set FFLAGS to default value: -g -O2
dpkg-buildpackage: set CXXFLAGS to default value: -g -O2
dpkg-buildpackage: source package upx-ucl
dpkg-buildpackage: source version 3.01-2.1
dpkg-buildpackage: host architecture amd64
/usr/bin/fakeroot debian/rules clean
dh_testdir
dh_testroot
rm -f build-stamp
# Add here commands to clean up after the build process.
make UPX_UCLDIR=/none \
exeext="" \
distclean
make[1]: Entering directory `/build/buildd/upx-ucl-3.01'
make -C src distclean
make[2]: Entering directory `/build/buildd/upx-ucl-3.01/src'
rm -f *.d *.map *.o *.obj *.res .depend upx.exe upx.out upx.ttp upx
make[2]: Leaving directory `/build/buildd/upx-ucl-3.01/src'
make -C doc distclean
make[2]: Entering directory `/build/buildd/upx-ucl-3.01/doc'
rm -f upx.1 upx.doc upx.html pod2htm*
make[2]: Leaving directory `/build/buildd/upx-ucl-3.01/doc'
make[1]: Leaving directory `/build/buildd/upx-ucl-3.01'
rm -rf doc/*.1 doc/*.ps
dh_clean
debian/rules build
dh_testdir
# Add here commands to compile the package.
Starting build process (amd64)
UPX_UCLDIR=/none CC=gcc CXX=g++ \
CXXFLAGS="-DWITH_UCL -g -O2" \
CPPFLAGS="" \
LDFLAGS="-s" \
make exeext="" target=linux all
make[1]: Entering directory `/build/buildd/upx-ucl-3.01'
make -C src all
make[2]: Entering directory `/build/buildd/upx-ucl-3.01/src'
Updating .depend
make[2]: Leaving directory `/build/buildd/upx-ucl-3.01/src'
make[2]: Entering directory `/build/buildd/upx-ucl-3.01/src'
g++ -DWITH_UCL -g -O2 -Wall -W -Wcast-align -Wcast-qual -Wpointer-arith -Wwrite-strings -Werror -o c_file.o -c c_file.cpp
g++ -DWITH_UCL -g -O2 -Wall -W -Wcast-align -Wcast-qual -Wpointer-arith -Wwrite-strings -Werror -o c_init.o -c c_init.cpp
g++ -DWITH_UCL -g -O2 -Wall -W -Wcast-align -Wcast-qual -Wpointer-arith -Wwrite-strings -Werror -o c_none.o -c c_none.cpp
g++ -DWITH_UCL -g -O2 -Wall -W -Wcast-align -Wcast-qual -Wpointer-arith -Wwrite-strings -Werror -o c_screen.o -c c_screen.cpp
g++ -DWITH_UCL -g -O2 -Wall -W -Wcast-align -Wcast-qual -Wpointer-arith -Wwrite-strings -Werror -o compress.o -c compress.cpp
g++ -DWITH_UCL -g -O2 -Wall -W -Wcast-align -Wcast-qual -Wpointer-arith -Wwrite-strings -Werror -Wno-cast-qual -Wno-shadow -Wno-error -o compress_lzma.o -c compress_lzma.cpp
g++ -DWITH_UCL -g -O2 -Wall -W -Wcast-align -Wcast-qual -Wpointer-arith -Wwrite-strings -Werror -o compress_ucl.o -c compress_ucl.cpp
g++ -DWITH_UCL -g -O2 -Wall -W -Wcast-align -Wcast-qual -Wpointer-arith -Wwrite-strings -Werror -o compress_zlib.o -c compress_zlib.cpp
g++ -DWITH_UCL -g -O2 -Wall -W -Wcast-align -Wcast-qual -Wpointer-arith -Wwrite-strings -Werror -o except.o -c except.cpp
g++ -DWITH_UCL -g -O2 -Wall -W -Wcast-align -Wcast-qual -Wpointer-arith -Wwrite-strings -Werror -o file.o -c file.cpp
g++ -DWITH_UCL -g -O2 -Wall -W -Wcast-align -Wcast-qual -Wpointer-arith -Wwrite-strings -Werror -o filter.o -c filter.cpp
g++ -DWITH_UCL -g -O2 -Wall -W -Wcast-align -Wcast-qual -Wpointer-arith -Wwrite-strings -Werror -o filteri.o -c filteri.cpp
g++ -DWITH_UCL -g -O2 -Wall -W -Wcast-align -Wcast-qual -Wpointer-arith -Wwrite-strings -Werror -o help.o -c help.cpp
g++ -DWITH_UCL -g -O2 -Wall -W -Wcast-align -Wcast-qual -Wpointer-arith -Wwrite-strings -Werror -o lefile.o -c lefile.cpp
g++ -DWITH_UCL -g -O2 -Wall -W -Wcast-align -Wcast-qual -Wpointer-arith -Wwrite-strings -Werror -o linker.o -c linker.cpp
g++ -DWITH_UCL -g -O2 -Wall -W -Wcast-align -Wcast-qual -Wpointer-arith -Wwrite-strings -Werror -o main.o -c main.cpp
g++ -DWITH_UCL -g -O2 -Wall -W -Wcast-align -Wcast-qual -Wpointer-arith -Wwrite-strings -Werror -o mem.o -c mem.cpp
g++ -DWITH_UCL -g -O2 -Wall -W -Wcast-align -Wcast-qual -Wpointer-arith -Wwrite-strings -Werror -o msg.o -c msg.cpp
cc1plus: warnings being treated as errors
msg.cpp: In function 'void printClearLine(FILE*)':
msg.cpp:60: error: format not a string literal and no format arguments
make[2]: *** [msg.o] Error 1
make[2]: Leaving directory `/build/buildd/upx-ucl-3.01/src'
make[1]: *** [all] Error 2
make[1]: Leaving directory `/build/buildd/upx-ucl-3.01'
make: *** [build-stamp] Error 2
dpkg-buildpackage: failure: debian/rules build gave error exit status 2
******************************************************************************
Build finished at 20080706-1609
FAILED [dpkg-buildpackage died]
Purging chroot-intrepid-autotest/build/buildd/upx-ucl-3.01
------------------------------------------------------------------------------
/usr/bin/sudo dpkg --root=/home/buildd/build-intrepid-autotest/chroot-intrepid-autotest --purge po-debconf intltool-debian groff-base libucl1 libmagic1 gettext file zlib1g-dev libucl-dev bsdmainutils html2text gettext-base man-db debhelper
(Reading database ... 11682 files and directories currently installed.)
Removing zlib1g-dev ...
Removing libucl-dev ...
Removing debhelper ...
Removing po-debconf ...
Removing intltool-debian ...
Removing libucl1 ...
Purging configuration files for libucl1 ...
Removing gettext ...
Removing file ...
Purging configuration files for file ...
Removing html2text ...
Purging configuration files for html2text ...
Removing gettext-base ...
Removing man-db ...
Purging configuration files for man-db ...
Removing catpages as well as /var/cache/man hierarchy.
Removing groff-base ...
Purging configuration files for groff-base ...
Removing libmagic1 ...
Purging configuration files for libmagic1 ...
Removing bsdmainutils ...
Purging configuration files for bsdmainutils ...
******************************************************************************
Finished at 20080706-1609
Build needed 00:00:12, 8904k disk space
More information about the ubuntu-autotest
mailing list