Log for failed build of orbit2_1:2.14.10-0ubuntu1 (dist=toolchain-autotest)

Build Daemon user noreply at buildd.ubuntu.com
Sat Jan 26 05:49:40 GMT 2008


Automatic build of orbit2_1:2.14.10-0ubuntu1 on king by sbuild/amd64 1.170.5
Build started at 20080126-0548
******************************************************************************
Checking available source versions...
Fetching source files...
Reading package lists...
Building dependency tree...
Need to get 1091kB of source archives.
Get:1 http://toolchain.ubunut.com toolchain-autotest/main orbit2 1:2.14.10-0ubuntu1 (dsc) [753B]
Get:2 http://toolchain.ubunut.com toolchain-autotest/main orbit2 1:2.14.10-0ubuntu1 (tar) [1056kB]
Get:3 http://toolchain.ubunut.com toolchain-autotest/main orbit2 1:2.14.10-0ubuntu1 (diff) [33.7kB]
Fetched 1091kB in 0s (35.0MB/s)
Download complete and in download only mode
** Using build dependencies supplied by package:
Build-Depends: libglib2.0-dev (>= 2.8.0), libidl-dev (>= 0.8.0), pkg-config, cdbs, debhelper (>= 4.1.0), docbook-xsl, gtk-doc-tools (>= 1.6-2)
Checking for already installed source dependencies...
libglib2.0-dev: missing
libidl-dev: missing
pkg-config: missing
cdbs: missing
debhelper: missing
docbook-xsl: missing
gtk-doc-tools: missing
Checking for source dependency conflicts...
  /usr/bin/sudo /usr/bin/apt-get --purge $CHROOT_OPTIONS -q -y install libglib2.0-dev libidl-dev pkg-config cdbs debhelper docbook-xsl gtk-doc-tools
Reading package lists...
Building dependency tree...
The following extra packages will be installed:
  autoconf automake1.7 autotools-dev docbook docbook-dsssl docbook-to-man
  docbook-xml fdupes file gettext gettext-base gnome-common html2text intltool
  intltool-debian jade libexpat1 libgcrypt11 libglib2.0-0 libgpg-error0
  libhtml-parser-perl libhtml-tagset-perl libhtml-tree-perl libidl0 libmagic1
  libpcre3 libsp1c2 libtool liburi-perl libwww-perl libxml-parser-perl libxml2
  libxslt1.1 m4 mcpp po-debconf sgml-base sgml-data sp xml-core xsltproc
Suggested packages:
  autoconf2.13 autobook autoconf-archive gnu-standards autoconf-doc devscripts
  doc-base dh-make psgml docbook-defguide jadetex docbook-dsssl-doc xalan fop
  libsaxon-java libxalan2-java cvs gettext-doc rng-tools libglib2.0-doc gcj
  gfortran fortran95-compiler libtool-doc libio-socket-ssl-perl mcpp-doc
  sgml-base-doc perlsgml doc-html-w3 opensp libxml2-utils
Recommended packages:
  docbook-xsl-doc-html docbook-xsl-doc-pdf docbook-xsl-doc-text
  docbook-xsl-doc curl wget lynx libglib2.0-data libltdl3-dev
  libmailtools-perl libhtml-format-perl libcompress-zlib-perl
  libmail-sendmail-perl libmail-box-perl
The following NEW packages will be installed:
  autoconf automake1.7 autotools-dev cdbs debhelper docbook docbook-dsssl
  docbook-to-man docbook-xml docbook-xsl fdupes file gettext gettext-base
  gnome-common gtk-doc-tools html2text intltool intltool-debian jade libexpat1
  libgcrypt11 libglib2.0-0 libglib2.0-dev libgpg-error0 libhtml-parser-perl
  libhtml-tagset-perl libhtml-tree-perl libidl-dev libidl0 libmagic1 libpcre3
  libsp1c2 libtool liburi-perl libwww-perl libxml-parser-perl libxml2
  libxslt1.1 m4 mcpp pkg-config po-debconf sgml-base sgml-data sp xml-core
  xsltproc
0 upgraded, 48 newly installed, 0 to remove and 0 not upgraded.
Need to get 0B/15.7MB of archives.
After unpacking 64.1MB of additional disk space will be used.
WARNING: The following packages cannot be authenticated!
  gettext-base libgpg-error0 libgcrypt11 libmagic1 file libexpat1
  libhtml-tagset-perl liburi-perl libhtml-parser-perl libhtml-tree-perl
  libwww-perl libxml-parser-perl m4 autoconf autotools-dev automake1.7
  html2text gettext intltool-debian po-debconf debhelper fdupes intltool cdbs
  sgml-base xml-core sgml-data docbook libsp1c2 jade docbook-xml docbook-dsssl
  sp docbook-to-man docbook-xsl libtool libpcre3 libglib2.0-0 pkg-config
  gnome-common libxml2 libxslt1.1 xsltproc gtk-doc-tools libglib2.0-dev mcpp
  libidl0 libidl-dev
Authentication warning overridden.
Selecting previously deselected package gettext-base.
(Reading database ... 10491 files and directories currently installed.)
Unpacking gettext-base (from .../gettext-base_0.17-2ubuntu1_amd64.deb) ...
Selecting previously deselected package libgpg-error0.
Unpacking libgpg-error0 (from .../libgpg-error0_1.4-2ubuntu7_amd64.deb) ...
Selecting previously deselected package libgcrypt11.
Unpacking libgcrypt11 (from .../libgcrypt11_1.2.4-2ubuntu7_amd64.deb) ...
Selecting previously deselected package libmagic1.
Unpacking libmagic1 (from .../libmagic1_4.21-3_amd64.deb) ...
Selecting previously deselected package file.
Unpacking file (from .../archives/file_4.21-3_amd64.deb) ...
Selecting previously deselected package libexpat1.
Unpacking libexpat1 (from .../libexpat1_2.0.1-0ubuntu1_amd64.deb) ...
Selecting previously deselected package libhtml-tagset-perl.
Unpacking libhtml-tagset-perl (from .../libhtml-tagset-perl_3.10-2_all.deb) ...
Selecting previously deselected package liburi-perl.
Unpacking liburi-perl (from .../liburi-perl_1.35.dfsg.1-1_all.deb) ...
Selecting previously deselected package libhtml-parser-perl.
Unpacking libhtml-parser-perl (from .../libhtml-parser-perl_3.56-1_amd64.deb) ...
Selecting previously deselected package libhtml-tree-perl.
Unpacking libhtml-tree-perl (from .../libhtml-tree-perl_3.23-1_all.deb) ...
Selecting previously deselected package libwww-perl.
Unpacking libwww-perl (from .../libwww-perl_5.805-1_all.deb) ...
Selecting previously deselected package libxml-parser-perl.
Unpacking libxml-parser-perl (from .../libxml-parser-perl_2.34-4.3_amd64.deb) ...
Selecting previously deselected package m4.
Unpacking m4 (from .../archives/m4_1.4.10-1_amd64.deb) ...
Selecting previously deselected package autoconf.
Unpacking autoconf (from .../autoconf_2.61-4_all.deb) ...
Selecting previously deselected package autotools-dev.
Unpacking autotools-dev (from .../autotools-dev_20070725.1_all.deb) ...
Selecting previously deselected package automake1.7.
Unpacking automake1.7 (from .../automake1.7_1.7.9-9_all.deb) ...
Selecting previously deselected package html2text.
Unpacking html2text (from .../html2text_1.3.2a-3build1_amd64.deb) ...
Selecting previously deselected package gettext.
Unpacking gettext (from .../gettext_0.17-2ubuntu1_amd64.deb) ...
Selecting previously deselected package intltool-debian.
Unpacking intltool-debian (from .../intltool-debian_0.35.0+20060710.1_all.deb) ...
Selecting previously deselected package po-debconf.
Unpacking po-debconf (from .../po-debconf_1.0.10_all.deb) ...
Selecting previously deselected package debhelper.
Unpacking debhelper (from .../debhelper_5.0.62ubuntu1_all.deb) ...
Selecting previously deselected package fdupes.
Unpacking fdupes (from .../fdupes_1.40-4build1_amd64.deb) ...
Selecting previously deselected package intltool.
Unpacking intltool (from .../intltool_0.37.0-1_all.deb) ...
Selecting previously deselected package cdbs.
Unpacking cdbs (from .../cdbs_0.4.50ubuntu2_all.deb) ...
Selecting previously deselected package sgml-base.
Unpacking sgml-base (from .../sgml-base_1.26_all.deb) ...
Selecting previously deselected package xml-core.
Unpacking xml-core (from .../archives/xml-core_0.11_all.deb) ...
Selecting previously deselected package sgml-data.
Unpacking sgml-data (from .../sgml-data_2.0.3_all.deb) ...
Selecting previously deselected package docbook.
Unpacking docbook (from .../archives/docbook_4.5-4_all.deb) ...
Selecting previously deselected package libsp1c2.
Unpacking libsp1c2 (from .../libsp1c2_1.3.4-1.2.1-47_amd64.deb) ...
Selecting previously deselected package jade.
Unpacking jade (from .../jade_1.2.1-47_amd64.deb) ...
Selecting previously deselected package docbook-xml.
Unpacking docbook-xml (from .../docbook-xml_4.5-5_all.deb) ...
Selecting previously deselected package docbook-dsssl.
Unpacking docbook-dsssl (from .../docbook-dsssl_1.79-5_all.deb) ...
Selecting previously deselected package sp.
Unpacking sp (from .../sp_1.3.4-1.2.1-47_amd64.deb) ...
Selecting previously deselected package docbook-to-man.
Unpacking docbook-to-man (from .../docbook-to-man_1%3a2.0.0-26_amd64.deb) ...
Selecting previously deselected package docbook-xsl.
Unpacking docbook-xsl (from .../docbook-xsl_1.73.2.dfsg.1-2_all.deb) ...
Selecting previously deselected package libtool.
Unpacking libtool (from .../libtool_1.5.24-2ubuntu2_amd64.deb) ...
Selecting previously deselected package libpcre3.
Unpacking libpcre3 (from .../libpcre3_7.3-2ubuntu1_amd64.deb) ...
Selecting previously deselected package libglib2.0-0.
Unpacking libglib2.0-0 (from .../libglib2.0-0_2.15.3-0ubuntu1_amd64.deb) ...
Selecting previously deselected package pkg-config.
Unpacking pkg-config (from .../pkg-config_0.22-1_amd64.deb) ...
Selecting previously deselected package gnome-common.
Unpacking gnome-common (from .../gnome-common_2.20.0-1_all.deb) ...
Selecting previously deselected package libxml2.
Unpacking libxml2 (from .../libxml2_2.6.30.dfsg-3ubuntu1_amd64.deb) ...
Selecting previously deselected package libxslt1.1.
Unpacking libxslt1.1 (from .../libxslt1.1_1.1.22-1ubuntu1_amd64.deb) ...
Selecting previously deselected package xsltproc.
Unpacking xsltproc (from .../xsltproc_1.1.22-1ubuntu1_amd64.deb) ...
Selecting previously deselected package gtk-doc-tools.
Unpacking gtk-doc-tools (from .../gtk-doc-tools_1.9-1_all.deb) ...
Selecting previously deselected package libglib2.0-dev.
Unpacking libglib2.0-dev (from .../libglib2.0-dev_2.15.3-0ubuntu1_amd64.deb) ...
Selecting previously deselected package mcpp.
Unpacking mcpp (from .../mcpp_2.6.4-1ubuntu2_amd64.deb) ...
Selecting previously deselected package libidl0.
Unpacking libidl0 (from .../libidl0_0.8.9-0ubuntu1_amd64.deb) ...
Selecting previously deselected package libidl-dev.
Unpacking libidl-dev (from .../libidl-dev_0.8.9-0ubuntu1_amd64.deb) ...
Setting up gettext-base (0.17-2ubuntu1) ...

Setting up libgpg-error0 (1.4-2ubuntu7) ...

Setting up libgcrypt11 (1.2.4-2ubuntu7) ...

Setting up libmagic1 (4.21-3) ...

Setting up file (4.21-3) ...
Setting up libexpat1 (2.0.1-0ubuntu1) ...

Setting up libhtml-tagset-perl (3.10-2) ...
Setting up liburi-perl (1.35.dfsg.1-1) ...
Setting up libhtml-parser-perl (3.56-1) ...
Setting up libhtml-tree-perl (3.23-1) ...
Setting up libwww-perl (5.805-1) ...
Setting up libxml-parser-perl (2.34-4.3) ...
Setting up m4 (1.4.10-1) ...

Setting up autoconf (2.61-4) ...

Setting up autotools-dev (20070725.1) ...
Setting up automake1.7 (1.7.9-9) ...

Setting up html2text (1.3.2a-3build1) ...

Setting up gettext (0.17-2ubuntu1) ...

Setting up intltool-debian (0.35.0+20060710.1) ...
Setting up po-debconf (1.0.10) ...

Setting up debhelper (5.0.62ubuntu1) ...
Setting up fdupes (1.40-4build1) ...
Setting up intltool (0.37.0-1) ...
Setting up cdbs (0.4.50ubuntu2) ...

Setting up sgml-base (1.26) ...

Setting up xml-core (0.11) ...

Setting up sgml-data (2.0.3) ...

Setting up docbook (4.5-4) ...

Setting up libsp1c2 (1.3.4-1.2.1-47) ...

Setting up jade (1.2.1-47) ...

Setting up docbook-xml (4.5-5) ...

Setting up docbook-dsssl (1.79-5) ...

Setting up sp (1.3.4-1.2.1-47) ...

Setting up docbook-to-man (2.0.0-26) ...
Setting up docbook-xsl (1.73.2.dfsg.1-2) ...

Setting up libtool (1.5.24-2ubuntu2) ...
Setting up libpcre3 (7.3-2ubuntu1) ...

Setting up libglib2.0-0 (2.15.3-0ubuntu1) ...

Setting up pkg-config (0.22-1) ...
Setting up gnome-common (2.20.0-1) ...
Setting up libxml2 (2.6.30.dfsg-3ubuntu1) ...

Setting up libxslt1.1 (1.1.22-1ubuntu1) ...

Setting up xsltproc (1.1.22-1ubuntu1) ...
Setting up gtk-doc-tools (1.9-1) ...

Setting up libglib2.0-dev (2.15.3-0ubuntu1) ...
Setting up mcpp (2.6.4-1ubuntu2) ...
Setting up libidl0 (0.8.9-0ubuntu1) ...

Setting up libidl-dev (0.8.9-0ubuntu1) ...
Checking correctness of source dependencies...
Toolchain package versions: libc6-dev_2.7-5ubuntu2 make_3.81-3build1 dpkg-dev_1.14.15ubuntu1 linux-libc-dev_2.6.24-5.8 gcc-4.3_4.3-20080122-0ubuntu1 g++-4.3_4.3-20080122-0ubuntu1 binutils_2.18.1~cvs20080103-0ubuntu1 libstdc++6_4.3-20080122-0ubuntu1 libstdc++6-4.3-dev_4.3-20080122-0ubuntu1
------------------------------------------------------------------------------
dpkg-source: extracting orbit2 in orbit2-2.14.10
dpkg-source: unpacking orbit2_2.14.10.orig.tar.gz
dpkg-source: applying /home/buildd/build-toolchain-autotest/orbit2_2.14.10-0ubuntu1.diff.gz
dpkg-buildpackage: source package orbit2
dpkg-buildpackage: source version 1:2.14.10-0ubuntu1
dpkg-buildpackage: host architecture amd64
 /usr/bin/fakeroot debian/rules clean
test -x debian/rules
dh_testroot
/usr/bin/make -f debian/rules reverse-config
make[1]: Entering directory `/build/buildd/orbit2-2.14.10'
for i in ./config.guess ./config.sub  ; do \
		if test -e $i.cdbs-orig ; then \
			mv $i.cdbs-orig $i ; \
		fi ; \
	done
make[1]: Leaving directory `/build/buildd/orbit2-2.14.10'
if [ "reverse-patches" = "reverse-patches" ]; then rm -f debian/stamp-patched; fi
patches: debian/patches/100-compile-name-server.patch debian/patches/700-autoreconf.patch
Patch debian/patches/700-autoreconf.patch is not applied.
Patch debian/patches/100-compile-name-server.patch is not applied.
if [ "reverse-patches" != "reverse-patches" ]; then touch debian/stamp-patched; fi
if [ "reverse-patches" != "reverse-patches" ] ; then \
		/usr/bin/make -f debian/rules update-config ; \
	fi
for dir in debian/patches ; do \
	    rm -f $dir/*.log ; \
	done
for i in ./config.guess ./config.sub  ; do \
		if test -e $i.cdbs-orig ; then \
			mv $i.cdbs-orig $i ; \
		fi ; \
	done
dh_clean 
GCONF_DISABLE_MAKEFILE_SCHEMA_INSTALL=1 /usr/bin/make -C . -k distclean
make[1]: Entering directory `/build/buildd/orbit2-2.14.10'
make[1]: *** No rule to make target `distclean'.
make[1]: Leaving directory `/build/buildd/orbit2-2.14.10'
make: [makefile-clean] Error 2 (ignored)
rm -f debian/stamp-makefile-build
rm -f debian/stamp-autotools-files
test -d . && cd . && \
	  rm -f intltool-extract intltool-merge intltool-update po/.intltool-merge-cache; \
	  if test -d doc; then find doc -name '*.omf.out' -exec rm -f \{\} \; ; fi; \
	  if test -d help; then find help -name '*.omf.out' -exec rm -f \{\} \; ; fi
echo debian/patches
debian/patches
rm -f debian/name-client-2.1 debian/orbit-name-server-2.1
 debian/rules build
test -x debian/rules
mkdir -p "."
/usr/bin/make -f debian/rules reverse-config
make[1]: Entering directory `/build/buildd/orbit2-2.14.10'
for i in ./config.guess ./config.sub  ; do \
		if test -e $i.cdbs-orig ; then \
			mv $i.cdbs-orig $i ; \
		fi ; \
	done
make[1]: Leaving directory `/build/buildd/orbit2-2.14.10'
if [ "debian/stamp-patched" = "reverse-patches" ]; then rm -f debian/stamp-patched; fi
patches: debian/patches/100-compile-name-server.patch debian/patches/700-autoreconf.patch
Trying patch debian/patches/100-compile-name-server.patch at level 1 ... success.
Trying patch debian/patches/700-autoreconf.patch at level 1 ... success.
if [ "debian/stamp-patched" != "reverse-patches" ]; then touch debian/stamp-patched; fi
if [ "debian/stamp-patched" != "reverse-patches" ] ; then \
		/usr/bin/make -f debian/rules update-config ; \
	fi
make[1]: Entering directory `/build/buildd/orbit2-2.14.10'
if test -e /usr/share/misc/config.guess ; then \
		for i in ./config.guess ; do \
			if ! test -e $i.cdbs-orig ; then \
				mv $i $i.cdbs-orig ; \
				cp --remove-destination /usr/share/misc/config.guess $i ; \
			fi ; \
		done ; \
	fi
if test -e /usr/share/misc/config.sub ; then \
		for i in ./config.sub ; do \
			if ! test -e $i.cdbs-orig ; then \
				mv $i $i.cdbs-orig ; \
				cp --remove-destination /usr/share/misc/config.sub $i ; \
			fi ; \
		done ; \
	fi
make[1]: Leaving directory `/build/buildd/orbit2-2.14.10'
if test -e /usr/share/misc/config.guess ; then \
		for i in ./config.guess ; do \
			if ! test -e $i.cdbs-orig ; then \
				mv $i $i.cdbs-orig ; \
				cp --remove-destination /usr/share/misc/config.guess $i ; \
			fi ; \
		done ; \
	fi
if test -e /usr/share/misc/config.sub ; then \
		for i in ./config.sub ; do \
			if ! test -e $i.cdbs-orig ; then \
				mv $i $i.cdbs-orig ; \
				cp --remove-destination /usr/share/misc/config.sub $i ; \
			fi ; \
		done ; \
	fi
touch debian/stamp-autotools-files
chmod a+x /build/buildd/orbit2-2.14.10/./configure
cd . && CC="cc" CXX="g++" CFLAGS="-g -Wall -O2" CXXFLAGS="-g -Wall -O2" CPPFLAGS="" LDFLAGS="" /build/buildd/orbit2-2.14.10/./configure --build=x86_64-linux-gnu --prefix=/usr --includedir="\${prefix}/include" --mandir="\${prefix}/share/man" --infodir="\${prefix}/share/info" --sysconfdir=/etc --localstatedir=/var --libexecdir="\${prefix}/lib/orbit2" --disable-maintainer-mode --disable-dependency-tracking --srcdir=.  --enable-purify --enable-gtk-doc --with-html-dir=/usr/share/doc/liborbit2-dev 
checking for a BSD-compatible install... /usr/bin/install -c
checking whether build environment is sane... yes
checking for a thread-safe mkdir -p... /bin/mkdir -p
checking for gawk... no
checking for mawk... mawk
checking whether make sets $(MAKE)... yes
checking build system type... x86_64-pc-linux-gnu
checking host system type... x86_64-pc-linux-gnu
checking for Win32... no
checking for gcc... cc
checking for C compiler default output file name... a.out
checking whether the C compiler works... yes
checking whether we are cross compiling... no
checking for suffix of executables... 
checking for suffix of object files... o
checking whether we are using the GNU C compiler... yes
checking whether cc accepts -g... yes
checking for cc option to accept ISO C89... none needed
checking for style of include used by make... GNU
checking dependency style of cc... none
checking for a BSD-compatible install... /usr/bin/install -c
checking for a sed that does not truncate output... /bin/sed
checking for grep that handles long lines and -e... /bin/grep
checking for egrep... /bin/grep -E
checking for ld used by cc... /usr/bin/ld
checking if the linker (/usr/bin/ld) is GNU ld... yes
checking for /usr/bin/ld option to reload object files... -r
checking for BSD-compatible nm... /usr/bin/nm -B
checking whether ln -s works... yes
checking how to recognize dependent libraries... pass_all
checking how to run the C preprocessor... cc -E
checking for ANSI C header files... yes
checking for sys/types.h... yes
checking for sys/stat.h... yes
checking for stdlib.h... yes
checking for string.h... yes
checking for memory.h... yes
checking for strings.h... yes
checking for inttypes.h... yes
checking for stdint.h... yes
checking for unistd.h... yes
checking dlfcn.h usability... yes
checking dlfcn.h presence... yes
checking for dlfcn.h... yes
checking whether we are using the GNU C++ compiler... yes
checking whether g++ accepts -g... yes
checking dependency style of g++... none
checking how to run the C++ preprocessor... g++ -E
checking for g77... no
checking for xlf... no
checking for f77... no
checking for frt... no
checking for pgf77... no
checking for cf77... no
checking for fort77... no
checking for fl32... no
checking for af77... no
checking for xlf90... no
checking for f90... no
checking for pgf90... no
checking for pghpf... no
checking for epcf90... no
checking for gfortran... no
checking for g95... no
checking for xlf95... no
checking for f95... no
checking for fort... no
checking for ifort... no
checking for ifc... no
checking for efc... no
checking for pgf95... no
checking for lf95... no
checking for ftn... no
checking whether we are using the GNU Fortran 77 compiler... no
checking whether  accepts -g... no
checking the maximum length of command line arguments... 98304
checking command to parse /usr/bin/nm -B output from cc object... ok
checking for objdir... .libs
checking for ar... ar
checking for ranlib... ranlib
checking for strip... strip
checking if cc supports -fno-rtti -fno-exceptions... no
checking for cc option to produce PIC... -fPIC
checking if cc PIC flag -fPIC works... yes
checking if cc static flag -static works... yes
checking if cc supports -c -o file.o... yes
checking whether the cc linker (/usr/bin/ld -m elf_x86_64) supports shared libraries... yes
checking whether -lc should be explicitly linked in... no
checking dynamic linker characteristics... GNU/Linux ld.so
checking how to hardcode library paths into programs... immediate
checking whether stripping libraries is possible... yes
checking for shl_load... no
checking for shl_load in -ldld... no
checking for dlopen... no
checking for dlopen in -ldl... yes
checking whether a program can dlopen itself... yes
checking whether a statically linked program can dlopen itself... no
checking if libtool supports shared libraries... yes
checking whether to build shared libraries... yes
checking whether to build static libraries... yes
configure: creating libtool
appending configuration tag "CXX" to libtool
checking for ld used by g++... /usr/bin/ld -m elf_x86_64
checking if the linker (/usr/bin/ld -m elf_x86_64) is GNU ld... yes
checking whether the g++ linker (/usr/bin/ld -m elf_x86_64) supports shared libraries... yes
checking for g++ option to produce PIC... -fPIC
checking if g++ PIC flag -fPIC works... yes
checking if g++ static flag -static works... yes
checking if g++ supports -c -o file.o... yes
checking whether the g++ linker (/usr/bin/ld -m elf_x86_64) supports shared libraries... yes
checking dynamic linker characteristics... GNU/Linux ld.so
checking how to hardcode library paths into programs... immediate
appending configuration tag "F77" to libtool
checking whether to enable maintainer-specific portions of Makefiles... no
checking for aclocal flags... 
checking for gawk... (cached) mawk
checking for pkg-config... /usr/bin/pkg-config
checking pkg-config is at least version 0.18... yes
checking for ORBIT... yes
checking for ORBIT_IDL... yes
checking for ORBIT_NAME... yes
checking for ANSI C header files... (cached) yes
checking fcntl.h usability... yes
checking fcntl.h presence... yes
checking for fcntl.h... yes
checking for unistd.h... (cached) yes
checking sys/endian.h usability... no
checking sys/endian.h presence... no
checking for sys/endian.h... no
checking endian.h usability... yes
checking endian.h presence... yes
checking for endian.h... yes
checking machine/endian.h usability... no
checking machine/endian.h presence... no
checking for machine/endian.h... no
checking sys/machine.h usability... no
checking sys/machine.h presence... no
checking for sys/machine.h... no
checking sys/isa_defs.h usability... no
checking sys/isa_defs.h presence... no
checking for sys/isa_defs.h... no
checking sys/poll.h usability... yes
checking sys/poll.h presence... yes
checking for sys/poll.h... yes
checking sys/select.h usability... yes
checking sys/select.h presence... yes
checking for sys/select.h... yes
checking sys/time.h usability... yes
checking sys/time.h presence... yes
checking for sys/time.h... yes
checking netinet/in.h usability... yes
checking netinet/in.h presence... yes
checking for netinet/in.h... yes
checking sys/socket.h usability... yes
checking sys/socket.h presence... yes
checking for sys/socket.h... yes
checking arpa/inet.h usability... yes
checking arpa/inet.h presence... yes
checking for arpa/inet.h... yes
checking stddef.h usability... yes
checking stddef.h presence... yes
checking for stddef.h... yes
checking wchar.h usability... yes
checking wchar.h presence... yes
checking for wchar.h... yes
checking wcstr.h usability... no
checking wcstr.h presence... no
checking for wcstr.h... no
checking wctype.h usability... yes
checking wctype.h presence... yes
checking for wctype.h... yes
checking machine/types.h usability... no
checking machine/types.h presence... no
checking for machine/types.h... no
checking sys/un.h usability... yes
checking sys/un.h presence... yes
checking for sys/un.h... yes
checking sys/uio.h usability... yes
checking sys/uio.h presence... yes
checking for sys/uio.h... yes
checking syslog.h usability... yes
checking syslog.h presence... yes
checking for syslog.h... yes
checking sys/wait.h usability... yes
checking sys/wait.h presence... yes
checking for sys/wait.h... yes
checking netdb.h usability... yes
checking netdb.h presence... yes
checking for netdb.h... yes
checking utime.h usability... yes
checking utime.h presence... yes
checking for utime.h... yes
checking sys/utime.h usability... no
checking sys/utime.h presence... no
checking for sys/utime.h... no
checking linux/socket.h usability... yes
checking linux/socket.h presence... yes
checking for linux/socket.h... yes
checking sys/sockio.h usability... no
checking sys/sockio.h presence... no
checking for sys/sockio.h... no
checking for an ANSI C-conforming const... yes
checking for inline... inline
checking for size_t... yes
checking for vprintf... yes
checking for _doprnt... no
checking for socket... yes
checking for gethostbyname... yes
checking for sigaction... yes
checking for syslog... yes
checking whether byte ordering is bigendian... no
checking alignment of CORBA_octet... 1
checking alignment of CORBA_boolean... 1
checking alignment of CORBA_char... 1
checking alignment of CORBA_wchar... 2
checking alignment of CORBA_short... 2
checking alignment of CORBA_long... 4
checking alignment of CORBA_long_long... 8
checking alignment of CORBA_float... 4
checking alignment of CORBA_double... 8
checking alignment of CORBA_long_double... 8
checking alignment of CORBA_struct... 1
checking alignment of CORBA_pointer... 8
checking what warning flags to pass to the C compiler... -Wall -Wunused -Wmissing-prototypes -Wmissing-declarations
checking for LINC... yes
checking for ANSI C header files... (cached) yes
checking for fcntl.h... (cached) yes
checking for unistd.h... (cached) yes
checking for sys/endian.h... (cached) no
checking for endian.h... (cached) yes
checking for machine/endian.h... (cached) no
checking for sys/machine.h... (cached) no
checking for sys/isa_defs.h... (cached) no
checking for sys/poll.h... (cached) yes
checking for stddef.h... (cached) yes
checking for wchar.h... (cached) yes
checking for wcstr.h... (cached) no
checking for wctype.h... (cached) yes
checking for machine/types.h... (cached) no
checking for netinet/in.h... (cached) yes
checking netinet/tcp.h usability... yes
checking netinet/tcp.h presence... yes
checking for netinet/tcp.h... yes
checking for sys/un.h... (cached) yes
checking arpa/nameser.h usability... yes
checking arpa/nameser.h presence... yes
checking for arpa/nameser.h... yes
checking resolv.h usability... yes
checking resolv.h presence... yes
checking for resolv.h... yes
checking for poll... yes
checking for basename... yes
checking for res_init... no
checking for res_init in -lresolv... no
checking for res_9_init in -lresolv... no
checking for socket... (cached) yes
checking for gethostbyname... (cached) yes
checking for getaddrinfo... yes
checking for getnameinfo... yes
checking for inet_pton... yes
checking for socklen_t... yes
checking if sockaddr has sa_len member... no
checking CFLAGS for gcc -Werror-implicit-function-declaration... -Werror-implicit-function-declaration
checking gtk-doc version >= 1.0... yes
configure: creating ./config.status
config.status: creating Makefile
config.status: creating orbit2-config
config.status: creating ORBit-2.0.pc
config.status: creating ORBit-2.0-uninstalled.pc
config.status: creating ORBit-CosNaming-2.0.pc
config.status: creating ORBit-CosNaming-2.0-uninstalled.pc
config.status: creating ORBit-imodule-2.0.pc
config.status: creating ORBit-imodule-2.0-uninstalled.pc
config.status: creating ORBit.spec
config.status: creating orbit2-zip
config.status: creating src/Makefile
config.status: creating src/idl-compiler/Makefile
config.status: creating src/idl-compiler/ORBit-idl-2.0.pc
config.status: creating src/idl/Makefile
config.status: creating src/idl/CORBA/Makefile
config.status: creating src/idl/CORBA_PIDL/Makefile
config.status: creating src/idl/interop/Makefile
config.status: creating src/idl/misc/Makefile
config.status: creating src/orb/Makefile
config.status: creating src/orb/include/Makefile
config.status: creating src/orb/util/Makefile
config.status: creating src/orb/GIOP/Makefile
config.status: creating src/orb/orb-core/Makefile
config.status: creating src/orb/dynamic/Makefile
config.status: creating src/orb/poa/Makefile
config.status: creating src/services/Makefile
config.status: creating src/services/name/Makefile
config.status: creating src/services/imodule/Makefile
config.status: creating include/Makefile
config.status: creating include/orbit/Makefile
config.status: creating include/orbit/orbit-config.h
config.status: creating include/orbit/GIOP/Makefile
config.status: creating include/orbit/util/Makefile
config.status: creating include/orbit/orb-core/Makefile
config.status: creating include/orbit/poa/Makefile
config.status: creating include/orbit/dynamic/Makefile
config.status: creating test/Makefile
config.status: creating test/everything/Makefile
config.status: creating test/inhibit/Makefile
config.status: creating test/poa/Makefile
config.status: creating docs/Makefile
config.status: creating docs/devel/Makefile
config.status: creating docs/internals/Makefile
config.status: creating docs/api/Makefile
config.status: creating linc2/Makefile
config.status: creating linc2/src/Makefile
config.status: creating linc2/test/Makefile
config.status: creating linc2/include/Makefile
config.status: creating linc2/include/linc/Makefile
config.status: creating linc2/include/linc/linc-config.h
config.status: creating config.h
config.status: executing depfiles commands
ORBit configuration:

	Source code location:	.
	Compiler:		cc

	Purify cleanliness:	yes

GCONF_DISABLE_MAKEFILE_SCHEMA_INSTALL=1 /usr/bin/make -C . 
make[1]: Entering directory `/build/buildd/orbit2-2.14.10'
/usr/bin/make  all-recursive
make[2]: Entering directory `/build/buildd/orbit2-2.14.10'
Making all in linc2
make[3]: Entering directory `/build/buildd/orbit2-2.14.10/linc2'
Making all in include
make[4]: Entering directory `/build/buildd/orbit2-2.14.10/linc2/include'
Making all in linc
make[5]: Entering directory `/build/buildd/orbit2-2.14.10/linc2/include/linc'
/usr/bin/make  all-am
make[6]: Entering directory `/build/buildd/orbit2-2.14.10/linc2/include/linc'
make[6]: Nothing to be done for `all-am'.
make[6]: Leaving directory `/build/buildd/orbit2-2.14.10/linc2/include/linc'
make[5]: Leaving directory `/build/buildd/orbit2-2.14.10/linc2/include/linc'
make[5]: Entering directory `/build/buildd/orbit2-2.14.10/linc2/include'
make[5]: Nothing to be done for `all-am'.
make[5]: Leaving directory `/build/buildd/orbit2-2.14.10/linc2/include'
make[4]: Leaving directory `/build/buildd/orbit2-2.14.10/linc2/include'
Making all in src
make[4]: Entering directory `/build/buildd/orbit2-2.14.10/linc2/src'
/bin/bash ../../libtool --tag=CC   --mode=compile cc -DHAVE_CONFIG_H -I. -I../.. -I../../linc2/include -I../../linc2/include -pthread -I/usr/include/glib-2.0 -I/usr/lib/glib-2.0/include   -Wall -Wunused -Wmissing-prototypes -Wmissing-declarations  -DG_DISABLE_DEPRECATED -D_GNU_SOURCE    -g -Wall -O2 -Werror-implicit-function-declaration -c -o linc.lo linc.c
mkdir .libs
 cc -DHAVE_CONFIG_H -I. -I../.. -I../../linc2/include -I../../linc2/include -pthread -I/usr/include/glib-2.0 -I/usr/lib/glib-2.0/include -Wall -Wunused -Wmissing-prototypes -Wmissing-declarations -DG_DISABLE_DEPRECATED -D_GNU_SOURCE -g -Wall -O2 -Werror-implicit-function-declaration -c linc.c  -fPIC -DPIC -o .libs/linc.o
 cc -DHAVE_CONFIG_H -I. -I../.. -I../../linc2/include -I../../linc2/include -pthread -I/usr/include/glib-2.0 -I/usr/lib/glib-2.0/include -Wall -Wunused -Wmissing-prototypes -Wmissing-declarations -DG_DISABLE_DEPRECATED -D_GNU_SOURCE -g -Wall -O2 -Werror-implicit-function-declaration -c linc.c -o linc.o >/dev/null 2>&1
/bin/bash ../../libtool --tag=CC   --mode=compile cc -DHAVE_CONFIG_H -I. -I../.. -I../../linc2/include -I../../linc2/include -pthread -I/usr/include/glib-2.0 -I/usr/lib/glib-2.0/include   -Wall -Wunused -Wmissing-prototypes -Wmissing-declarations  -DG_DISABLE_DEPRECATED -D_GNU_SOURCE    -g -Wall -O2 -Werror-implicit-function-declaration -c -o linc-connection.lo linc-connection.c
 cc -DHAVE_CONFIG_H -I. -I../.. -I../../linc2/include -I../../linc2/include -pthread -I/usr/include/glib-2.0 -I/usr/lib/glib-2.0/include -Wall -Wunused -Wmissing-prototypes -Wmissing-declarations -DG_DISABLE_DEPRECATED -D_GNU_SOURCE -g -Wall -O2 -Werror-implicit-function-declaration -c linc-connection.c  -fPIC -DPIC -o .libs/linc-connection.o
 cc -DHAVE_CONFIG_H -I. -I../.. -I../../linc2/include -I../../linc2/include -pthread -I/usr/include/glib-2.0 -I/usr/lib/glib-2.0/include -Wall -Wunused -Wmissing-prototypes -Wmissing-declarations -DG_DISABLE_DEPRECATED -D_GNU_SOURCE -g -Wall -O2 -Werror-implicit-function-declaration -c linc-connection.c -o linc-connection.o >/dev/null 2>&1
/bin/bash ../../libtool --tag=CC   --mode=compile cc -DHAVE_CONFIG_H -I. -I../.. -I../../linc2/include -I../../linc2/include -pthread -I/usr/include/glib-2.0 -I/usr/lib/glib-2.0/include   -Wall -Wunused -Wmissing-prototypes -Wmissing-declarations  -DG_DISABLE_DEPRECATED -D_GNU_SOURCE    -g -Wall -O2 -Werror-implicit-function-declaration -c -o linc-compat.lo linc-compat.c
 cc -DHAVE_CONFIG_H -I. -I../.. -I../../linc2/include -I../../linc2/include -pthread -I/usr/include/glib-2.0 -I/usr/lib/glib-2.0/include -Wall -Wunused -Wmissing-prototypes -Wmissing-declarations -DG_DISABLE_DEPRECATED -D_GNU_SOURCE -g -Wall -O2 -Werror-implicit-function-declaration -c linc-compat.c  -fPIC -DPIC -o .libs/linc-compat.o
 cc -DHAVE_CONFIG_H -I. -I../.. -I../../linc2/include -I../../linc2/include -pthread -I/usr/include/glib-2.0 -I/usr/lib/glib-2.0/include -Wall -Wunused -Wmissing-prototypes -Wmissing-declarations -DG_DISABLE_DEPRECATED -D_GNU_SOURCE -g -Wall -O2 -Werror-implicit-function-declaration -c linc-compat.c -o linc-compat.o >/dev/null 2>&1
/bin/bash ../../libtool --tag=CC   --mode=compile cc -DHAVE_CONFIG_H -I. -I../.. -I../../linc2/include -I../../linc2/include -pthread -I/usr/include/glib-2.0 -I/usr/lib/glib-2.0/include   -Wall -Wunused -Wmissing-prototypes -Wmissing-declarations  -DG_DISABLE_DEPRECATED -D_GNU_SOURCE    -g -Wall -O2 -Werror-implicit-function-declaration -c -o linc-protocols.lo linc-protocols.c
 cc -DHAVE_CONFIG_H -I. -I../.. -I../../linc2/include -I../../linc2/include -pthread -I/usr/include/glib-2.0 -I/usr/lib/glib-2.0/include -Wall -Wunused -Wmissing-prototypes -Wmissing-declarations -DG_DISABLE_DEPRECATED -D_GNU_SOURCE -g -Wall -O2 -Werror-implicit-function-declaration -c linc-protocols.c  -fPIC -DPIC -o .libs/linc-protocols.o
 cc -DHAVE_CONFIG_H -I. -I../.. -I../../linc2/include -I../../linc2/include -pthread -I/usr/include/glib-2.0 -I/usr/lib/glib-2.0/include -Wall -Wunused -Wmissing-prototypes -Wmissing-declarations -DG_DISABLE_DEPRECATED -D_GNU_SOURCE -g -Wall -O2 -Werror-implicit-function-declaration -c linc-protocols.c -o linc-protocols.o >/dev/null 2>&1
/bin/bash ../../libtool --tag=CC   --mode=compile cc -DHAVE_CONFIG_H -I. -I../.. -I../../linc2/include -I../../linc2/include -pthread -I/usr/include/glib-2.0 -I/usr/lib/glib-2.0/include   -Wall -Wunused -Wmissing-prototypes -Wmissing-declarations  -DG_DISABLE_DEPRECATED -D_GNU_SOURCE    -g -Wall -O2 -Werror-implicit-function-declaration -c -o linc-server.lo linc-server.c
 cc -DHAVE_CONFIG_H -I. -I../.. -I../../linc2/include -I../../linc2/include -pthread -I/usr/include/glib-2.0 -I/usr/lib/glib-2.0/include -Wall -Wunused -Wmissing-prototypes -Wmissing-declarations -DG_DISABLE_DEPRECATED -D_GNU_SOURCE -g -Wall -O2 -Werror-implicit-function-declaration -c linc-server.c  -fPIC -DPIC -o .libs/linc-server.o
linc-server.c: In function 'link_server_accept_connection':
linc-server.c:158: warning: pointer targets in passing argument 3 of 'accept' differ in signedness
 cc -DHAVE_CONFIG_H -I. -I../.. -I../../linc2/include -I../../linc2/include -pthread -I/usr/include/glib-2.0 -I/usr/lib/glib-2.0/include -Wall -Wunused -Wmissing-prototypes -Wmissing-declarations -DG_DISABLE_DEPRECATED -D_GNU_SOURCE -g -Wall -O2 -Werror-implicit-function-declaration -c linc-server.c -o linc-server.o >/dev/null 2>&1
/bin/bash ../../libtool --tag=CC   --mode=compile cc -DHAVE_CONFIG_H -I. -I../.. -I../../linc2/include -I../../linc2/include -pthread -I/usr/include/glib-2.0 -I/usr/lib/glib-2.0/include   -Wall -Wunused -Wmissing-prototypes -Wmissing-declarations  -DG_DISABLE_DEPRECATED -D_GNU_SOURCE    -g -Wall -O2 -Werror-implicit-function-declaration -c -o linc-source.lo linc-source.c
 cc -DHAVE_CONFIG_H -I. -I../.. -I../../linc2/include -I../../linc2/include -pthread -I/usr/include/glib-2.0 -I/usr/lib/glib-2.0/include -Wall -Wunused -Wmissing-prototypes -Wmissing-declarations -DG_DISABLE_DEPRECATED -D_GNU_SOURCE -g -Wall -O2 -Werror-implicit-function-declaration -c linc-source.c  -fPIC -DPIC -o .libs/linc-source.o
 cc -DHAVE_CONFIG_H -I. -I../.. -I../../linc2/include -I../../linc2/include -pthread -I/usr/include/glib-2.0 -I/usr/lib/glib-2.0/include -Wall -Wunused -Wmissing-prototypes -Wmissing-declarations -DG_DISABLE_DEPRECATED -D_GNU_SOURCE -g -Wall -O2 -Werror-implicit-function-declaration -c linc-source.c -o linc-source.o >/dev/null 2>&1
/bin/bash ../../libtool --tag=CC   --mode=link cc  -g -Wall -O2 -Werror-implicit-function-declaration -pthread -lgobject-2.0 -lgthread-2.0 -lrt -lglib-2.0   -no-undefined  -o liblinc.la  linc.lo linc-connection.lo linc-compat.lo linc-protocols.lo linc-server.lo linc-source.lo  
ar cru .libs/liblinc.a .libs/linc.o .libs/linc-connection.o .libs/linc-compat.o .libs/linc-protocols.o .libs/linc-server.o .libs/linc-source.o
ranlib .libs/liblinc.a
creating liblinc.la
(cd .libs && rm -f liblinc.la && ln -s ../liblinc.la liblinc.la)
cc -DHAVE_CONFIG_H -I. -I../.. -I../../linc2/include -I../../linc2/include -pthread -I/usr/include/glib-2.0 -I/usr/lib/glib-2.0/include   -Wall -Wunused -Wmissing-prototypes -Wmissing-declarations  -DG_DISABLE_DEPRECATED -D_GNU_SOURCE    -g -Wall -O2 -Werror-implicit-function-declaration -c cleanup.c
/bin/bash ../../libtool --tag=CC   --mode=link cc  -g -Wall -O2 -Werror-implicit-function-declaration -pthread -lgobject-2.0 -lgthread-2.0 -lrt -lglib-2.0    -o linc-cleanup-sockets cleanup.o  
cc -g -Wall -O2 -Werror-implicit-function-declaration -pthread -o linc-cleanup-sockets cleanup.o  /usr/lib/libgobject-2.0.so /usr/lib/libgthread-2.0.so -lrt /usr/lib/libglib-2.0.so  
make[4]: Leaving directory `/build/buildd/orbit2-2.14.10/linc2/src'
Making all in test
make[4]: Entering directory `/build/buildd/orbit2-2.14.10/linc2/test'
cc -DHAVE_CONFIG_H -I. -I../.. -I../../linc2/include -I../../linc2/include -I../../linc2/src -pthread -I/usr/include/glib-2.0 -I/usr/lib/glib-2.0/include   -Wall -Wunused -Wmissing-prototypes -Wmissing-declarations    -g -Wall -O2 -Werror-implicit-function-declaration -c test-linc.c
test-linc.c: In function 'test_hosts_lookup':
test-linc.c:488: warning: pointer targets in passing argument 1 of 'verify_addr_is_loopback' differ in signedness
/bin/bash ../../libtool --tag=CC   --mode=link cc  -g -Wall -O2 -Werror-implicit-function-declaration   -o test-linc test-linc.o ../src/liblinc.la -pthread -lgobject-2.0 -lgthread-2.0 -lrt -lglib-2.0   
mkdir .libs
cc -g -Wall -O2 -Werror-implicit-function-declaration -o test-linc test-linc.o -pthread  ../src/.libs/liblinc.a /usr/lib/libgobject-2.0.so /usr/lib/libgthread-2.0.so -lrt /usr/lib/libglib-2.0.so  
make[4]: Leaving directory `/build/buildd/orbit2-2.14.10/linc2/test'
make[4]: Entering directory `/build/buildd/orbit2-2.14.10/linc2'
make[4]: Nothing to be done for `all-am'.
make[4]: Leaving directory `/build/buildd/orbit2-2.14.10/linc2'
make[3]: Leaving directory `/build/buildd/orbit2-2.14.10/linc2'
Making all in src
make[3]: Entering directory `/build/buildd/orbit2-2.14.10/src'
Making all in idl-compiler
make[4]: Entering directory `/build/buildd/orbit2-2.14.10/src/idl-compiler'
cc -DHAVE_CONFIG_H -I. -I../.. -I../.. -I../../include -I../.. -I../../include -DORBIT_BACKENDS_DIR="\"/usr/lib/orbit-2.0/idl-backends\"" -DVERSION=\"2.14.9\" -DORBIT2_INTERNAL_API -Wall -Wunused -Wmissing-prototypes -Wmissing-declarations -DG_DISABLE_DEPRECATED -I/usr/include/libIDL-2.0 -I/usr/include/glib-2.0 -I/usr/lib/glib-2.0/include      -g -Wall -O2 -Werror-implicit-function-declaration -c orbit-idl-main.c
cc -DHAVE_CONFIG_H -I. -I../.. -I../.. -I../../include -I../.. -I../../include -DORBIT_BACKENDS_DIR="\"/usr/lib/orbit-2.0/idl-backends\"" -DVERSION=\"2.14.9\" -DORBIT2_INTERNAL_API -Wall -Wunused -Wmissing-prototypes -Wmissing-declarations -DG_DISABLE_DEPRECATED -I/usr/include/libIDL-2.0 -I/usr/include/glib-2.0 -I/usr/lib/glib-2.0/include      -g -Wall -O2 -Werror-implicit-function-declaration -c orbit-idl-driver.c
cc -DHAVE_CONFIG_H -I. -I../.. -I../.. -I../../include -I../.. -I../../include -DORBIT_BACKENDS_DIR="\"/usr/lib/orbit-2.0/idl-backends\"" -DVERSION=\"2.14.9\" -DORBIT2_INTERNAL_API -Wall -Wunused -Wmissing-prototypes -Wmissing-declarations -DG_DISABLE_DEPRECATED -I/usr/include/libIDL-2.0 -I/usr/include/glib-2.0 -I/usr/lib/glib-2.0/include      -g -Wall -O2 -Werror-implicit-function-declaration -c orbit-idl-backend.c
cc -DHAVE_CONFIG_H -I. -I../.. -I../.. -I../../include -I../.. -I../../include -DORBIT_BACKENDS_DIR="\"/usr/lib/orbit-2.0/idl-backends\"" -DVERSION=\"2.14.9\" -DORBIT2_INTERNAL_API -Wall -Wunused -Wmissing-prototypes -Wmissing-declarations -DG_DISABLE_DEPRECATED -I/usr/include/libIDL-2.0 -I/usr/include/glib-2.0 -I/usr/lib/glib-2.0/include      -g -Wall -O2 -Werror-implicit-function-declaration -c orbit-idl-utils.c
orbit-idl-utils.c: In function 'orbit_idl_print_node':
orbit-idl-utils.c:122: warning: format '%lld' expects type 'long long int', but argument 2 has type 'IDL_longlong_t'
cc -DHAVE_CONFIG_H -I. -I../.. -I../.. -I../../include -I../.. -I../../include -DORBIT_BACKENDS_DIR="\"/usr/lib/orbit-2.0/idl-backends\"" -DVERSION=\"2.14.9\" -DORBIT2_INTERNAL_API -Wall -Wunused -Wmissing-prototypes -Wmissing-declarations -DG_DISABLE_DEPRECATED -I/usr/include/libIDL-2.0 -I/usr/include/glib-2.0 -I/usr/lib/glib-2.0/include      -g -Wall -O2 -Werror-implicit-function-declaration -c orbit-idl-c-backend.c
cc -DHAVE_CONFIG_H -I. -I../.. -I../.. -I../../include -I../.. -I../../include -DORBIT_BACKENDS_DIR="\"/usr/lib/orbit-2.0/idl-backends\"" -DVERSION=\"2.14.9\" -DORBIT2_INTERNAL_API -Wall -Wunused -Wmissing-prototypes -Wmissing-declarations -DG_DISABLE_DEPRECATED -I/usr/include/libIDL-2.0 -I/usr/include/glib-2.0 -I/usr/lib/glib-2.0/include      -g -Wall -O2 -Werror-implicit-function-declaration -c orbit-idl-c-stubs.c
cc -DHAVE_CONFIG_H -I. -I../.. -I../.. -I../../include -I../.. -I../../include -DORBIT_BACKENDS_DIR="\"/usr/lib/orbit-2.0/idl-backends\"" -DVERSION=\"2.14.9\" -DORBIT2_INTERNAL_API -Wall -Wunused -Wmissing-prototypes -Wmissing-declarations -DG_DISABLE_DEPRECATED -I/usr/include/libIDL-2.0 -I/usr/include/glib-2.0 -I/usr/lib/glib-2.0/include      -g -Wall -O2 -Werror-implicit-function-declaration -c orbit-idl-c-skels.c
cc -DHAVE_CONFIG_H -I. -I../.. -I../.. -I../../include -I../.. -I../../include -DORBIT_BACKENDS_DIR="\"/usr/lib/orbit-2.0/idl-backends\"" -DVERSION=\"2.14.9\" -DORBIT2_INTERNAL_API -Wall -Wunused -Wmissing-prototypes -Wmissing-declarations -DG_DISABLE_DEPRECATED -I/usr/include/libIDL-2.0 -I/usr/include/glib-2.0 -I/usr/lib/glib-2.0/include      -g -Wall -O2 -Werror-implicit-function-declaration -c orbit-idl-c-headers.c
orbit-idl-c-headers.c: In function 'ch_output_var':
orbit-idl-c-headers.c:223: warning: format '%lld' expects type 'long long int', but argument 3 has type 'IDL_longlong_t'
orbit-idl-c-headers.c: In function 'ch_output_type_dcl':
orbit-idl-c-headers.c:459: warning: format '%lld' expects type 'long long int', but argument 3 has type 'IDL_longlong_t'
orbit-idl-c-headers.c:467: warning: format '%lld' expects type 'long long int', but argument 3 has type 'IDL_longlong_t'
cc -DHAVE_CONFIG_H -I. -I../.. -I../.. -I../../include -I../.. -I../../include -DORBIT_BACKENDS_DIR="\"/usr/lib/orbit-2.0/idl-backends\"" -DVERSION=\"2.14.9\" -DORBIT2_INTERNAL_API -Wall -Wunused -Wmissing-prototypes -Wmissing-declarations -DG_DISABLE_DEPRECATED -I/usr/include/libIDL-2.0 -I/usr/include/glib-2.0 -I/usr/lib/glib-2.0/include      -g -Wall -O2 -Werror-implicit-function-declaration -c orbit-idl-c-common.c
orbit-idl-c-common.c: In function 'cc_output_method':
orbit-idl-c-common.c:352: warning: format '%d' expects type 'int', but argument 4 has type 'size_t'
cc -DHAVE_CONFIG_H -I. -I../.. -I../.. -I../../include -I../.. -I../../include -DORBIT_BACKENDS_DIR="\"/usr/lib/orbit-2.0/idl-backends\"" -DVERSION=\"2.14.9\" -DORBIT2_INTERNAL_API -Wall -Wunused -Wmissing-prototypes -Wmissing-declarations -DG_DISABLE_DEPRECATED -I/usr/include/libIDL-2.0 -I/usr/include/glib-2.0 -I/usr/lib/glib-2.0/include      -g -Wall -O2 -Werror-implicit-function-declaration -c orbit-idl-c-imodule.c
cc -DHAVE_CONFIG_H -I. -I../.. -I../.. -I../../include -I../.. -I../../include -DORBIT_BACKENDS_DIR="\"/usr/lib/orbit-2.0/idl-backends\"" -DVERSION=\"2.14.9\" -DORBIT2_INTERNAL_API -Wall -Wunused -Wmissing-prototypes -Wmissing-declarations -DG_DISABLE_DEPRECATED -I/usr/include/libIDL-2.0 -I/usr/include/glib-2.0 -I/usr/lib/glib-2.0/include      -g -Wall -O2 -Werror-implicit-function-declaration -c orbit-idl-c-skelimpl.c
cc -DHAVE_CONFIG_H -I. -I../.. -I../.. -I../../include -I../.. -I../../include -DORBIT_BACKENDS_DIR="\"/usr/lib/orbit-2.0/idl-backends\"" -DVERSION=\"2.14.9\" -DORBIT2_INTERNAL_API -Wall -Wunused -Wmissing-prototypes -Wmissing-declarations -DG_DISABLE_DEPRECATED -I/usr/include/libIDL-2.0 -I/usr/include/glib-2.0 -I/usr/lib/glib-2.0/include      -g -Wall -O2 -Werror-implicit-function-declaration -c orbit-idl-c-utils.c
orbit-idl-c-utils.c: In function 'orbit_cbe_get_typespec_str':
orbit-idl-c-utils.c:113: warning: format '%lld' expects type 'long long int', but argument 2 has type 'IDL_longlong_t'
orbit-idl-c-utils.c:113: warning: format '%lld' expects type 'long long int', but argument 3 has type 'IDL_longlong_t'
orbit-idl-c-utils.c: In function 'orbit_cbe_get_const':
orbit-idl-c-utils.c:354: warning: format '%lld' expects type 'long long int', but argument 3 has type 'IDL_longlong_t'
cc -DHAVE_CONFIG_H -I. -I../.. -I../.. -I../../include -I../.. -I../../include -DORBIT_BACKENDS_DIR="\"/usr/lib/orbit-2.0/idl-backends\"" -DVERSION=\"2.14.9\" -DORBIT2_INTERNAL_API -Wall -Wunused -Wmissing-prototypes -Wmissing-declarations -DG_DISABLE_DEPRECATED -I/usr/include/libIDL-2.0 -I/usr/include/glib-2.0 -I/usr/lib/glib-2.0/include      -g -Wall -O2 -Werror-implicit-function-declaration -c orbit-idl-c-typecode.c
orbit-idl-c-typecode.c: In function 'orbit_output_tcstruct_digits_scale':
orbit-idl-c-typecode.c:734: warning: format '%lld' expects type 'long long int', but argument 3 has type 'IDL_longlong_t'
orbit-idl-c-typecode.c:734: warning: format '%lld' expects type 'long long int', but argument 4 has type 'IDL_longlong_t'
cc -DHAVE_CONFIG_H -I. -I../.. -I../.. -I../../include -I../.. -I../../include -DORBIT_BACKENDS_DIR="\"/usr/lib/orbit-2.0/idl-backends\"" -DVERSION=\"2.14.9\" -DORBIT2_INTERNAL_API -Wall -Wunused -Wmissing-prototypes -Wmissing-declarations -DG_DISABLE_DEPRECATED -I/usr/include/libIDL-2.0 -I/usr/include/glib-2.0 -I/usr/lib/glib-2.0/include      -g -Wall -O2 -Werror-implicit-function-declaration -c orbit-idl-c-deps.c
/bin/bash ../../libtool --tag=CC   --mode=link cc  -g -Wall -O2 -Werror-implicit-function-declaration   -o orbit-idl-2 orbit-idl-main.o orbit-idl-driver.o orbit-idl-backend.o orbit-idl-utils.o orbit-idl-c-backend.o orbit-idl-c-stubs.o orbit-idl-c-skels.o orbit-idl-c-headers.o orbit-idl-c-common.o orbit-idl-c-imodule.o orbit-idl-c-skelimpl.o orbit-idl-c-utils.o orbit-idl-c-typecode.o orbit-idl-c-deps.o -Wl,--export-dynamic -lIDL-2 -lgobject-2.0 -lgmodule-2.0 -ldl -lglib-2.0   -lm 
mkdir .libs
cc -g -Wall -O2 -Werror-implicit-function-declaration -o orbit-idl-2 orbit-idl-main.o orbit-idl-driver.o orbit-idl-backend.o orbit-idl-utils.o orbit-idl-c-backend.o orbit-idl-c-stubs.o orbit-idl-c-skels.o orbit-idl-c-headers.o orbit-idl-c-common.o orbit-idl-c-imodule.o orbit-idl-c-skelimpl.o orbit-idl-c-utils.o orbit-idl-c-typecode.o orbit-idl-c-deps.o -Wl,--export-dynamic  /usr/lib/libIDL-2.so /usr/lib/libgobject-2.0.so /usr/lib/libgmodule-2.0.so -ldl /usr/lib/libglib-2.0.so -lm  
make[4]: Leaving directory `/build/buildd/orbit2-2.14.10/src/idl-compiler'
Making all in idl
make[4]: Entering directory `/build/buildd/orbit2-2.14.10/src/idl'
Making all in CORBA
make[5]: Entering directory `/build/buildd/orbit2-2.14.10/src/idl/CORBA'
make[5]: Nothing to be done for `all'.
make[5]: Leaving directory `/build/buildd/orbit2-2.14.10/src/idl/CORBA'
Making all in CORBA_PIDL
make[5]: Entering directory `/build/buildd/orbit2-2.14.10/src/idl/CORBA_PIDL'
make[5]: Nothing to be done for `all'.
make[5]: Leaving directory `/build/buildd/orbit2-2.14.10/src/idl/CORBA_PIDL'
Making all in interop
make[5]: Entering directory `/build/buildd/orbit2-2.14.10/src/idl/interop'
make[5]: Nothing to be done for `all'.
make[5]: Leaving directory `/build/buildd/orbit2-2.14.10/src/idl/interop'
Making all in misc
make[5]: Entering directory `/build/buildd/orbit2-2.14.10/src/idl/misc'
make[5]: Nothing to be done for `all'.
make[5]: Leaving directory `/build/buildd/orbit2-2.14.10/src/idl/misc'
make[5]: Entering directory `/build/buildd/orbit2-2.14.10/src/idl'
make[5]: Nothing to be done for `all-am'.
make[5]: Leaving directory `/build/buildd/orbit2-2.14.10/src/idl'
make[4]: Leaving directory `/build/buildd/orbit2-2.14.10/src/idl'
Making all in orb
make[4]: Entering directory `/build/buildd/orbit2-2.14.10/src/orb'
Making all in include
make[5]: Entering directory `/build/buildd/orbit2-2.14.10/src/orb/include'
(cd ../../../include; /usr/bin/make)
make[6]: Entering directory `/build/buildd/orbit2-2.14.10/include'
Making all in orbit
make[7]: Entering directory `/build/buildd/orbit2-2.14.10/include/orbit'
/usr/bin/make  all-recursive
make[8]: Entering directory `/build/buildd/orbit2-2.14.10/include/orbit'
Making all in GIOP
make[9]: Entering directory `/build/buildd/orbit2-2.14.10/include/orbit/GIOP'
make[9]: Nothing to be done for `all'.
make[9]: Leaving directory `/build/buildd/orbit2-2.14.10/include/orbit/GIOP'
Making all in util
make[9]: Entering directory `/build/buildd/orbit2-2.14.10/include/orbit/util'
make[9]: Nothing to be done for `all'.
make[9]: Leaving directory `/build/buildd/orbit2-2.14.10/include/orbit/util'
Making all in orb-core
make[9]: Entering directory `/build/buildd/orbit2-2.14.10/include/orbit/orb-core'
(rm -f corba-defs.h corba-defs-stubs.c corba-defs-skels.c corba-defs-common.c corba-defs-imodule.c corba-defs-skelimpl.c || true) > /dev/null
../../../src/idl-compiler/orbit-idl-2 -I../../../src/idl/CORBA_PIDL -I../../../src/idl/CORBA -I../../../src/idl/interop -I../../../src/orb/orb-core --noskels --nodefskels --nostubs --noidata --nocommon --showcpperrors --define=Object=OObject --define=TypeCode=TTypeCode --deps ./.deps/corba-defs.idl.P ../../../src/orb/orb-core/corba-defs.idl
orbit-idl-2 2.14.9 compiling
  mode, show preprocessor errors, passes: headers 

Processing file ../../../src/orb/orb-core/corba-defs.idl
/build/buildd/orbit2-2.14.10/src/idl/CORBA/orb.idl:1: warning: Converted [CR+LF] to [LF]
    // File: orb.idl
    from <stdin>: 1:    #include "orb.idl"
for I in corba-defs.h corba-defs-stubs.c corba-defs-skels.c corba-defs-common.c corba-defs-imodule.c corba-defs-skelimpl.c; do \
		if test -f $I; then \
			sed -e 's,OObject,Object,g' -e 's,TTypeCode,TypeCode,g' $I > $I.out; \
			mv $I.out $I ; \
		fi; \
	done
(rm -f iop-defs.h iop-defs-stubs.c iop-defs-skels.c iop-defs-common.c iop-defs-imodule.c iop-defs-skelimpl.c || true) > /dev/null
../../../src/idl-compiler/orbit-idl-2 -I../../../src/idl/CORBA_PIDL -I../../../src/idl/CORBA -I../../../src/idl/interop -I../../../src/orb/orb-core --noskels --nodefskels --nostubs --noidata --nocommon --showcpperrors --define=Object=OObject --define=TypeCode=TTypeCode --deps ./.deps/iop-defs.idl.P ../../../src/orb/orb-core/iop-defs.idl
orbit-idl-2 2.14.9 compiling
  mode, show preprocessor errors, passes: headers 

Processing file ../../../src/orb/orb-core/iop-defs.idl
/build/buildd/orbit2-2.14.10/src/idl/CORBA/orb.idl:1: warning: Converted [CR+LF] to [LF]
    // File: orb.idl
    from /build/buildd/orbit2-2.14.10/src/orb/orb-core/corba-defs.idl: 1:    #include "orb.idl"
    from <stdin>: 2:    #include "corba-defs.idl"
for I in iop-defs.h iop-defs-stubs.c iop-defs-skels.c iop-defs-common.c iop-defs-imodule.c iop-defs-skelimpl.c; do \
		if test -f $I; then \
			sed -e 's,OObject,Object,g' -e 's,TTypeCode,TypeCode,g' $I > $I.out; \
			mv $I.out $I ; \
		fi; \
	done
(rm -f orbit-interface.h || true ) > /dev/null
../../../src/idl-compiler/orbit-idl-2 -I../../../src/idl/CORBA_PIDL -I../../../src/idl/CORBA -I../../../src/idl/interop -I../../../src/orb/orb-core --noskels --nodefskels --nostubs --noidata --nocommon --showcpperrors --deps .deps/orbit-interface.idl.P ../../../src/orb/orb-core/orbit-interface.idl
orbit-idl-2 2.14.9 compiling
  mode, show preprocessor errors, passes: headers 

Processing file ../../../src/orb/orb-core/orbit-interface.idl
/usr/bin/make  all-am
make[10]: Entering directory `/build/buildd/orbit2-2.14.10/include/orbit/orb-core'
make[10]: Nothing to be done for `all-am'.
make[10]: Leaving directory `/build/buildd/orbit2-2.14.10/include/orbit/orb-core'
make[9]: Leaving directory `/build/buildd/orbit2-2.14.10/include/orbit/orb-core'
Making all in poa
make[9]: Entering directory `/build/buildd/orbit2-2.14.10/include/orbit/poa'
(rm -f poa-defs.h poa-defs-stubs.c poa-defs-skels.c poa-defs-common.c poa-defs-imodule.c poa-defs-skelimpl.c || true) > /dev/null
../../../src/idl-compiler/orbit-idl-2 -I../../../src/idl/CORBA_PIDL -I../../../src/idl/CORBA -I../../../src/orb/orb-core -I../../../src/idl/misc --define=Object=OObject --define=TypeCode=TTypeCode --noskels --nodefskels --nostubs --nocommon --noidata --showcpperrors --deps ./.deps/poa-defs.idl.P ../../../src/orb/poa/poa-defs.idl
orbit-idl-2 2.14.9 compiling
  mode, show preprocessor errors, passes: headers 

Processing file ../../../src/orb/poa/poa-defs.idl
/build/buildd/orbit2-2.14.10/src/idl/CORBA/orb.idl:1: warning: Converted [CR+LF] to [LF]
    // File: orb.idl
    from /build/buildd/orbit2-2.14.10/src/orb/orb-core/corba-defs.idl: 1:    #include "orb.idl"
    from <stdin>: 2:    #include "corba-defs.idl"
for I in poa-defs.h poa-defs-stubs.c poa-defs-skels.c poa-defs-common.c poa-defs-imodule.c poa-defs-skelimpl.c; do \
		if test -f $I; then \
			sed -e 's,OObject,Object,g' -e 's,TTypeCode,TypeCode,g' $I > $I.out; \
			mv $I.out $I ; \
		fi; \
	done
/usr/bin/make  all-am
make[10]: Entering directory `/build/buildd/orbit2-2.14.10/include/orbit/poa'
make[10]: Nothing to be done for `all-am'.
make[10]: Leaving directory `/build/buildd/orbit2-2.14.10/include/orbit/poa'
make[9]: Leaving directory `/build/buildd/orbit2-2.14.10/include/orbit/poa'
Making all in dynamic
make[9]: Entering directory `/build/buildd/orbit2-2.14.10/include/orbit/dynamic'
(rm -f dynamic-defs.h dynamic-defs-stubs.c dynamic-defs-skels.c dynamic-defs-common.c dynamic-defs-imodule.c dynamic-defs-skelimpl.c || true) > /dev/null
../../../src/idl-compiler/orbit-idl-2 -I../../../src/idl/CORBA_PIDL -I../../../src/idl/CORBA -I../../../src/orb/orb-core -I../../../src/idl/misc --define=Object=OObject --define=TypeCode=TTypeCode --noskels --nodefskels --nostubs --nocommon --noidata --showcpperrors  --deps ./.deps/dynamic-defs.idl.P ../../../src/orb/dynamic/dynamic-defs.idl
orbit-idl-2 2.14.9 compiling
  mode, show preprocessor errors, passes: headers 

Processing file ../../../src/orb/dynamic/dynamic-defs.idl
/build/buildd/orbit2-2.14.10/src/idl/CORBA/orb.idl:1: warning: Converted [CR+LF] to [LF]
    // File: orb.idl
    from /build/buildd/orbit2-2.14.10/src/orb/orb-core/corba-defs.idl: 1:    #include "orb.idl"
    from <stdin>: 2:    #include "corba-defs.idl"
for I in dynamic-defs.h dynamic-defs-stubs.c dynamic-defs-skels.c dynamic-defs-common.c dynamic-defs-imodule.c dynamic-defs-skelimpl.c; do \
		if test -f $I; then \
			sed -e 's,OObject,Object,g' -e 's,TTypeCode,TypeCode,g' $I > $I.out; \
			mv $I.out $I ; \
		fi; \
	done
/usr/bin/make  all-am
make[10]: Entering directory `/build/buildd/orbit2-2.14.10/include/orbit/dynamic'
make[10]: Nothing to be done for `all-am'.
make[10]: Leaving directory `/build/buildd/orbit2-2.14.10/include/orbit/dynamic'
make[9]: Leaving directory `/build/buildd/orbit2-2.14.10/include/orbit/dynamic'
make[9]: Entering directory `/build/buildd/orbit2-2.14.10/include/orbit'
make[9]: Nothing to be done for `all-am'.
make[9]: Leaving directory `/build/buildd/orbit2-2.14.10/include/orbit'
make[8]: Leaving directory `/build/buildd/orbit2-2.14.10/include/orbit'
make[7]: Leaving directory `/build/buildd/orbit2-2.14.10/include/orbit'
make[7]: Entering directory `/build/buildd/orbit2-2.14.10/include'
make[7]: Nothing to be done for `all-am'.
make[7]: Leaving directory `/build/buildd/orbit2-2.14.10/include'
make[6]: Leaving directory `/build/buildd/orbit2-2.14.10/include'
make[5]: Leaving directory `/build/buildd/orbit2-2.14.10/src/orb/include'
Making all in orb-core
make[5]: Entering directory `/build/buildd/orbit2-2.14.10/src/orb/orb-core'
make[6]: Entering directory `/build/buildd/orbit2-2.14.10/src/idl-compiler'
make[6]: Nothing to be done for `all'.
make[6]: Leaving directory `/build/buildd/orbit2-2.14.10/src/idl-compiler'
(rm -f orbit-interface-common.c || true) > /dev/null
../../../src/idl-compiler/orbit-idl-2 --nostubs --noskels --showcpperrors --noheaders --deps .deps/orbit-interface.idl.P orbit-interface.idl
orbit-idl-2 2.14.9 compiling
  mode, show preprocessor errors, passes: common 

Processing file orbit-interface.idl
(rm -f corba-defs.h corba-defs-stubs.c corba-defs-skels.c corba-defs-common.c corba-defs-imodule.c corba-defs-skelimpl.c || true) > /dev/null
../../../src/idl-compiler/orbit-idl-2 -I../../../src/idl/CORBA_PIDL -I../../../src/idl/CORBA -I../../../src/idl/misc -I../../../src/idl/interop -I. -D_PRE_3_0_COMPILER_ --noskels --nodefskels --nostubs --noidata --noheaders --define=Object=OObject --define=TypeCode=TTypeCode --showcpperrors --deps ./.deps/corba-defs.idl.P ../../../src/orb/orb-core/corba-defs.idl
orbit-idl-2 2.14.9 compiling
  mode, show preprocessor errors, passes: common 

Processing file ../../../src/orb/orb-core/corba-defs.idl
/build/buildd/orbit2-2.14.10/src/idl/CORBA/orb.idl:1: warning: Converted [CR+LF] to [LF]
    // File: orb.idl
    from <stdin>: 1:    #include "orb.idl"
for I in corba-defs.h corba-defs-stubs.c corba-defs-skels.c corba-defs-common.c corba-defs-imodule.c corba-defs-skelimpl.c; do \
		if test -f $I; then \
			sed -e 's,OObject,Object,g' -e 's,TTypeCode,TypeCode,g' $I > $I.out; \
			mv $I.out $I ; \
		fi; \
	done
true
(rm -f iop-defs.h iop-defs-stubs.c iop-defs-skels.c iop-defs-common.c iop-defs-imodule.c iop-defs-skelimpl.c || true) > /dev/null
../../../src/idl-compiler/orbit-idl-2 -I../../../src/idl/CORBA_PIDL -I../../../src/idl/CORBA -I../../../src/idl/misc -I../../../src/idl/interop -I. -D_PRE_3_0_COMPILER_ --noskels --nodefskels --nostubs --noidata --noheaders --define=Object=OObject --define=TypeCode=TTypeCode --showcpperrors --deps ./.deps/iop-defs.idl.P ../../../src/orb/orb-core/iop-defs.idl
orbit-idl-2 2.14.9 compiling
  mode, show preprocessor errors, passes: common 

Processing file ../../../src/orb/orb-core/iop-defs.idl
/build/buildd/orbit2-2.14.10/src/idl/CORBA/orb.idl:1: warning: Converted [CR+LF] to [LF]
    // File: orb.idl
    from corba-defs.idl: 1:    #include "orb.idl"
    from <stdin>: 2:    #include "corba-defs.idl"
for I in iop-defs.h iop-defs-stubs.c iop-defs-skels.c iop-defs-common.c iop-defs-imodule.c iop-defs-skelimpl.c; do \
		if test -f $I; then \
			sed -e 's,OObject,Object,g' -e 's,TTypeCode,TypeCode,g' $I > $I.out; \
			mv $I.out $I ; \
		fi; \
	done
true
(rm -f corba-ops-stubs.c corba-ops-common.c corba-ops-skels.c corba-ops.h || true) > /dev/null
../../../src/idl-compiler/orbit-idl-2 --showcpperrors --deps .deps/corba-ops.idl.P corba-ops.idl
orbit-idl-2 2.14.9 compiling
  mode, show preprocessor errors, passes: stubs skels common headers 

Processing file corba-ops.idl
for I in corba-ops-stubs.c corba-ops-common.c corba-ops-skels.c corba-ops.h; do								\
		sed -e 's,ZZZis_a,_is_a,g' -e 's,ZZis_a,is_a,g' $I > $I.out; mv $I.out $I;	\
	done;											\
	sed -e "s,Z,_,g" corba-ops-skels.c > corba-ops-skels.c.out;				\
	mv corba-ops-skels.c.out corba-ops-skels.c;
true
/usr/bin/make  all-am
make[6]: Entering directory `/build/buildd/orbit2-2.14.10/src/orb/orb-core'
make[7]: Entering directory `/build/buildd/orbit2-2.14.10/src/idl-compiler'
make[7]: Nothing to be done for `all'.
make[7]: Leaving directory `/build/buildd/orbit2-2.14.10/src/idl-compiler'
/bin/bash ../../../libtool --tag=CC   --mode=compile cc -DHAVE_CONFIG_H -I. -I../../.. -I. -I. -I../../../include -I../../../include/orbit/orb-core -I../../../include -I../../../include/orbit/orb-core -DORBIT_TYPELIB_DIR=\""/usr/lib/orbit-2.0"\" -DORBIT2_INTERNAL_API -Wall -Wunused -Wmissing-prototypes -Wmissing-declarations  -DG_DISABLE_DEPRECATED -I../../../linc2/include -I../../../linc2/include -pthread -I/usr/include/glib-2.0 -I/usr/lib/glib-2.0/include      -g -Wall -O2 -Werror-implicit-function-declaration -c -o orbit-interface-common.lo orbit-interface-common.c
mkdir .libs
 cc -DHAVE_CONFIG_H -I. -I../../.. -I. -I. -I../../../include -I../../../include/orbit/orb-core -I../../../include -I../../../include/orbit/orb-core -DORBIT_TYPELIB_DIR=\"/usr/lib/orbit-2.0\" -DORBIT2_INTERNAL_API -Wall -Wunused -Wmissing-prototypes -Wmissing-declarations -DG_DISABLE_DEPRECATED -I../../../linc2/include -I../../../linc2/include -pthread -I/usr/include/glib-2.0 -I/usr/lib/glib-2.0/include -g -Wall -O2 -Werror-implicit-function-declaration -c orbit-interface-common.c  -fPIC -DPIC -o .libs/orbit-interface-common.o
In file included from ../../../include/orbit/GIOP/giop.h:12,
                 from ../../../include/orbit/orbit.h:15,
                 from ../../../include/orbit/orb-core/orbit-interface.h:738,
                 from orbit-interface-common.c:9:
../../../include/orbit/GIOP/giop-endian.h:16: error: static declaration of 'giop_byteswap' follows non-static declaration
../../../include/orbit/GIOP/giop-endian.h:11: error: previous declaration of 'giop_byteswap' was here
make[6]: *** [orbit-interface-common.lo] Error 1
make[6]: Leaving directory `/build/buildd/orbit2-2.14.10/src/orb/orb-core'
make[5]: *** [all] Error 2
make[5]: Leaving directory `/build/buildd/orbit2-2.14.10/src/orb/orb-core'
make[4]: *** [all-recursive] Error 1
make[4]: Leaving directory `/build/buildd/orbit2-2.14.10/src/orb'
make[3]: *** [all-recursive] Error 1
make[3]: Leaving directory `/build/buildd/orbit2-2.14.10/src'
make[2]: *** [all-recursive] Error 1
make[2]: Leaving directory `/build/buildd/orbit2-2.14.10'
make[1]: *** [all] Error 2
make[1]: Leaving directory `/build/buildd/orbit2-2.14.10'
make: *** [debian/stamp-makefile-build] Error 2
dpkg-buildpackage: failure: debian/rules build gave error exit status 2
******************************************************************************
Build finished at 20080126-0549
FAILED [dpkg-buildpackage died]
Purging chroot-toolchain-autotest/build/buildd/orbit2-2.14.10
------------------------------------------------------------------------------
  /usr/bin/sudo dpkg --root=/home/buildd/build-toolchain-autotest/chroot-toolchain-autotest --purge sp libglib2.0-0 m4 gettext file libhtml-parser-perl intltool libwww-perl liburi-perl sgml-data libhtml-tree-perl autotools-dev po-debconf libglib2.0-dev docbook libidl-dev mcpp libxml-parser-perl libhtml-tagset-perl docbook-dsssl libxml2 gtk-doc-tools pkg-config libtool intltool-debian libidl0 automake1.7 xml-core cdbs libgpg-error0 html2text libgcrypt11 libsp1c2 gettext-base debhelper sgml-base jade docbook-xml libxslt1.1 libmagic1 libexpat1 fdupes docbook-to-man libpcre3 xsltproc gnome-common docbook-xsl autoconf
(Reading database ... 13641 files and directories currently installed.)
Removing libidl-dev ...
Removing gtk-doc-tools ...
Purging configuration files for gtk-doc-tools ...
dpkg - warning: while removing gtk-doc-tools, directory `/usr/share/gtk-doc' not empty so not removed.
Removing libidl0 ...
Purging configuration files for libidl0 ...
Removing cdbs ...
Removing debhelper ...
Removing docbook-xml ...
Purging configuration files for docbook-xml ...
Removing fdupes ...
Removing docbook-to-man ...
Removing xsltproc ...
Removing gnome-common ...
Removing docbook-xsl ...
Purging configuration files for docbook-xsl ...
Removing sp ...
Removing intltool ...
Removing po-debconf ...
Removing libglib2.0-dev ...
Removing mcpp ...
Removing libxml-parser-perl ...
Removing docbook-dsssl ...
Purging configuration files for docbook-dsssl ...
Removing pkg-config ...
Removing libtool ...
Removing intltool-debian ...
Removing automake1.7 ...
Removing html2text ...
Purging configuration files for html2text ...
Removing jade ...
Purging configuration files for jade ...
Removing libxslt1.1 ...
Purging configuration files for libxslt1.1 ...
Removing libexpat1 ...
Purging configuration files for libexpat1 ...
Removing autoconf ...
Purging configuration files for autoconf ...
Removing libglib2.0-0 ...
Purging configuration files for libglib2.0-0 ...
Removing m4 ...
Removing gettext ...
Removing file ...
Purging configuration files for file ...
Removing libwww-perl ...
Removing libhtml-tree-perl ...
Removing autotools-dev ...
Removing docbook ...
Purging configuration files for docbook ...
Removing libxml2 ...
Purging configuration files for libxml2 ...
Removing libgcrypt11 ...
Purging configuration files for libgcrypt11 ...
Removing libsp1c2 ...
Purging configuration files for libsp1c2 ...
Removing gettext-base ...
Removing libmagic1 ...
Purging configuration files for libmagic1 ...
Removing libpcre3 ...
Purging configuration files for libpcre3 ...
Removing libhtml-parser-perl ...
Removing liburi-perl ...
Removing sgml-data ...
Purging configuration files for sgml-data ...
Removing libhtml-tagset-perl ...
Removing xml-core ...
Purging configuration files for xml-core ...
dpkg - warning: while removing xml-core, directory `/etc/sgml' not empty so not removed.
Removing libgpg-error0 ...
Purging configuration files for libgpg-error0 ...
Removing sgml-base ...
Purging configuration files for sgml-base ...
******************************************************************************
Finished at 20080126-0549
Build needed 00:00:28, 10632k disk space




More information about the ubuntu-autotest mailing list