Log for failed build of tagcoll2_2.0.7-1 (dist=toolchain-autotest)

Build Daemon user noreply at buildd.ubuntu.com
Fri Jan 25 02:04:47 GMT 2008


Automatic build of tagcoll2_2.0.7-1 on concordia by sbuild/lpia 1.170.5
Build started at 20080125-0200
******************************************************************************
Checking available source versions...
Fetching source files...
Reading package lists...
Building dependency tree...
Reading state information...
Need to get 465kB of source archives.
Get:1 http://toolchain.ubunut.com toolchain-autotest/main tagcoll2 2.0.7-1 (dsc) [879B]
Get:2 http://toolchain.ubunut.com toolchain-autotest/main tagcoll2 2.0.7-1 (tar) [459kB]
Get:3 http://toolchain.ubunut.com toolchain-autotest/main tagcoll2 2.0.7-1 (diff) [5389B]
Fetched 465kB in 0s (9346kB/s)
Download complete and in download only mode
** Using build dependencies supplied by package:
Build-Depends: cdbs, debhelper (>> 4.1), dh-buildinfo, pkg-config, libwibble-dev (>= 0.1.10), libwibble-dev (<< 0.2), flex, bison, doxygen, graphviz, texlive-base, gs, libtut-dev, zlib1g-dev
Checking for already installed source dependencies...
cdbs: missing
debhelper: missing
dh-buildinfo: missing
pkg-config: missing
libwibble-dev: missing
libwibble-dev: missing
flex: missing
bison: missing
doxygen: missing
graphviz: missing
texlive-base: missing
gs: missing
libtut-dev: missing
zlib1g-dev: missing
Checking for source dependency conflicts...
  /usr/bin/sudo /usr/bin/apt-get --purge $CHROOT_OPTIONS -q -y install cdbs debhelper dh-buildinfo pkg-config libwibble-dev libwibble-dev flex bison doxygen graphviz texlive-base gs libtut-dev zlib1g-dev
Reading package lists...
Building dependency tree...
Reading state information...
The following extra packages will be installed:
  autoconf automake1.7 autotools-dev defoma ed fdupes file fontconfig
  fontconfig-config gettext gettext-base ghostscript ghostscript-x gsfonts
  html2text intltool intltool-debian libboost-dev libcairo2 libcupsimage2
  libcupsys2 libdatrie0 libexpat1 libfontconfig1 libfreetype6 libgcrypt11
  libgd2-xpm libglib2.0-0 libgnutls13 libgpg-error0 libgraphviz3 libgs8
  libhtml-parser-perl libhtml-tagset-perl libhtml-tree-perl libice6 libjpeg62
  libkeyutils1 libkpathsea4 libkrb53 libltdl3 liblzo2-2 libmagic1 libnewt0.52
  libopencdk10 libpango1.0-0 libpango1.0-common libpaper1 libpcre3
  libpixman-1-0 libpng12-0 libpoppler2 libpopt0 libsm6 libtasn1-3 libthai-data
  libthai0 libtiff4 liburi-perl libwww-perl libx11-6 libx11-data libxau6
  libxaw7 libxcb-xlib0 libxcb1 libxdmcp6 libxext6 libxft2 libxml-parser-perl
  libxml2 libxmu6 libxpm4 libxrender1 libxt6 m4 mime-support po-debconf
  tex-common texlive-base-bin texlive-common texlive-doc-base ttf-dejavu
  ttf-dejavu-core ttf-dejavu-extra ucf whiptail x11-common
Suggested packages:
  autoconf2.13 autobook autoconf-archive gnu-standards autoconf-doc bison-doc
  devscripts doc-base dh-make defoma-doc psfontmgr x-ttcidfont-conf dfontmgr
  doxygen-doc doxygen-gui cvs gettext-doc hpijs graphviz-doc msttcorefonts
  cupsys-common libfreetype6-dev rng-tools libgd-tools gnutls-bin krb5-doc
  krb5-user ttf-arphic-bkai00mp ttf-arphic-bsmi00lp ttf-arphic-gbsn00lp
  ttf-arphic-gkai00mp ttf-baekmuk ttf-kochi-gothic ttf-kochi-mincho
  ttf-thryomanes libio-socket-ssl-perl gs-gpl gs-esp gs-afpl gv
  postscript-viewer xpdf-reader pdf-viewer
Recommended packages:
  automaken libft-perl curl wget lynx libboost-date-time-dev libboost-doc
  libboost-filesystem-dev libboost-graph-dev libboost-iostreams-dev
  libboost-program-options-dev libboost-python-dev libboost-regex-dev
  libboost-serialization-dev libboost-signals-dev libboost-test-dev
  libboost-thread-dev libboost-wave-dev libglib2.0-data libfribidi0
  libpaper-utils libmailtools-perl libhtml-format-perl libcompress-zlib-perl
  xml-core libmail-sendmail-perl libmail-box-perl dvipdfmx lmodern perl-tk
  texlive-base-bin-doc debconf-utils
The following NEW packages will be installed:
  autoconf automake1.7 autotools-dev bison cdbs debhelper defoma dh-buildinfo
  doxygen ed fdupes file flex fontconfig fontconfig-config gettext
  gettext-base ghostscript ghostscript-x graphviz gs gsfonts html2text
  intltool intltool-debian libboost-dev libcairo2 libcupsimage2 libcupsys2
  libdatrie0 libexpat1 libfontconfig1 libfreetype6 libgcrypt11 libgd2-xpm
  libglib2.0-0 libgnutls13 libgpg-error0 libgraphviz3 libgs8
  libhtml-parser-perl libhtml-tagset-perl libhtml-tree-perl libice6 libjpeg62
  libkeyutils1 libkpathsea4 libkrb53 libltdl3 liblzo2-2 libmagic1 libnewt0.52
  libopencdk10 libpango1.0-0 libpango1.0-common libpaper1 libpcre3
  libpixman-1-0 libpng12-0 libpoppler2 libpopt0 libsm6 libtasn1-3 libthai-data
  libthai0 libtiff4 libtut-dev liburi-perl libwibble-dev libwww-perl libx11-6
  libx11-data libxau6 libxaw7 libxcb-xlib0 libxcb1 libxdmcp6 libxext6 libxft2
  libxml-parser-perl libxml2 libxmu6 libxpm4 libxrender1 libxt6 m4
  mime-support pkg-config po-debconf tex-common texlive-base texlive-base-bin
  texlive-common texlive-doc-base ttf-dejavu ttf-dejavu-core ttf-dejavu-extra
  ucf whiptail x11-common zlib1g-dev
0 upgraded, 101 newly installed, 0 to remove and 2 not upgraded.
Need to get 0B/41.5MB of archives.
After unpacking 138MB of additional disk space will be used.
WARNING: The following packages cannot be authenticated!
  m4 flex x11-common libx11-data libxau6 libxdmcp6 libxcb1 libxcb-xlib0
  libx11-6 libnewt0.52 libpopt0 whiptail libmagic1 file defoma ttf-dejavu-core
  ttf-dejavu-extra ttf-dejavu ucf fontconfig-config libexpat1 libfreetype6
  libfontconfig1 libxrender1 libxft2 libice6 libsm6 libxt6 gettext-base
  libgpg-error0 libgcrypt11 liblzo2-2 libopencdk10 libtasn1-3 libgnutls13
  libkeyutils1 libkrb53 mime-support ed libhtml-tagset-perl liburi-perl
  libhtml-parser-perl libhtml-tree-perl libwww-perl libxml-parser-perl
  autoconf autotools-dev automake1.7 bison html2text gettext intltool-debian
  po-debconf debhelper fdupes intltool cdbs dh-buildinfo libpng12-0 doxygen
  fontconfig gsfonts libcupsys2 libjpeg62 libtiff4 libcupsimage2 libpaper1
  libgs8 ghostscript libxext6 ghostscript-x libpixman-1-0 libcairo2 libxpm4
  libgd2-xpm libpcre3 libglib2.0-0 libltdl3 libdatrie0 libpango1.0-common
  libthai-data libthai0 libpango1.0-0 libgraphviz3 libxmu6 libxaw7 graphviz gs
  libboost-dev libkpathsea4 libxml2 libpoppler2 libtut-dev libwibble-dev
  pkg-config tex-common texlive-common texlive-doc-base texlive-base-bin
  texlive-base zlib1g-dev
Authentication warning overridden.
dpkg - warning, overriding problem because --force enabled:
 package architecture (lpia) does not match system (i386)
Selecting previously deselected package m4.
(Reading database ... 9902 files and directories currently installed.)
Unpacking m4 (from .../archives/m4_1.4.10-1_lpia.deb) ...
dpkg - warning, overriding problem because --force enabled:
 package architecture (lpia) does not match system (i386)
Selecting previously deselected package flex.
Unpacking flex (from .../flex_2.5.33-12build1_lpia.deb) ...
dpkg - warning, overriding problem because --force enabled:
 package architecture (lpia) does not match system (i386)
Selecting previously deselected package x11-common.
Unpacking x11-common (from .../x11-common_1%3a7.3+10ubuntu3_lpia.deb) ...
Setting up x11-common (7.3+10ubuntu3) ...

Selecting previously deselected package libx11-data.
(Reading database ... 10014 files and directories currently installed.)
Unpacking libx11-data (from .../libx11-data_2%3a1.1.3-1ubuntu1_all.deb) ...
dpkg - warning, overriding problem because --force enabled:
 package architecture (lpia) does not match system (i386)
Selecting previously deselected package libxau6.
Unpacking libxau6 (from .../libxau6_1%3a1.0.3-2_lpia.deb) ...
dpkg - warning, overriding problem because --force enabled:
 package architecture (lpia) does not match system (i386)
Selecting previously deselected package libxdmcp6.
Unpacking libxdmcp6 (from .../libxdmcp6_1%3a1.0.2-2_lpia.deb) ...
dpkg - warning, overriding problem because --force enabled:
 package architecture (lpia) does not match system (i386)
Selecting previously deselected package libxcb1.
Unpacking libxcb1 (from .../libxcb1_1.1-1_lpia.deb) ...
dpkg - warning, overriding problem because --force enabled:
 package architecture (lpia) does not match system (i386)
Selecting previously deselected package libxcb-xlib0.
Unpacking libxcb-xlib0 (from .../libxcb-xlib0_1.1-1_lpia.deb) ...
dpkg - warning, overriding problem because --force enabled:
 package architecture (lpia) does not match system (i386)
Selecting previously deselected package libx11-6.
Unpacking libx11-6 (from .../libx11-6_2%3a1.1.3-1ubuntu1_lpia.deb) ...
dpkg - warning, overriding problem because --force enabled:
 package architecture (lpia) does not match system (i386)
Selecting previously deselected package libnewt0.52.
Unpacking libnewt0.52 (from .../libnewt0.52_0.52.2-11.1ubuntu1_lpia.deb) ...
dpkg - warning, overriding problem because --force enabled:
 package architecture (lpia) does not match system (i386)
Selecting previously deselected package libpopt0.
Unpacking libpopt0 (from .../libpopt0_1.10-3build1_lpia.deb) ...
dpkg - warning, overriding problem because --force enabled:
 package architecture (lpia) does not match system (i386)
Selecting previously deselected package whiptail.
Unpacking whiptail (from .../whiptail_0.52.2-11.1ubuntu1_lpia.deb) ...
dpkg - warning, overriding problem because --force enabled:
 package architecture (lpia) does not match system (i386)
Selecting previously deselected package libmagic1.
Unpacking libmagic1 (from .../libmagic1_4.21-3_lpia.deb) ...
dpkg - warning, overriding problem because --force enabled:
 package architecture (lpia) does not match system (i386)
Selecting previously deselected package file.
Unpacking file (from .../archives/file_4.21-3_lpia.deb) ...
Selecting previously deselected package defoma.
Unpacking defoma (from .../defoma_0.11.10-0.1_all.deb) ...
Selecting previously deselected package ttf-dejavu-core.
Unpacking ttf-dejavu-core (from .../ttf-dejavu-core_2.22-1_all.deb) ...
Selecting previously deselected package ttf-dejavu-extra.
Unpacking ttf-dejavu-extra (from .../ttf-dejavu-extra_2.22-1_all.deb) ...
Selecting previously deselected package ttf-dejavu.
Unpacking ttf-dejavu (from .../ttf-dejavu_2.22-1_all.deb) ...
Selecting previously deselected package ucf.
Unpacking ucf (from .../ucf_3.004-0ubuntu1_all.deb) ...
Moving old data out of the way
Selecting previously deselected package fontconfig-config.
Unpacking fontconfig-config (from .../fontconfig-config_2.5.0-2ubuntu2_all.deb) ...
dpkg - warning, overriding problem because --force enabled:
 package architecture (lpia) does not match system (i386)
Selecting previously deselected package libexpat1.
Unpacking libexpat1 (from .../libexpat1_2.0.1-0ubuntu1_lpia.deb) ...
dpkg - warning, overriding problem because --force enabled:
 package architecture (lpia) does not match system (i386)
Selecting previously deselected package libfreetype6.
Unpacking libfreetype6 (from .../libfreetype6_2.3.5-1ubuntu4_lpia.deb) ...
dpkg - warning, overriding problem because --force enabled:
 package architecture (lpia) does not match system (i386)
Selecting previously deselected package libfontconfig1.
Unpacking libfontconfig1 (from .../libfontconfig1_2.5.0-2ubuntu2_lpia.deb) ...
dpkg - warning, overriding problem because --force enabled:
 package architecture (lpia) does not match system (i386)
Selecting previously deselected package libxrender1.
Unpacking libxrender1 (from .../libxrender1_1%3a0.9.4-1_lpia.deb) ...
dpkg - warning, overriding problem because --force enabled:
 package architecture (lpia) does not match system (i386)
Selecting previously deselected package libxft2.
Unpacking libxft2 (from .../libxft2_2.1.12-2ubuntu4_lpia.deb) ...
dpkg - warning, overriding problem because --force enabled:
 package architecture (lpia) does not match system (i386)
Selecting previously deselected package libice6.
Unpacking libice6 (from .../libice6_2%3a1.0.4-1_lpia.deb) ...
dpkg - warning, overriding problem because --force enabled:
 package architecture (lpia) does not match system (i386)
Selecting previously deselected package libsm6.
Unpacking libsm6 (from .../libsm6_2%3a1.0.3-1_lpia.deb) ...
dpkg - warning, overriding problem because --force enabled:
 package architecture (lpia) does not match system (i386)
Selecting previously deselected package libxt6.
Unpacking libxt6 (from .../libxt6_1%3a1.0.5-3_lpia.deb) ...
dpkg - warning, overriding problem because --force enabled:
 package architecture (lpia) does not match system (i386)
Selecting previously deselected package gettext-base.
Unpacking gettext-base (from .../gettext-base_0.17-2ubuntu1_lpia.deb) ...
dpkg - warning, overriding problem because --force enabled:
 package architecture (lpia) does not match system (i386)
Selecting previously deselected package libgpg-error0.
Unpacking libgpg-error0 (from .../libgpg-error0_1.4-2ubuntu7_lpia.deb) ...
dpkg - warning, overriding problem because --force enabled:
 package architecture (lpia) does not match system (i386)
Selecting previously deselected package libgcrypt11.
Unpacking libgcrypt11 (from .../libgcrypt11_1.2.4-2ubuntu7_lpia.deb) ...
dpkg - warning, overriding problem because --force enabled:
 package architecture (lpia) does not match system (i386)
Selecting previously deselected package liblzo2-2.
Unpacking liblzo2-2 (from .../liblzo2-2_2.02-3_lpia.deb) ...
dpkg - warning, overriding problem because --force enabled:
 package architecture (lpia) does not match system (i386)
Selecting previously deselected package libopencdk10.
Unpacking libopencdk10 (from .../libopencdk10_0.6.6-1ubuntu1_lpia.deb) ...
dpkg - warning, overriding problem because --force enabled:
 package architecture (lpia) does not match system (i386)
Selecting previously deselected package libtasn1-3.
Unpacking libtasn1-3 (from .../libtasn1-3_1.1-1_lpia.deb) ...
dpkg - warning, overriding problem because --force enabled:
 package architecture (lpia) does not match system (i386)
Selecting previously deselected package libgnutls13.
Unpacking libgnutls13 (from .../libgnutls13_2.0.4-1ubuntu1_lpia.deb) ...
dpkg - warning, overriding problem because --force enabled:
 package architecture (lpia) does not match system (i386)
Selecting previously deselected package libkeyutils1.
Unpacking libkeyutils1 (from .../libkeyutils1_1.2-4_lpia.deb) ...
dpkg - warning, overriding problem because --force enabled:
 package architecture (lpia) does not match system (i386)
Selecting previously deselected package libkrb53.
Unpacking libkrb53 (from .../libkrb53_1.6.dfsg.3~beta1-2_lpia.deb) ...
Selecting previously deselected package mime-support.
Unpacking mime-support (from .../mime-support_3.39-1_all.deb) ...
dpkg - warning, overriding problem because --force enabled:
 package architecture (lpia) does not match system (i386)
Selecting previously deselected package ed.
Unpacking ed (from .../ed_0.7-1build1_lpia.deb) ...
Selecting previously deselected package libhtml-tagset-perl.
Unpacking libhtml-tagset-perl (from .../libhtml-tagset-perl_3.10-2_all.deb) ...
Selecting previously deselected package liburi-perl.
Unpacking liburi-perl (from .../liburi-perl_1.35.dfsg.1-1_all.deb) ...
dpkg - warning, overriding problem because --force enabled:
 package architecture (lpia) does not match system (i386)
Selecting previously deselected package libhtml-parser-perl.
Unpacking libhtml-parser-perl (from .../libhtml-parser-perl_3.56-1_lpia.deb) ...
Selecting previously deselected package libhtml-tree-perl.
Unpacking libhtml-tree-perl (from .../libhtml-tree-perl_3.23-1_all.deb) ...
Selecting previously deselected package libwww-perl.
Unpacking libwww-perl (from .../libwww-perl_5.805-1_all.deb) ...
dpkg - warning, overriding problem because --force enabled:
 package architecture (lpia) does not match system (i386)
Selecting previously deselected package libxml-parser-perl.
Unpacking libxml-parser-perl (from .../libxml-parser-perl_2.34-4.3_lpia.deb) ...
Selecting previously deselected package autoconf.
Unpacking autoconf (from .../autoconf_2.61-4_all.deb) ...
Selecting previously deselected package autotools-dev.
Unpacking autotools-dev (from .../autotools-dev_20070725.1_all.deb) ...
Selecting previously deselected package automake1.7.
Unpacking automake1.7 (from .../automake1.7_1.7.9-9_all.deb) ...
dpkg - warning, overriding problem because --force enabled:
 package architecture (lpia) does not match system (i386)
Selecting previously deselected package bison.
Unpacking bison (from .../bison_1%3a2.3.dfsg-5_lpia.deb) ...
dpkg - warning, overriding problem because --force enabled:
 package architecture (lpia) does not match system (i386)
Selecting previously deselected package html2text.
Unpacking html2text (from .../html2text_1.3.2a-3build1_lpia.deb) ...
dpkg - warning, overriding problem because --force enabled:
 package architecture (lpia) does not match system (i386)
Selecting previously deselected package gettext.
Unpacking gettext (from .../gettext_0.17-2ubuntu1_lpia.deb) ...
Selecting previously deselected package intltool-debian.
Unpacking intltool-debian (from .../intltool-debian_0.35.0+20060710.1_all.deb) ...
Selecting previously deselected package po-debconf.
Unpacking po-debconf (from .../po-debconf_1.0.10_all.deb) ...
Selecting previously deselected package debhelper.
Unpacking debhelper (from .../debhelper_5.0.62ubuntu1_all.deb) ...
dpkg - warning, overriding problem because --force enabled:
 package architecture (lpia) does not match system (i386)
Selecting previously deselected package fdupes.
Unpacking fdupes (from .../fdupes_1.40-4build1_lpia.deb) ...
Selecting previously deselected package intltool.
Unpacking intltool (from .../intltool_0.37.0-1_all.deb) ...
Selecting previously deselected package cdbs.
Unpacking cdbs (from .../cdbs_0.4.50ubuntu2_all.deb) ...
Selecting previously deselected package dh-buildinfo.
Unpacking dh-buildinfo (from .../dh-buildinfo_0.9_all.deb) ...
dpkg - warning, overriding problem because --force enabled:
 package architecture (lpia) does not match system (i386)
Selecting previously deselected package libpng12-0.
Unpacking libpng12-0 (from .../libpng12-0_1.2.15~beta5-3_lpia.deb) ...
dpkg - warning, overriding problem because --force enabled:
 package architecture (lpia) does not match system (i386)
Selecting previously deselected package doxygen.
Unpacking doxygen (from .../doxygen_1.5.4-1_lpia.deb) ...
dpkg - warning, overriding problem because --force enabled:
 package architecture (lpia) does not match system (i386)
Selecting previously deselected package fontconfig.
Unpacking fontconfig (from .../fontconfig_2.5.0-2ubuntu2_lpia.deb) ...
Selecting previously deselected package gsfonts.
Unpacking gsfonts (from .../gsfonts_1%3a8.11+urwcyr1.0.7~pre43-1_all.deb) ...
dpkg - warning, overriding problem because --force enabled:
 package architecture (lpia) does not match system (i386)
Selecting previously deselected package libcupsys2.
Unpacking libcupsys2 (from .../libcupsys2_1.3.5-1ubuntu2_lpia.deb) ...
dpkg - warning, overriding problem because --force enabled:
 package architecture (lpia) does not match system (i386)
Selecting previously deselected package libjpeg62.
Unpacking libjpeg62 (from .../libjpeg62_6b-14_lpia.deb) ...
dpkg - warning, overriding problem because --force enabled:
 package architecture (lpia) does not match system (i386)
Selecting previously deselected package libtiff4.
Unpacking libtiff4 (from .../libtiff4_3.8.2-7ubuntu2_lpia.deb) ...
dpkg - warning, overriding problem because --force enabled:
 package architecture (lpia) does not match system (i386)
Selecting previously deselected package libcupsimage2.
Unpacking libcupsimage2 (from .../libcupsimage2_1.3.5-1ubuntu2_lpia.deb) ...
dpkg - warning, overriding problem because --force enabled:
 package architecture (lpia) does not match system (i386)
Selecting previously deselected package libpaper1.
Unpacking libpaper1 (from .../libpaper1_1.1.23_lpia.deb) ...
dpkg - warning, overriding problem because --force enabled:
 package architecture (lpia) does not match system (i386)
Selecting previously deselected package libgs8.
Unpacking libgs8 (from .../libgs8_8.61.dfsg.1-0ubuntu4_lpia.deb) ...
dpkg - warning, overriding problem because --force enabled:
 package architecture (lpia) does not match system (i386)
Selecting previously deselected package ghostscript.
Unpacking ghostscript (from .../ghostscript_8.61.dfsg.1-0ubuntu4_lpia.deb) ...
dpkg - warning, overriding problem because --force enabled:
 package architecture (lpia) does not match system (i386)
Selecting previously deselected package libxext6.
Unpacking libxext6 (from .../libxext6_2%3a1.0.3-2build1_lpia.deb) ...
dpkg - warning, overriding problem because --force enabled:
 package architecture (lpia) does not match system (i386)
Selecting previously deselected package ghostscript-x.
Unpacking ghostscript-x (from .../ghostscript-x_8.61.dfsg.1-0ubuntu4_lpia.deb) ...
dpkg - warning, overriding problem because --force enabled:
 package architecture (lpia) does not match system (i386)
Selecting previously deselected package libpixman-1-0.
Unpacking libpixman-1-0 (from .../libpixman-1-0_0.9.6-1_lpia.deb) ...
dpkg - warning, overriding problem because --force enabled:
 package architecture (lpia) does not match system (i386)
Selecting previously deselected package libcairo2.
Unpacking libcairo2 (from .../libcairo2_1.5.6-1ubuntu1_lpia.deb) ...
dpkg - warning, overriding problem because --force enabled:
 package architecture (lpia) does not match system (i386)
Selecting previously deselected package libxpm4.
Unpacking libxpm4 (from .../libxpm4_1%3a3.5.7-1_lpia.deb) ...
dpkg - warning, overriding problem because --force enabled:
 package architecture (lpia) does not match system (i386)
Selecting previously deselected package libgd2-xpm.
Unpacking libgd2-xpm (from .../libgd2-xpm_2.0.35.dfsg-3ubuntu1_lpia.deb) ...
dpkg - warning, overriding problem because --force enabled:
 package architecture (lpia) does not match system (i386)
Selecting previously deselected package libpcre3.
Unpacking libpcre3 (from .../libpcre3_7.3-2ubuntu1_lpia.deb) ...
dpkg - warning, overriding problem because --force enabled:
 package architecture (lpia) does not match system (i386)
Selecting previously deselected package libglib2.0-0.
Unpacking libglib2.0-0 (from .../libglib2.0-0_2.15.3-0ubuntu1_lpia.deb) ...
dpkg - warning, overriding problem because --force enabled:
 package architecture (lpia) does not match system (i386)
Selecting previously deselected package libltdl3.
Unpacking libltdl3 (from .../libltdl3_1.5.24-2ubuntu2_lpia.deb) ...
dpkg - warning, overriding problem because --force enabled:
 package architecture (lpia) does not match system (i386)
Selecting previously deselected package libdatrie0.
Unpacking libdatrie0 (from .../libdatrie0_0.1.2-2_lpia.deb) ...
Selecting previously deselected package libpango1.0-common.
Unpacking libpango1.0-common (from .../libpango1.0-common_1.19.2-1ubuntu1_all.deb) ...
Selecting previously deselected package libthai-data.
Unpacking libthai-data (from .../libthai-data_0.1.9-1_all.deb) ...
dpkg - warning, overriding problem because --force enabled:
 package architecture (lpia) does not match system (i386)
Selecting previously deselected package libthai0.
Unpacking libthai0 (from .../libthai0_0.1.9-1_lpia.deb) ...
dpkg - warning, overriding problem because --force enabled:
 package architecture (lpia) does not match system (i386)
Selecting previously deselected package libpango1.0-0.
Unpacking libpango1.0-0 (from .../libpango1.0-0_1.19.2-1ubuntu1_lpia.deb) ...
dpkg - warning, overriding problem because --force enabled:
 package architecture (lpia) does not match system (i386)
Selecting previously deselected package libgraphviz3.
Unpacking libgraphviz3 (from .../libgraphviz3_2.12-5ubuntu2_lpia.deb) ...
dpkg - warning, overriding problem because --force enabled:
 package architecture (lpia) does not match system (i386)
Selecting previously deselected package libxmu6.
Unpacking libxmu6 (from .../libxmu6_2%3a1.0.4-1_lpia.deb) ...
dpkg - warning, overriding problem because --force enabled:
 package architecture (lpia) does not match system (i386)
Selecting previously deselected package libxaw7.
Unpacking libxaw7 (from .../libxaw7_2%3a1.0.4-1_lpia.deb) ...
dpkg - warning, overriding problem because --force enabled:
 package architecture (lpia) does not match system (i386)
Selecting previously deselected package graphviz.
Unpacking graphviz (from .../graphviz_2.12-5ubuntu2_lpia.deb) ...
Selecting previously deselected package gs.
Unpacking gs (from .../gs_8.61.dfsg.1-0ubuntu4_all.deb) ...
dpkg - warning, overriding problem because --force enabled:
 package architecture (lpia) does not match system (i386)
Selecting previously deselected package libboost-dev.
Unpacking libboost-dev (from .../libboost-dev_1.34.1-4ubuntu1_lpia.deb) ...
dpkg - warning, overriding problem because --force enabled:
 package architecture (lpia) does not match system (i386)
Selecting previously deselected package libkpathsea4.
Unpacking libkpathsea4 (from .../libkpathsea4_2007.dfsg.1-2_lpia.deb) ...
dpkg - warning, overriding problem because --force enabled:
 package architecture (lpia) does not match system (i386)
Selecting previously deselected package libxml2.
Unpacking libxml2 (from .../libxml2_2.6.30.dfsg-3ubuntu1_lpia.deb) ...
dpkg - warning, overriding problem because --force enabled:
 package architecture (lpia) does not match system (i386)
Selecting previously deselected package libpoppler2.
Unpacking libpoppler2 (from .../libpoppler2_0.6.2-1_lpia.deb) ...
Selecting previously deselected package libtut-dev.
Unpacking libtut-dev (from .../libtut-dev_0.0.20060329-1_all.deb) ...
dpkg - warning, overriding problem because --force enabled:
 package architecture (lpia) does not match system (i386)
Selecting previously deselected package libwibble-dev.
Unpacking libwibble-dev (from .../libwibble-dev_0.1.11ubuntu1_lpia.deb) ...
dpkg - warning, overriding problem because --force enabled:
 package architecture (lpia) does not match system (i386)
Selecting previously deselected package pkg-config.
Unpacking pkg-config (from .../pkg-config_0.22-1_lpia.deb) ...
Selecting previously deselected package tex-common.
Unpacking tex-common (from .../tex-common_1.10_all.deb) ...
Selecting previously deselected package texlive-common.
Unpacking texlive-common (from .../texlive-common_2007-13_all.deb) ...
Selecting previously deselected package texlive-doc-base.
Unpacking texlive-doc-base (from .../texlive-doc-base_2007-3_all.deb) ...
dpkg - warning, overriding problem because --force enabled:
 package architecture (lpia) does not match system (i386)
Selecting previously deselected package texlive-base-bin.
Unpacking texlive-base-bin (from .../texlive-base-bin_2007.dfsg.1-2_lpia.deb) ...
Selecting previously deselected package texlive-base.
Unpacking texlive-base (from .../texlive-base_2007-13_all.deb) ...
dpkg - warning, overriding problem because --force enabled:
 package architecture (lpia) does not match system (i386)
Selecting previously deselected package zlib1g-dev.
Unpacking zlib1g-dev (from .../zlib1g-dev_1%3a1.2.3.3.dfsg-7ubuntu1_lpia.deb) ...
Setting up m4 (1.4.10-1) ...

Setting up flex (2.5.33-12build1) ...

Setting up libx11-data (1.1.3-1ubuntu1) ...
Setting up libxau6 (1.0.3-2) ...

Setting up libxdmcp6 (1.0.2-2) ...

Setting up libxcb1 (1.1-1) ...

Setting up libxcb-xlib0 (1.1-1) ...

Setting up libx11-6 (1.1.3-1ubuntu1) ...

Setting up libnewt0.52 (0.52.2-11.1ubuntu1) ...

Setting up libpopt0 (1.10-3build1) ...

Setting up whiptail (0.52.2-11.1ubuntu1) ...
Setting up libmagic1 (4.21-3) ...

Setting up file (4.21-3) ...
Setting up defoma (0.11.10-0.1) ...

Setting up ttf-dejavu-core (2.22-1) ...

Setting up ttf-dejavu-extra (2.22-1) ...

Setting up ttf-dejavu (2.22-1) ...
Setting up ucf (3.004-0ubuntu1) ...

Setting up fontconfig-config (2.5.0-2ubuntu2) ...

Setting up libexpat1 (2.0.1-0ubuntu1) ...

Setting up libfreetype6 (2.3.5-1ubuntu4) ...

Setting up libfontconfig1 (2.5.0-2ubuntu2) ...

Setting up libxrender1 (0.9.4-1) ...

Setting up libxft2 (2.1.12-2ubuntu4) ...

Setting up libice6 (1.0.4-1) ...

Setting up libsm6 (1.0.3-1) ...

Setting up libxt6 (1.0.5-3) ...

Setting up gettext-base (0.17-2ubuntu1) ...

Setting up libgpg-error0 (1.4-2ubuntu7) ...

Setting up libgcrypt11 (1.2.4-2ubuntu7) ...

Setting up liblzo2-2 (2.02-3) ...

Setting up libopencdk10 (0.6.6-1ubuntu1) ...

Setting up libtasn1-3 (1.1-1) ...

Setting up libgnutls13 (2.0.4-1ubuntu1) ...

Setting up libkeyutils1 (1.2-4) ...

Setting up libkrb53 (1.6.dfsg.3~beta1-2) ...

Setting up mime-support (3.39-1) ...

Setting up ed (0.7-1build1) ...

Setting up libhtml-tagset-perl (3.10-2) ...
Setting up liburi-perl (1.35.dfsg.1-1) ...
Setting up libhtml-parser-perl (3.56-1) ...
Setting up libhtml-tree-perl (3.23-1) ...
Setting up libwww-perl (5.805-1) ...
Setting up libxml-parser-perl (2.34-4.3) ...
Setting up autoconf (2.61-4) ...

Setting up autotools-dev (20070725.1) ...
Setting up automake1.7 (1.7.9-9) ...

Setting up bison (2.3.dfsg-5) ...

Setting up html2text (1.3.2a-3build1) ...

Setting up gettext (0.17-2ubuntu1) ...

Setting up intltool-debian (0.35.0+20060710.1) ...
Setting up po-debconf (1.0.10) ...

Setting up debhelper (5.0.62ubuntu1) ...
Setting up fdupes (1.40-4build1) ...
Setting up intltool (0.37.0-1) ...
Setting up cdbs (0.4.50ubuntu2) ...

Setting up dh-buildinfo (0.9) ...
Setting up libpng12-0 (1.2.15~beta5-3) ...

Setting up doxygen (1.5.4-1) ...
Setting up fontconfig (2.5.0-2ubuntu2) ...
Updating font configuration of fontconfig...
Cleaning up category cid..
Cleaning up category truetype..
Cleaning up category type1..
Updating category type1..
Updating category truetype..
Updating category cid..
Updating fontconfig cache for /usr/share/fonts/truetype/ttf-dejavu
Cleaning up old fontconfig caches... done.
Regenerating fonts cache... done.

Setting up gsfonts (8.11+urwcyr1.0.7~pre43-1) ...
(Re-)registering PostScript fonts...
Updating fontconfig cache for /usr/share/fonts/type1/gsfonts
done.

Setting up libcupsys2 (1.3.5-1ubuntu2) ...

Setting up libjpeg62 (6b-14) ...

Setting up libtiff4 (3.8.2-7ubuntu2) ...

Setting up libcupsimage2 (1.3.5-1ubuntu2) ...

Setting up libpaper1 (1.1.23) ...

Creating config file /etc/papersize with new version

Setting up libgs8 (8.61.dfsg.1-0ubuntu4) ...

Setting up ghostscript (8.61.dfsg.1-0ubuntu4) ...
Updating font configuration of gs...
Cleaning up category psprint..
Cleaning up category cmap..
Cleaning up category cid..
Cleaning up category truetype..
Cleaning up category gsfontderivative..
Cleaning up category type3..
Cleaning up category type1..
Updating category type1..
Updating category type3..
Updating category gsfontderivative..
Updating category truetype..
Updating category cid..
Updating category cmap..
Updating category psprint..

Setting up libxext6 (1.0.3-2build1) ...

Setting up ghostscript-x (8.61.dfsg.1-0ubuntu4) ...
Setting up libpixman-1-0 (0.9.6-1) ...

Setting up libcairo2 (1.5.6-1ubuntu1) ...

Setting up libxpm4 (3.5.7-1) ...

Setting up libgd2-xpm (2.0.35.dfsg-3ubuntu1) ...

Setting up libpcre3 (7.3-2ubuntu1) ...

Setting up libglib2.0-0 (2.15.3-0ubuntu1) ...

Setting up libltdl3 (1.5.24-2ubuntu2) ...

Setting up libdatrie0 (0.1.2-2) ...

Setting up libpango1.0-common (1.19.2-1ubuntu1) ...
I: Purging /etc/pango/pango.modules
Cleaning up font configuration of pango...
Updating font configuration of pango...
Cleaning up category xfont..
Updating category xfont..
*** You don't have any defomized font packages.
*** So we are trying to force to generate pangox.aliases...

Setting up libthai-data (0.1.9-1) ...
Setting up libthai0 (0.1.9-1) ...

Setting up libpango1.0-0 (1.19.2-1ubuntu1) ...

Setting up libgraphviz3 (2.12-5ubuntu2) ...

Setting up libxmu6 (1.0.4-1) ...

Setting up libxaw7 (1.0.4-1) ...

Setting up graphviz (2.12-5ubuntu2) ...

Setting up gs (8.61.dfsg.1-0ubuntu4) ...
Setting up libboost-dev (1.34.1-4ubuntu1) ...
Setting up libkpathsea4 (2007.dfsg.1-2) ...

Setting up libxml2 (2.6.30.dfsg-3ubuntu1) ...

Setting up libpoppler2 (0.6.2-1) ...

Setting up libtut-dev (0.0.20060329-1) ...
Setting up libwibble-dev (0.1.11ubuntu1) ...
Setting up pkg-config (0.22-1) ...
Setting up tex-common (1.10) ...

Creating config file /etc/texmf/texmf.d/05TeXMF.cnf with new version

Creating config file /etc/texmf/texmf.d/15Plain.cnf with new version

Creating config file /etc/texmf/texmf.d/45TeXinputs.cnf with new version

Creating config file /etc/texmf/texmf.d/55Fonts.cnf with new version

Creating config file /etc/texmf/texmf.d/65BibTeX.cnf with new version

Creating config file /etc/texmf/texmf.d/75DviPS.cnf with new version

Creating config file /etc/texmf/texmf.d/85Misc.cnf with new version

Creating config file /etc/texmf/texmf.d/90TeXDoc.cnf with new version

Creating config file /etc/texmf/texmf.d/95NonPath.cnf with new version

Creating config file /etc/texmf/updmap.d/00updmap.cfg with new version

Creating config file /etc/texmf/texmf.cnf with new version

Setting up texlive-common (2007-13) ...

Setting up texlive-doc-base (2007-3) ...
Running mktexlsr. This may take some time... done.

Setting up texlive-base-bin (2007.dfsg.1-2) ...
Running mktexlsr. This may take some time... done.
Building format(s) --all.
	This may take some time... done.

Setting up texlive-base (2007-13) ...
Running mktexlsr. This may take some time... done.
Building format(s) --all.
	This may take some time... done.
Running updmap-sys. This may take some time... done.

Setting up zlib1g-dev (1.2.3.3.dfsg-7ubuntu1) ...
modified:
  fstab
  mtab
unknown:
  apt/apt.conf.d/99buildd
Checking correctness of source dependencies...
Toolchain package versions: libc6-dev_2.7-5ubuntu2 make_3.81-3build1 dpkg-dev_1.14.15ubuntu1 linux-libc-dev_2.6.24-4.7 gcc-4.3_4.3-20080122-0ubuntu1 g++-4.3_4.3-20080122-0ubuntu1 binutils_2.18.1~cvs20080103-0ubuntu1 libstdc++6_4.3-20080122-0ubuntu1 libstdc++6-4.3-dev_4.3-20080122-0ubuntu1
------------------------------------------------------------------------------
gpg: Signature made Mon Sep 17 17:53:15 2007 BST using DSA key ID 797EBFAB
gpg: Can't check signature: public key not found
dpkg-source: extracting tagcoll2 in tagcoll2-2.0.7
dpkg-source: unpacking tagcoll2_2.0.7.orig.tar.gz
dpkg-source: applying /home/buildd/build-toolchain-autotest/tagcoll2_2.0.7-1.diff.gz
dpkg-buildpackage: source package tagcoll2
dpkg-buildpackage: source version 2.0.7-1
dpkg-buildpackage: host architecture lpia
 /usr/bin/fakeroot debian/rules clean
test -x debian/rules
dh_testroot
for i in ./config.guess ./config.sub  ; do \
		if test -e $i.cdbs-orig ; then \
			mv $i.cdbs-orig $i ; \
		fi ; \
	done
dh_clean 
/usr/bin/make -C . -k distclean
make[1]: Entering directory `/build/buildd/tagcoll2-2.0.7'
make[1]: *** No rule to make target `distclean'.
make[1]: Leaving directory `/build/buildd/tagcoll2-2.0.7'
make: [makefile-clean] Error 2 (ignored)
rm -f debian/stamp-makefile-build
rm -f debian/stamp-makefile-check
rm -f debian/stamp-autotools-files
 debian/rules build
test -x debian/rules
mkdir -p "."
if test -e /usr/share/misc/config.guess ; then \
		for i in ./config.guess ; do \
			if ! test -e $i.cdbs-orig ; then \
				mv $i $i.cdbs-orig ; \
				cp --remove-destination /usr/share/misc/config.guess $i ; \
			fi ; \
		done ; \
	fi
if test -e /usr/share/misc/config.sub ; then \
		for i in ./config.sub ; do \
			if ! test -e $i.cdbs-orig ; then \
				mv $i $i.cdbs-orig ; \
				cp --remove-destination /usr/share/misc/config.sub $i ; \
			fi ; \
		done ; \
	fi
touch debian/stamp-autotools-files
chmod a+x /build/buildd/tagcoll2-2.0.7/./configure
cd . && CC="cc" CXX="g++" CFLAGS="-g -Wall -O2" CXXFLAGS="-g -Wall -O2" CPPFLAGS="" LDFLAGS="" /build/buildd/tagcoll2-2.0.7/./configure --build=i686-linux-gnulp --prefix=/usr --includedir="\${prefix}/include" --mandir="\${prefix}/share/man" --infodir="\${prefix}/share/info" --sysconfdir=/etc --localstatedir=/var --libexecdir="\${prefix}/lib/tagcoll2" --disable-maintainer-mode --disable-dependency-tracking --srcdir=.   --disable-shared --with-pic 
checking for a BSD-compatible install... /usr/bin/install -c
checking whether build environment is sane... yes
checking for a thread-safe mkdir -p... /bin/mkdir -p
checking for gawk... no
checking for mawk... mawk
checking whether make sets $(MAKE)... yes
checking whether make sets $(MAKE)... (cached) yes
checking for style of include used by make... GNU
checking for C++ compiler default output file name... a.out
checking whether the C++ compiler works... yes
checking whether we are cross compiling... no
checking for suffix of executables... 
checking for suffix of object files... o
checking whether we are using the GNU C++ compiler... yes
checking whether g++ accepts -g... yes
checking dependency style of g++... none
checking for library containing strerror... none required
checking whether we are using the GNU C++ compiler... (cached) yes
checking whether g++ accepts -g... (cached) yes
checking dependency style of g++... (cached) none
checking how to run the C++ preprocessor... g++ -E
checking for gcc... cc
checking whether we are using the GNU C compiler... yes
checking whether cc accepts -g... yes
checking for cc option to accept ISO C89... none needed
checking dependency style of cc... none
checking for grep that handles long lines and -e... /bin/grep
checking for egrep... /bin/grep -E
checking for ANSI C header files... yes
checking whether cc understands -c and -o together... yes
checking for flex... flex
checking lex output file root... lex.yy
checking lex library... none needed
checking whether yytext is a pointer... no
checking for bison... bison -y
checking build system type... i686-pc-linux-gnulp
checking host system type... i686-pc-linux-gnulp
checking for a sed that does not truncate output... /bin/sed
checking for ld used by cc... /usr/bin/ld
checking if the linker (/usr/bin/ld) is GNU ld... yes
checking for /usr/bin/ld option to reload object files... -r
checking for BSD-compatible nm... /usr/bin/nm -B
checking whether ln -s works... yes
checking how to recognise dependent libraries... pass_all
checking for sys/types.h... yes
checking for sys/stat.h... yes
checking for stdlib.h... yes
checking for string.h... yes
checking for memory.h... yes
checking for strings.h... yes
checking for inttypes.h... yes
checking for stdint.h... yes
checking for unistd.h... yes
checking how to run the C preprocessor... cc -E
checking dlfcn.h usability... yes
checking dlfcn.h presence... yes
checking for dlfcn.h... yes
checking how to run the C++ preprocessor... g++ -E
checking for g77... no
checking for xlf... no
checking for f77... no
checking for frt... no
checking for pgf77... no
checking for cf77... no
checking for fort77... no
checking for fl32... no
checking for af77... no
checking for xlf90... no
checking for f90... no
checking for pgf90... no
checking for pghpf... no
checking for epcf90... no
checking for gfortran... no
checking for g95... no
checking for xlf95... no
checking for f95... no
checking for fort... no
checking for ifort... no
checking for ifc... no
checking for efc... no
checking for pgf95... no
checking for lf95... no
checking for ftn... no
checking whether we are using the GNU Fortran 77 compiler... no
checking whether  accepts -g... no
checking the maximum length of command line arguments... 32768
checking command to parse /usr/bin/nm -B output from cc object... ok
checking for objdir... .libs
checking for ar... ar
checking for ranlib... ranlib
checking for strip... strip
checking if cc supports -fno-rtti -fno-exceptions... no
checking for cc option to produce PIC... -fPIC
checking if cc PIC flag -fPIC works... yes
checking if cc static flag -static works... yes
checking if cc supports -c -o file.o... yes
checking whether the cc linker (/usr/bin/ld) supports shared libraries... yes
checking dynamic linker characteristics... GNU/Linux ld.so
checking how to hardcode library paths into programs... immediate
checking whether stripping libraries is possible... yes
checking if libtool supports shared libraries... yes
checking whether to build shared libraries... no
checking whether to build static libraries... yes
configure: creating libtool
appending configuration tag "CXX" to libtool
checking for ld used by g++... /usr/bin/ld
checking if the linker (/usr/bin/ld) is GNU ld... yes
checking whether the g++ linker (/usr/bin/ld) supports shared libraries... yes
checking for g++ option to produce PIC... -fPIC
checking if g++ PIC flag -fPIC works... yes
checking if g++ static flag -static works... yes
checking if g++ supports -c -o file.o... yes
checking whether the g++ linker (/usr/bin/ld) supports shared libraries... yes
checking dynamic linker characteristics... GNU/Linux ld.so
checking how to hardcode library paths into programs... immediate
appending configuration tag "F77" to libtool
checking for pkg-config... /usr/bin/pkg-config
checking pkg-config is at least version 0.9.0... yes
checking for LIBWIBBLE... yes
configure: creating ./config.status
config.status: creating Makefile
config.status: creating tagcoll/Makefile
config.status: creating tagcoll/tagexpr/Makefile
config.status: creating bench/Makefile
config.status: creating doc/Makefile
config.status: creating tools/Makefile
config.status: creating libtagcoll2.pc
config.status: creating config.h
config.status: executing depfiles commands
/usr/bin/make -C . 
make[1]: Entering directory `/build/buildd/tagcoll2-2.0.7'
/usr/bin/make  all-recursive
make[2]: Entering directory `/build/buildd/tagcoll2-2.0.7'
Making all in tagcoll
make[3]: Entering directory `/build/buildd/tagcoll2-2.0.7/tagcoll'
Making all in tagexpr
make[4]: Entering directory `/build/buildd/tagcoll2-2.0.7/tagcoll/tagexpr'
/bin/bash ../../libtool --tag=CXX   --mode=compile g++ -DHAVE_CONFIG_H -I. -I../.. -I../..     -g -Wall -O2 -Wall -c -o TagexprParser.lo TagexprParser.cc
 g++ -DHAVE_CONFIG_H -I. -I../.. -I../.. -g -Wall -O2 -Wall -c TagexprParser.cc  -fPIC -DPIC -o TagexprParser.o
/bin/bash ../../libtool --tag=CXX   --mode=compile g++ -DHAVE_CONFIG_H -I. -I../.. -I../..     -g -Wall -O2 -Wall -c -o Tagexpr_parser_y.lo Tagexpr_parser_y.cc
 g++ -DHAVE_CONFIG_H -I. -I../.. -I../.. -g -Wall -O2 -Wall -c Tagexpr_parser_y.cc  -fPIC -DPIC -o Tagexpr_parser_y.o
/bin/bash ../../libtool --tag=CXX   --mode=compile g++ -DHAVE_CONFIG_H -I. -I../.. -I../..     -g -Wall -O2 -Wall -c -o Tagexpr_parser_l.lo Tagexpr_parser_l.cc
 g++ -DHAVE_CONFIG_H -I. -I../.. -I../.. -g -Wall -O2 -Wall -c Tagexpr_parser_l.cc  -fPIC -DPIC -o Tagexpr_parser_l.o
Tagexpr_parser_l.cc:1090: warning: 'void yyunput(int, char*)' defined but not used
/bin/bash ../../libtool --tag=CXX   --mode=link g++  -g -Wall -O2 -Wall   -o libtagexpr.la  TagexprParser.lo Tagexpr_parser_y.lo Tagexpr_parser_l.lo  
mkdir .libs
ar cru .libs/libtagexpr.a  TagexprParser.o Tagexpr_parser_y.o Tagexpr_parser_l.o
ranlib .libs/libtagexpr.a
creating libtagexpr.la
(cd .libs && rm -f libtagexpr.la && ln -s ../libtagexpr.la libtagexpr.la)
make[4]: Leaving directory `/build/buildd/tagcoll2-2.0.7/tagcoll/tagexpr'
Making all in .
make[4]: Entering directory `/build/buildd/tagcoll2-2.0.7/tagcoll'
/bin/bash ../libtool --tag=CXX   --mode=compile g++ -DHAVE_CONFIG_H -I. -I.. -I..     -g -Wall -O2 -Wall -c -o input/base.lo input/base.cc
 g++ -DHAVE_CONFIG_H -I. -I.. -I.. -g -Wall -O2 -Wall -c input/base.cc  -fPIC -DPIC -o input/base.o
/bin/bash ../libtool --tag=CXX   --mode=compile g++ -DHAVE_CONFIG_H -I. -I.. -I..     -g -Wall -O2 -Wall -c -o input/memory.lo input/memory.cc
 g++ -DHAVE_CONFIG_H -I. -I.. -I.. -g -Wall -O2 -Wall -c input/memory.cc  -fPIC -DPIC -o input/memory.o
/bin/bash ../libtool --tag=CXX   --mode=compile g++ -DHAVE_CONFIG_H -I. -I.. -I..     -g -Wall -O2 -Wall -c -o input/string.lo input/string.cc
 g++ -DHAVE_CONFIG_H -I. -I.. -I.. -g -Wall -O2 -Wall -c input/string.cc  -fPIC -DPIC -o input/string.o
/bin/bash ../libtool --tag=CXX   --mode=compile g++ -DHAVE_CONFIG_H -I. -I.. -I..     -g -Wall -O2 -Wall -c -o input/stdio.lo input/stdio.cc
 g++ -DHAVE_CONFIG_H -I. -I.. -I.. -g -Wall -O2 -Wall -c input/stdio.cc  -fPIC -DPIC -o input/stdio.o
/bin/bash ../libtool --tag=CXX   --mode=compile g++ -DHAVE_CONFIG_H -I. -I.. -I..     -g -Wall -O2 -Wall -c -o input/zlib.lo input/zlib.cc
 g++ -DHAVE_CONFIG_H -I. -I.. -I.. -g -Wall -O2 -Wall -c input/zlib.cc  -fPIC -DPIC -o input/zlib.o
/bin/bash ../libtool --tag=CXX   --mode=compile g++ -DHAVE_CONFIG_H -I. -I.. -I..     -g -Wall -O2 -Wall -c -o diskindex/mmap.lo diskindex/mmap.cc
 g++ -DHAVE_CONFIG_H -I. -I.. -I.. -g -Wall -O2 -Wall -c diskindex/mmap.cc  -fPIC -DPIC -o diskindex/mmap.o
/bin/bash ../libtool --tag=CXX   --mode=compile g++ -DHAVE_CONFIG_H -I. -I.. -I..     -g -Wall -O2 -Wall -c -o diskindex/int.lo diskindex/int.cc
 g++ -DHAVE_CONFIG_H -I. -I.. -I.. -g -Wall -O2 -Wall -c diskindex/int.cc  -fPIC -DPIC -o diskindex/int.o
/bin/bash ../libtool --tag=CXX   --mode=compile g++ -DHAVE_CONFIG_H -I. -I.. -I..     -g -Wall -O2 -Wall -c -o diskindex/string.lo diskindex/string.cc
 g++ -DHAVE_CONFIG_H -I. -I.. -I.. -g -Wall -O2 -Wall -c diskindex/string.cc  -fPIC -DPIC -o diskindex/string.o
/bin/bash ../libtool --tag=CXX   --mode=compile g++ -DHAVE_CONFIG_H -I. -I.. -I..     -g -Wall -O2 -Wall -c -o expression.lo expression.cc
 g++ -DHAVE_CONFIG_H -I. -I.. -I.. -g -Wall -O2 -Wall -c expression.cc  -fPIC -DPIC -o expression.o
/bin/bash ../libtool --tag=CXX   --mode=compile g++ -DHAVE_CONFIG_H -I. -I.. -I..     -g -Wall -O2 -Wall -c -o coll/intdiskindex.lo coll/intdiskindex.cc
 g++ -DHAVE_CONFIG_H -I. -I.. -I.. -g -Wall -O2 -Wall -c coll/intdiskindex.cc  -fPIC -DPIC -o coll/intdiskindex.o
/bin/bash ../libtool --tag=CXX   --mode=compile g++ -DHAVE_CONFIG_H -I. -I.. -I..     -g -Wall -O2 -Wall -c -o SmartHierarchy.lo SmartHierarchy.cc
 g++ -DHAVE_CONFIG_H -I. -I.. -I.. -g -Wall -O2 -Wall -c SmartHierarchy.cc  -fPIC -DPIC -o SmartHierarchy.o
/bin/bash ../libtool --tag=CXX   --mode=compile g++ -DHAVE_CONFIG_H -I. -I.. -I..     -g -Wall -O2 -Wall -c -o TextFormat.lo TextFormat.cc
 g++ -DHAVE_CONFIG_H -I. -I.. -I.. -g -Wall -O2 -Wall -c TextFormat.cc  -fPIC -DPIC -o TextFormat.o
In file included from TextFormat.cc:208:
../tagcoll/TextFormat.tcc: In function 'void tagcoll::textformat::parse(tagcoll::input::Input&, OUT)':
../tagcoll/TextFormat.tcc:141: warning: suggest explicit braces to avoid ambiguous 'else'
../tagcoll/TextFormat.tcc: In member function 'tagcoll::textformat::PatchAssembler<OUT>& tagcoll::textformat::PatchAssembler<OUT>::operator=(const std::pair<_U1, _U2>&)':
../tagcoll/TextFormat.tcc:187: warning: suggest explicit braces to avoid ambiguous 'else'
../tagcoll/TextFormat.tcc: In member function 'tagcoll::textformat::PatchBuilder<ITEM, TAG, ITEMSER, TAGSER>& tagcoll::textformat::PatchBuilder<ITEM, TAG, ITEMSER, TAGSER>::operator=(const std::pair<_U1, _U2>&)':
../tagcoll/TextFormat.tcc:248: warning: suggest explicit braces to avoid ambiguous 'else'
/bin/bash ../libtool --tag=CXX   --mode=link g++  -g -Wall -O2 -Wall -lwibble   -version-info 2:7:0  -o libtagcoll2.la -rpath /usr/lib input/base.lo input/memory.lo input/string.lo input/stdio.lo input/zlib.lo diskindex/mmap.lo diskindex/int.lo diskindex/string.lo expression.lo coll/intdiskindex.lo SmartHierarchy.lo TextFormat.lo tagexpr/libtagexpr.la 
mkdir .libs
rm -fr .libs/libtagcoll2.lax
mkdir .libs/libtagcoll2.lax
rm -fr .libs/libtagcoll2.lax/libtagexpr.a
mkdir .libs/libtagcoll2.lax/libtagexpr.a
(cd .libs/libtagcoll2.lax/libtagexpr.a && ar x /build/buildd/tagcoll2-2.0.7/tagcoll/tagexpr/.libs/libtagexpr.a)
copying selected object files to avoid basename conflicts...
ln diskindex/string.o .libs/libtagcoll2.lax/lt1-string.o || cp diskindex/string.o .libs/libtagcoll2.lax/lt1-string.o
ar cru .libs/libtagcoll2.a input/base.o input/memory.o input/string.o input/stdio.o input/zlib.o diskindex/mmap.o diskindex/int.o .libs/libtagcoll2.lax/lt1-string.o expression.o coll/intdiskindex.o SmartHierarchy.o TextFormat.o .libs/libtagcoll2.lax/libtagexpr.a/TagexprParser.o .libs/libtagcoll2.lax/libtagexpr.a/Tagexpr_parser_y.o .libs/libtagcoll2.lax/libtagexpr.a/Tagexpr_parser_l.o
ranlib .libs/libtagcoll2.a
rm -fr .libs/libtagcoll2.lax
creating libtagcoll2.la
(cd .libs && rm -f libtagcoll2.la && ln -s ../libtagcoll2.la libtagcoll2.la)
make[4]: Leaving directory `/build/buildd/tagcoll2-2.0.7/tagcoll'
make[3]: Leaving directory `/build/buildd/tagcoll2-2.0.7/tagcoll'
Making all in tools
make[3]: Entering directory `/build/buildd/tagcoll2-2.0.7/tools'
g++ -DHAVE_CONFIG_H -I. -I.. -I..    -g -Wall -O2 -Wall -c -o tagcoll.o tagcoll.cc
In file included from tagcoll.cc:840:
../tagcoll/TextFormat.tcc: In function 'void tagcoll::textformat::parse(tagcoll::input::Input&, OUT)':
../tagcoll/TextFormat.tcc:141: warning: suggest explicit braces to avoid ambiguous 'else'
../tagcoll/TextFormat.tcc: In member function 'tagcoll::textformat::PatchAssembler<OUT>& tagcoll::textformat::PatchAssembler<OUT>::operator=(const std::pair<_U1, _U2>&)':
../tagcoll/TextFormat.tcc:187: warning: suggest explicit braces to avoid ambiguous 'else'
../tagcoll/TextFormat.tcc: In member function 'tagcoll::textformat::PatchBuilder<ITEM, TAG, ITEMSER, TAGSER>& tagcoll::textformat::PatchBuilder<ITEM, TAG, ITEMSER, TAGSER>::operator=(const std::pair<_U1, _U2>&)':
../tagcoll/TextFormat.tcc:248: warning: suggest explicit braces to avoid ambiguous 'else'
/bin/bash ../libtool --tag=CXX   --mode=link g++  -g -Wall -O2 -Wall   -o tagcoll tagcoll.o ../tagcoll/libtagcoll2.la ../tagcoll/tagexpr/libtagexpr.la -lwibble   
mkdir .libs
g++ -g -Wall -O2 -Wall -o tagcoll tagcoll.o  ../tagcoll/.libs/libtagcoll2.a ../tagcoll/tagexpr/.libs/libtagexpr.a -lwibble
g++ -DHAVE_CONFIG_H -I. -I.. -I..    -g -Wall -O2 -Wall -c -o manpage.o manpage.cc
/bin/bash ../libtool --tag=CXX   --mode=link g++  -g -Wall -O2 -Wall   -o manpage manpage.o ../tagcoll/libtagcoll2.la ../tagcoll/tagexpr/libtagexpr.la -lwibble   
g++ -g -Wall -O2 -Wall -o manpage manpage.o  ../tagcoll/.libs/libtagcoll2.a ../tagcoll/tagexpr/.libs/libtagexpr.a -lwibble
make[3]: Leaving directory `/build/buildd/tagcoll2-2.0.7/tools'
Making all in bench
make[3]: Entering directory `/build/buildd/tagcoll2-2.0.7/bench'
g++ -DHAVE_CONFIG_H -I. -I.. -I..    -g -Wall -O2 -Wall -c -o bench-main.o bench-main.cc
g++ -DHAVE_CONFIG_H -I. -I.. -I..    -g -Wall -O2 -Wall -c -o Benchmark.o Benchmark.cc
g++ -DHAVE_CONFIG_H -I. -I.. -I..    -g -Wall -O2 -Wall -c -o collection.o collection.cc
/bin/bash ../libtool --tag=CXX   --mode=link g++  -g -Wall -O2 -Wall   -o benchmark bench-main.o Benchmark.o collection.o ../tagcoll/libtagcoll2.la 
mkdir .libs
g++ -g -Wall -O2 -Wall -o benchmark bench-main.o Benchmark.o collection.o  ../tagcoll/.libs/libtagcoll2.a -lwibble
make[3]: Leaving directory `/build/buildd/tagcoll2-2.0.7/bench'
Making all in doc
make[3]: Entering directory `/build/buildd/tagcoll2-2.0.7/doc'
doxygen libtagcoll.dox
Warning: Tag `USE_WINDOWS_ENCODING' at line 63 of file libtagcoll.dox has become obsolete.
To avoid this warning please update your configuration file using "doxygen -u"
Warning: Tag `MAX_DOT_GRAPH_WIDTH' at line 1102 of file libtagcoll.dox has become obsolete.
To avoid this warning please update your configuration file using "doxygen -u"
Warning: Tag `MAX_DOT_GRAPH_HEIGHT' at line 1110 of file libtagcoll.dox has become obsolete.
To avoid this warning please update your configuration file using "doxygen -u"
/build/buildd/tagcoll2-2.0.7/tagcoll/DerivedTags-tut.cc:38: Warning: documented function `void tut::to::test< 1 >' was not declared or defined.
/build/buildd/tagcoll2-2.0.7/tagcoll/DerivedTags-tut.cc:67: Warning: documented function `void tut::to::test< 2 >' was not declared or defined.
/build/buildd/tagcoll2-2.0.7/tagcoll/expression-tut.cc:36: Warning: documented function `void tut::to::test< 1 >' was not declared or defined.
/build/buildd/tagcoll2-2.0.7/tagcoll/Implications-tut.cc:38: Warning: documented function `void tut::to::test< 1 >' was not declared or defined.
/build/buildd/tagcoll2-2.0.7/tagcoll/Implications-tut.cc:70: Warning: documented function `void tut::to::test< 2 >' was not declared or defined.
/build/buildd/tagcoll2-2.0.7/tagcoll/patch-tut.cc:82: Warning: documented function `void tut::to::test< 1 >' was not declared or defined.
/build/buildd/tagcoll2-2.0.7/tagcoll/patch-tut.cc:106: Warning: documented function `void tut::to::test< 2 >' was not declared or defined.
/build/buildd/tagcoll2-2.0.7/tagcoll/patch-tut.cc:142: Warning: documented function `void tut::to::test< 3 >' was not declared or defined.
/build/buildd/tagcoll2-2.0.7/tagcoll/patch-tut.cc:167: Warning: documented function `void tut::to::test< 4 >' was not declared or defined.
/build/buildd/tagcoll2-2.0.7/tagcoll/patch-tut.cc:213: Warning: documented function `void tut::to::test< 5 >' was not declared or defined.
/build/buildd/tagcoll2-2.0.7/tagcoll/patch-tut.cc:240: Warning: documented function `void tut::to::test< 6 >' was not declared or defined.
/build/buildd/tagcoll2-2.0.7/tagcoll/SmartHierarchy-tut.cc:39: Warning: documented function `void tut::to::test< 1 >' was not declared or defined.
/build/buildd/tagcoll2-2.0.7/tagcoll/SmartHierarchy-tut.cc:68: Warning: documented function `void tut::to::test< 2 >' was not declared or defined.
/build/buildd/tagcoll2-2.0.7/tagcoll/TextFormat-tut.cc:38: Warning: documented function `void tut::to::test< 1 >' was not declared or defined.
/build/buildd/tagcoll2-2.0.7/tagcoll/TextFormat-tut.cc:55: Warning: documented function `void tut::to::test< 2 >' was not declared or defined.
/build/buildd/tagcoll2-2.0.7/tagcoll/TextFormat-tut.cc:91: Warning: documented function `void tut::to::test< 3 >' was not declared or defined.
/build/buildd/tagcoll2-2.0.7/tagcoll/TextFormat-tut.cc:130: Warning: documented function `void tut::to::test< 4 >' was not declared or defined.
/build/buildd/tagcoll2-2.0.7/tagcoll/TextFormat-tut.cc:164: Warning: documented function `void tut::to::test< 5 >' was not declared or defined.
format: png, adding :gd
format: cmap, not adding anything
format: png, adding :gd
format: cmap, not adding anything
format: png, adding :gd
format: cmap, not adding anything
format: png, adding :gd
format: cmap, not adding anything
format: png, adding :gd
format: cmap, not adding anything
format: png, adding :gd
format: cmap, not adding anything
format: png, adding :gd
format: cmap, not adding anything
format: png, adding :gd
format: cmap, not adding anything
format: png, adding :gd
format: cmap, not adding anything
format: png, adding :gd
format: cmap, not adding anything
format: png, adding :gd
format: cmap, not adding anything
format: png, adding :gd
format: cmap, not adding anything
format: png, adding :gd
format: cmap, not adding anything
format: png, adding :gd
format: cmap, not adding anything
format: png, adding :gd
format: cmap, not adding anything
format: png, adding :gd
format: cmap, not adding anything
format: png, adding :gd
format: cmap, not adding anything
format: png, adding :gd
format: cmap, not adding anything
/build/buildd/tagcoll2-2.0.7/tagcoll/tagexpr/Tagexpr_parser_l.cc:1513: Warning: argument `bytes' of command @param is not found in the argument list of yy_scan_bytes(yyconst char *yybytes, int _yybytes_len)
/build/buildd/tagcoll2-2.0.7/tagcoll/tagexpr/Tagexpr_parser_l.cc:1513: Warning: argument `len' of command @param is not found in the argument list of yy_scan_bytes(yyconst char *yybytes, int _yybytes_len)
/build/buildd/tagcoll2-2.0.7/tagcoll/tagexpr/Tagexpr_parser_l.cc:1513: Warning: The following parameters of yy_scan_bytes(yyconst char *yybytes, int _yybytes_len) are not documented:
  parameter yybytes
  parameter _yybytes_len
format: png, adding :gd
format: cmap, not adding anything
format: png, adding :gd
format: cmap, not adding anything
format: png, adding :gd
format: cmap, not adding anything
format: png, adding :gd
format: cmap, not adding anything
format: png, adding :gd
format: cmap, not adding anything
format: png, adding :gd
format: cmap, not adding anything
format: png, adding :gd
format: cmap, not adding anything
format: png, adding :gd
format: cmap, not adding anything
format: png, adding :gd
format: cmap, not adding anything
format: png, adding :gd
format: cmap, not adding anything
format: png, adding :gd
format: cmap, not adding anything
format: png, adding :gd
format: cmap, not adding anything
format: png, adding :gd
format: cmap, not adding anything
format: png, adding :gd
format: cmap, not adding anything
format: png, adding :gd
format: cmap, not adding anything
format: png, adding :gd
format: cmap, not adding anything
format: png, adding :gd
format: cmap, not adding anything
format: png, adding :gd
format: cmap, not adding anything
format: png, adding :gd
format: cmap, not adding anything
format: png, adding :gd
format: cmap, not adding anything
format: png, adding :gd
format: cmap, not adding anything
format: png, adding :gd
format: cmap, not adding anything
format: png, adding :gd
format: cmap, not adding anything
format: png, adding :gd
format: cmap, not adding anything
format: png, adding :gd
format: cmap, not adding anything
format: png, adding :gd
format: cmap, not adding anything
format: png, adding :gd
format: cmap, not adding anything
format: png, adding :gd
format: cmap, not adding anything
format: png, adding :gd
format: cmap, not adding anything
format: png, adding :gd
format: cmap, not adding anything
format: png, adding :gd
format: cmap, not adding anything
format: png, adding :gd
format: cmap, not adding anything
format: png, adding :gd
format: cmap, not adding anything
format: png, adding :gd
format: cmap, not adding anything
format: png, adding :gd
format: cmap, not adding anything
format: png, adding :gd
format: cmap, not adding anything
format: png, adding :gd
format: cmap, not adding anything
format: png, adding :gd
format: cmap, not adding anything
format: png, adding :gd
format: cmap, not adding anything
format: png, adding :gd
format: cmap, not adding anything
format: png, adding :gd
format: cmap, not adding anything
format: png, adding :gd
format: cmap, not adding anything
format: png, adding :gd
format: cmap, not adding anything
format: png, adding :gd
make[3]: Leaving directory `/build/buildd/tagcoll2-2.0.7/doc'
Making all in .
make[3]: Entering directory `/build/buildd/tagcoll2-2.0.7'
tools/manpage tagcoll doc/tagcoll-man-hooks > tagcoll.1 || rm tagcoll.1
make[3]: Leaving directory `/build/buildd/tagcoll2-2.0.7'
make[2]: Leaving directory `/build/buildd/tagcoll2-2.0.7'
make[1]: Leaving directory `/build/buildd/tagcoll2-2.0.7'
touch debian/stamp-makefile-build
/usr/bin/make -C . check
make[1]: Entering directory `/build/buildd/tagcoll2-2.0.7'
Making check in tagcoll
make[2]: Entering directory `/build/buildd/tagcoll2-2.0.7/tagcoll'
Making check in tagexpr
make[3]: Entering directory `/build/buildd/tagcoll2-2.0.7/tagcoll/tagexpr'
make[3]: Nothing to be done for `check'.
make[3]: Leaving directory `/build/buildd/tagcoll2-2.0.7/tagcoll/tagexpr'
Making check in .
make[3]: Entering directory `/build/buildd/tagcoll2-2.0.7/tagcoll'
/usr/bin/make  tests/libtagcoll-test
make[4]: Entering directory `/build/buildd/tagcoll2-2.0.7/tagcoll'
g++ -DHAVE_CONFIG_H -I. -I.. -I..     -g -Wall -O2 -Wall -c -o stream/sink-tut.o stream/sink-tut.cc
In file included from stream/sink-tut.cc:48:
../tagcoll/TextFormat.tcc: In function 'void tagcoll::textformat::parse(tagcoll::input::Input&, OUT)':
../tagcoll/TextFormat.tcc:141: warning: suggest explicit braces to avoid ambiguous 'else'
../tagcoll/TextFormat.tcc: In member function 'tagcoll::textformat::PatchAssembler<OUT>& tagcoll::textformat::PatchAssembler<OUT>::operator=(const std::pair<_U1, _U2>&)':
../tagcoll/TextFormat.tcc:187: warning: suggest explicit braces to avoid ambiguous 'else'
../tagcoll/TextFormat.tcc: In member function 'tagcoll::textformat::PatchBuilder<ITEM, TAG, ITEMSER, TAGSER>& tagcoll::textformat::PatchBuilder<ITEM, TAG, ITEMSER, TAGSER>::operator=(const std::pair<_U1, _U2>&)':
../tagcoll/TextFormat.tcc:248: warning: suggest explicit braces to avoid ambiguous 'else'
g++ -DHAVE_CONFIG_H -I. -I.. -I..     -g -Wall -O2 -Wall -c -o stream/filters-tut.o stream/filters-tut.cc
In file included from stream/filters-tut.cc:215:
../tagcoll/TextFormat.tcc: In function 'void tagcoll::textformat::parse(tagcoll::input::Input&, OUT)':
../tagcoll/TextFormat.tcc:141: warning: suggest explicit braces to avoid ambiguous 'else'
../tagcoll/TextFormat.tcc: In member function 'tagcoll::textformat::PatchAssembler<OUT>& tagcoll::textformat::PatchAssembler<OUT>::operator=(const std::pair<_U1, _U2>&)':
../tagcoll/TextFormat.tcc:187: warning: suggest explicit braces to avoid ambiguous 'else'
../tagcoll/TextFormat.tcc: In member function 'tagcoll::textformat::PatchBuilder<ITEM, TAG, ITEMSER, TAGSER>& tagcoll::textformat::PatchBuilder<ITEM, TAG, ITEMSER, TAGSER>::operator=(const std::pair<_U1, _U2>&)':
../tagcoll/TextFormat.tcc:248: warning: suggest explicit braces to avoid ambiguous 'else'
g++ -DHAVE_CONFIG_H -I. -I.. -I..     -g -Wall -O2 -Wall -c -o stream/expression-tut.o stream/expression-tut.cc
In file included from stream/expression-tut.cc:84:
../tagcoll/TextFormat.tcc: In function 'void tagcoll::textformat::parse(tagcoll::input::Input&, OUT)':
../tagcoll/TextFormat.tcc:141: warning: suggest explicit braces to avoid ambiguous 'else'
../tagcoll/TextFormat.tcc: In member function 'tagcoll::textformat::PatchAssembler<OUT>& tagcoll::textformat::PatchAssembler<OUT>::operator=(const std::pair<_U1, _U2>&)':
../tagcoll/TextFormat.tcc:187: warning: suggest explicit braces to avoid ambiguous 'else'
../tagcoll/TextFormat.tcc: In member function 'tagcoll::textformat::PatchBuilder<ITEM, TAG, ITEMSER, TAGSER>& tagcoll::textformat::PatchBuilder<ITEM, TAG, ITEMSER, TAGSER>::operator=(const std::pair<_U1, _U2>&)':
../tagcoll/TextFormat.tcc:248: warning: suggest explicit braces to avoid ambiguous 'else'
g++ -DHAVE_CONFIG_H -I. -I.. -I..     -g -Wall -O2 -Wall -c -o stream/substitutions-tut.o stream/substitutions-tut.cc
In file included from stream/substitutions-tut.cc:68:
../tagcoll/TextFormat.tcc: In function 'void tagcoll::textformat::parse(tagcoll::input::Input&, OUT)':
../tagcoll/TextFormat.tcc:141: warning: suggest explicit braces to avoid ambiguous 'else'
../tagcoll/TextFormat.tcc: In member function 'tagcoll::textformat::PatchAssembler<OUT>& tagcoll::textformat::PatchAssembler<OUT>::operator=(const std::pair<_U1, _U2>&)':
../tagcoll/TextFormat.tcc:187: warning: suggest explicit braces to avoid ambiguous 'else'
../tagcoll/TextFormat.tcc: In member function 'tagcoll::textformat::PatchBuilder<ITEM, TAG, ITEMSER, TAGSER>& tagcoll::textformat::PatchBuilder<ITEM, TAG, ITEMSER, TAGSER>::operator=(const std::pair<_U1, _U2>&)':
../tagcoll/TextFormat.tcc:248: warning: suggest explicit braces to avoid ambiguous 'else'
g++ -DHAVE_CONFIG_H -I. -I.. -I..     -g -Wall -O2 -Wall -c -o stream/patcher-tut.o stream/patcher-tut.cc
In file included from stream/patcher-tut.cc:108:
../tagcoll/TextFormat.tcc: In function 'void tagcoll::textformat::parse(tagcoll::input::Input&, OUT)':
../tagcoll/TextFormat.tcc:141: warning: suggest explicit braces to avoid ambiguous 'else'
../tagcoll/TextFormat.tcc: In member function 'tagcoll::textformat::PatchAssembler<OUT>& tagcoll::textformat::PatchAssembler<OUT>::operator=(const std::pair<_U1, _U2>&)':
../tagcoll/TextFormat.tcc:187: warning: suggest explicit braces to avoid ambiguous 'else'
../tagcoll/TextFormat.tcc: In member function 'tagcoll::textformat::PatchBuilder<ITEM, TAG, ITEMSER, TAGSER>& tagcoll::textformat::PatchBuilder<ITEM, TAG, ITEMSER, TAGSER>::operator=(const std::pair<_U1, _U2>&)':
../tagcoll/TextFormat.tcc:248: warning: suggest explicit braces to avoid ambiguous 'else'
g++ -DHAVE_CONFIG_H -I. -I.. -I..     -g -Wall -O2 -Wall -c -o diskindex/mmap-tut.o diskindex/mmap-tut.cc
diskindex/mmap-tut.cc: In member function 'virtual void tut::TestIndexer::encode(char*) const':
diskindex/mmap-tut.cc:56: error: 'memcpy' was not declared in this scope
make[4]: *** [diskindex/mmap-tut.o] Error 1
make[4]: Leaving directory `/build/buildd/tagcoll2-2.0.7/tagcoll'
make[3]: *** [check-am] Error 2
make[3]: Leaving directory `/build/buildd/tagcoll2-2.0.7/tagcoll'
make[2]: *** [check-recursive] Error 1
make[2]: Leaving directory `/build/buildd/tagcoll2-2.0.7/tagcoll'
make[1]: *** [check-recursive] Error 1
make[1]: Leaving directory `/build/buildd/tagcoll2-2.0.7'
make: *** [debian/stamp-makefile-check] Error 2
dpkg-buildpackage: failure: debian/rules build gave error exit status 2
******************************************************************************
Build finished at 20080125-0203
FAILED [dpkg-buildpackage died]
Purging chroot-toolchain-autotest/build/buildd/tagcoll2-2.0.7
------------------------------------------------------------------------------
  /usr/bin/sudo dpkg --root=/home/buildd/build-toolchain-autotest/chroot-toolchain-autotest --purge libxmu6 libx11-data m4 gsfonts fontconfig-config defoma ttf-dejavu-core libkpathsea4 gettext file zlib1g-dev libxaw7 libhtml-parser-perl libgd2-xpm libcupsys2 ttf-dejavu fontconfig liburi-perl libgraphviz3 libcairo2 ghostscript doxygen libxpm4 texlive-common x11-common autotools-dev libopencdk10 texlive-base-bin libpopt0 liblzo2-2 libfreetype6 libjpeg62 graphviz libxcb1 tex-common automake1.7 libgcrypt11 html2text flex debhelper libfontconfig1 libkeyutils1 libcupsimage2 libthai0 libmagic1 libtiff4 libexpat1 libxau6 fdupes libx11-6 ghostscript-x libkrb53 libglib2.0-0 mime-support libnewt0.52 whiptail intltool libpango1.0-common libxcb-xlib0 libxt6 libtasn1-3 libwww-perl libxdmcp6 texlive-base bison libhtml-tree-perl texlive-doc-base po-debconf libxml-parser-perl libpaper1 libgs8 libhtml-tagset-perl libboost-dev libxml2 gs pkg-config ed libpng12-0 libthai-data libice6 intltool-debian libltdl3 libpixman-1-0 libxrender1 libpoppler2 libdatrie0 libpango1.0-0 ucf cdbs libgpg-error0 gettext-base dh-buildinfo ttf-dejavu-extra libsm6 libxft2 libxext6 libtut-dev libgnutls13 libwibble-dev libpcre3 autoconf
(Reading database ... 17877 files and directories currently installed.)
Removing zlib1g-dev ...
Removing doxygen ...
Removing graphviz ...
Purging configuration files for graphviz ...
Removing flex ...
Purging configuration files for flex ...
Removing texlive-base ...
Running 'mktexlsr /usr/share/texmf /var/lib/texmf /usr/share/texmf-texlive'.
This may take some time... done.
Running 'fmtutil-sys --all'.
This may take some time... done.
Running 'updmap-sys'.
This may take some time... done.
Purging configuration files for texlive-base ...
Removing bison ...
Removing texlive-doc-base ...
Running 'mktexlsr /usr/share/texmf /var/lib/texmf /usr/share/texmf-texlive'.
This may take some time... done.
Purging configuration files for texlive-doc-base ...
Removing gs ...
Removing pkg-config ...
Removing cdbs ...
Removing dh-buildinfo ...
Removing libtut-dev ...
Removing libwibble-dev ...
Removing libgraphviz3 ...
Purging configuration files for libgraphviz3 ...
Removing texlive-base-bin ...
Purging configuration files for texlive-base-bin ...
Removing debhelper ...
Removing fdupes ...
Removing ghostscript-x ...
Removing mime-support ...
Purging configuration files for mime-support ...
Removing intltool ...
Removing po-debconf ...
Removing libxml-parser-perl ...
Removing libboost-dev ...
Removing ed ...
Removing intltool-debian ...
Removing libltdl3 ...
Purging configuration files for libltdl3 ...
Removing libpoppler2 ...
Purging configuration files for libpoppler2 ...
Removing libpango1.0-0 ...
Purging configuration files for libpango1.0-0 ...
Removing libxft2 ...
Purging configuration files for libxft2 ...
Removing libkpathsea4 ...
Purging configuration files for libkpathsea4 ...
Removing gettext ...
Removing libxaw7 ...
Purging configuration files for libxaw7 ...
Removing libgd2-xpm ...
Purging configuration files for libgd2-xpm ...
Removing libcairo2 ...
Purging configuration files for libcairo2 ...
Removing ghostscript ...
Purging font configuration of gs...
Purging category psprint..
Purging category cmap..
Purging category cid..
Purging category truetype..
Purging category gsfontderivative..
Purging category type3..
Purging category type1..
Purging configuration files for ghostscript ...
Removing libxpm4 ...
Purging configuration files for libxpm4 ...
Removing texlive-common ...
Removing tex-common ...
Purging configuration files for tex-common ...
Removing automake1.7 ...
Removing html2text ...
Purging configuration files for html2text ...
Removing libthai0 ...
Purging configuration files for libthai0 ...
Removing libglib2.0-0 ...
Purging configuration files for libglib2.0-0 ...
Removing libpango1.0-common ...
Purging font configuration of pango...
Purging category xfont..
Purging configuration files for libpango1.0-common ...
Removing libwww-perl ...
Removing libhtml-tree-perl ...
Removing libgs8 ...
Purging configuration files for libgs8 ...
Removing libxml2 ...
Purging configuration files for libxml2 ...
Removing libthai-data ...
Removing libpixman-1-0 ...
Purging configuration files for libpixman-1-0 ...
Removing libxrender1 ...
Purging configuration files for libxrender1 ...
Removing libdatrie0 ...
Purging configuration files for libdatrie0 ...
Removing gettext-base ...
Removing libpcre3 ...
Purging configuration files for libpcre3 ...
Removing autoconf ...
Purging configuration files for autoconf ...
Removing libxmu6 ...
Purging configuration files for libxmu6 ...
Removing m4 ...
Removing gsfonts ...
Unregistering PostScript fonts...
Updating fontconfig cache for /usr/share/fonts/type1/gsfonts
done.
Purging configuration files for gsfonts ...
Removing libhtml-parser-perl ...
Removing fontconfig ...
Purging font configuration of fontconfig...
Purging category cid..
Purging category truetype..
Purging category type1..
Updating fontconfig cache for /usr/share/fonts/truetype/ttf-dejavu
Purging configuration files for fontconfig ...
Removing liburi-perl ...
Removing autotools-dev ...
Removing libfontconfig1 ...
Purging configuration files for libfontconfig1 ...
Removing libcupsimage2 ...
Purging configuration files for libcupsimage2 ...
Removing libtiff4 ...
Purging configuration files for libtiff4 ...
Removing libexpat1 ...
Purging configuration files for libexpat1 ...
Removing libxt6 ...
Purging configuration files for libxt6 ...
Removing libpaper1 ...
Purging configuration files for libpaper1 ...
Removing libhtml-tagset-perl ...
Removing libpng12-0 ...
Purging configuration files for libpng12-0 ...
Removing libsm6 ...
Purging configuration files for libsm6 ...
Removing libxext6 ...
Purging configuration files for libxext6 ...
Removing fontconfig-config ...
Purging configuration files for fontconfig-config ...
Removing libcupsys2 ...
Purging configuration files for libcupsys2 ...
dpkg - warning: while removing libcupsys2, directory `/etc/cups' not empty so not removed.
Removing ttf-dejavu ...
Removing libfreetype6 ...
Purging configuration files for libfreetype6 ...
Removing libjpeg62 ...
Removing libx11-6 ...
Purging configuration files for libx11-6 ...
Removing libkrb53 ...
Purging configuration files for libkrb53 ...
Removing libxcb-xlib0 ...
Purging configuration files for libxcb-xlib0 ...
Removing libice6 ...
Purging configuration files for libice6 ...
Removing ucf ...
Purging configuration files for ucf ...
Removing ttf-dejavu-extra ...
Purging configuration files for ttf-dejavu-extra ...
Removing libgnutls13 ...
Purging configuration files for libgnutls13 ...
Removing libx11-data ...
Removing ttf-dejavu-core ...
Purging configuration files for ttf-dejavu-core ...
Removing libopencdk10 ...
Purging configuration files for libopencdk10 ...
Removing liblzo2-2 ...
Purging configuration files for liblzo2-2 ...
Removing libxcb1 ...
Purging configuration files for libxcb1 ...
Removing libgcrypt11 ...
Purging configuration files for libgcrypt11 ...
Removing libkeyutils1 ...
Purging configuration files for libkeyutils1 ...
Removing libxau6 ...
Purging configuration files for libxau6 ...
Removing libtasn1-3 ...
Purging configuration files for libtasn1-3 ...
Removing libxdmcp6 ...
Purging configuration files for libxdmcp6 ...
Removing libgpg-error0 ...
Purging configuration files for libgpg-error0 ...
Removing defoma ...
Purging configuration files for defoma ...
Removing file ...
Purging configuration files for file ...
Removing x11-common ...
Purging configuration files for x11-common ...
dpkg - warning: while removing x11-common, directory `/etc/X11' not empty so not removed.
dpkg - warning: while removing x11-common, directory `/usr/X11R6' not empty so not removed.
Removing libmagic1 ...
Purging configuration files for libmagic1 ...
Removing whiptail ...
Removing libpopt0 ...
Purging configuration files for libpopt0 ...
Removing libnewt0.52 ...
Purging configuration files for libnewt0.52 ...
******************************************************************************
Finished at 20080125-0204
Build needed 00:01:06, 19908k disk space




More information about the ubuntu-autotest mailing list