Log for failed build of recode_3.6-14 (dist=toolchain-autotest)
Build Daemon user
noreply at buildd.ubuntu.com
Thu Jan 24 14:51:40 GMT 2008
Automatic build of recode_3.6-14 on terranova by sbuild/i386 1.170.5
Build started at 20080124-1451
******************************************************************************
Checking available source versions...
Fetching source files...
Reading package lists...
Building dependency tree...
Need to get 2058kB of source archives.
Get:1 http://toolchain.ubunut.com toolchain-autotest/main recode 3.6-14 (dsc) [624B]
Get:2 http://toolchain.ubunut.com toolchain-autotest/main recode 3.6-14 (tar) [1752kB]
Get:3 http://toolchain.ubunut.com toolchain-autotest/main recode 3.6-14 (diff) [306kB]
Fetched 2058kB in 0s (19.5MB/s)
Download complete and in download only mode
** Using build dependencies supplied by package:
Build-Depends: gettext
Build-Depends-Indep: texi2html (>= 1.76)
Checking for already installed source dependencies...
gettext: missing
texi2html: missing
Checking for source dependency conflicts...
/usr/bin/sudo /usr/bin/apt-get --purge $CHROOT_OPTIONS -q -y install gettext texi2html
Reading package lists...
Building dependency tree...
The following extra packages will be installed:
gettext-base
Suggested packages:
cvs gettext-doc latex2html
Recommended packages:
curl wget lynx
The following NEW packages will be installed:
gettext gettext-base texi2html
0 upgraded, 3 newly installed, 0 to remove and 0 not upgraded.
Need to get 0B/2396kB of archives.
After unpacking 10.6MB of additional disk space will be used.
WARNING: The following packages cannot be authenticated!
gettext-base gettext texi2html
Authentication warning overridden.
Selecting previously deselected package gettext-base.
(Reading database ... 10461 files and directories currently installed.)
Unpacking gettext-base (from .../gettext-base_0.17-2ubuntu1_i386.deb) ...
Selecting previously deselected package gettext.
Unpacking gettext (from .../gettext_0.17-2ubuntu1_i386.deb) ...
Selecting previously deselected package texi2html.
Unpacking texi2html (from .../texi2html_1.78-1_all.deb) ...
Setting up gettext-base (0.17-2ubuntu1) ...
Setting up gettext (0.17-2ubuntu1) ...
Setting up texi2html (1.78-1) ...
Checking correctness of source dependencies...
Toolchain package versions: libc6-dev_2.7-5ubuntu2 make_3.81-3build1 dpkg-dev_1.14.15ubuntu1 linux-libc-dev_2.6.24-4.7 gcc-4.3_4.3-20080122-0ubuntu1 g++-4.3_4.3-20080122-0ubuntu1 binutils_2.18.1~cvs20080103-0ubuntu1 libstdc++6_4.3-20080122-0ubuntu1 libstdc++6-4.3-dev_4.3-20080122-0ubuntu1
------------------------------------------------------------------------------
dpkg-source: extracting recode in recode-3.6
dpkg-source: unpacking recode_3.6.orig.tar.gz
dpkg-source: applying /home/buildd/build-toolchain-autotest/recode_3.6-14.diff.gz
dpkg-buildpackage: source package recode
dpkg-buildpackage: source version 3.6-14
dpkg-buildpackage: host architecture i386
/usr/bin/fakeroot debian/rules clean
rm -f build
rm -f i18n/*.mo
/usr/bin/make distclean
make[1]: Entering directory `/build/buildd/recode-3.6'
make[1]: *** No rule to make target `distclean'. Stop.
make[1]: Leaving directory `/build/buildd/recode-3.6'
make: [clean] Error 2 (ignored)
rm -f `find . -name "*~"`
rm -rf debian/tmp debian/files* core debian/substvars
cd debian && rm -rf recode librecode0 librecode-dev recode-doc
debian/rules build
touch aclocal.m4
touch configure
touch stamp-h.in
touch config.h.in
touch Makefile.in
touch m4/Makefile.in
touch doc/Makefile.in
touch lib/Makefile.in
touch libiconv/Makefile.in
touch i18n/Makefile.in
touch src/Makefile.in
touch tests/Makefile.in
touch contrib/Makefile.in
./configure --prefix=/usr --without-included-gettext
creating cache ./config.cache
checking for a BSD compatible install... /usr/bin/install -c
checking whether build environment is sane... yes
checking whether make sets ${MAKE}... yes
checking for working aclocal-1.4... missing
checking for working autoconf... missing
checking for working automake-1.4... missing
checking for working autoheader... missing
checking for working makeinfo... missing
checking how to suppress newlines using echo... escape
checking for gcc... gcc
checking whether the C compiler (gcc ) works... yes
checking whether the C compiler (gcc ) is a cross-compiler... no
checking whether we are using GNU C... yes
checking whether gcc accepts -g... yes
checking how to run the C preprocessor... gcc -E
checking for AIX... no
checking for minix/config.h... no
checking for Cygwin environment... no
checking for mingw32 environment... no
checking host system type... i686-pc-linux-gnu
checking build system type... i686-pc-linux-gnu
checking for ld used by GCC... /usr/bin/ld
checking if the linker (/usr/bin/ld) is GNU ld... yes
checking for /usr/bin/ld option to reload object files... -r
checking for BSD-compatible nm... /usr/bin/nm -B
checking for a sed that does not truncate output... /bin/sed
checking whether ln -s works... yes
checking how to recognise dependent libraries... pass_all
checking for object suffix... o
checking for executable suffix... no
checking command to parse /usr/bin/nm -B output... ok
checking for dlfcn.h... yes
checking for ranlib... ranlib
checking for strip... strip
checking for objdir... .libs
checking for gcc option to produce PIC... -fPIC
checking if gcc PIC flag -fPIC works... yes
checking if gcc static flag -static works... yes
checking if gcc supports -c -o file.o... yes
checking if gcc supports -c -o file.lo... yes
checking if gcc supports -fno-rtti -fno-exceptions... yes
checking whether the linker (/usr/bin/ld) supports shared libraries... yes
checking how to hardcode library paths into programs... immediate
checking whether stripping libraries is possible... yes
checking dynamic linker characteristics... GNU/Linux ld.so
checking if libtool supports shared libraries... yes
checking whether to build shared libraries... yes
checking whether to build static libraries... yes
checking whether -lc should be explicitly linked in... no
creating libtool
checking for strerror in -lcposix... no
checking for gcc option to accept ANSI C... none needed
checking for function prototypes... yes
checking for working const... yes
checking for inline... inline
checking for flex... no
checking for ANSI C header files... yes
checking for limits.h... yes
checking for locale.h... yes
checking for memory.h... yes
checking for stdbool.h... yes
checking for stddef.h... yes
checking for stdlib.h... yes
checking for string.h... yes
checking for unistd.h... yes
checking for utime.h... yes
checking return type of signal handlers... void
checking whether time.h and sys/time.h may both be included... yes
checking for utime.h... (cached) yes
checking for struct utimbuf... yes
checking for dup2... yes
checking for mbrtowc... yes
checking for rename... yes
checking for setlocale... yes
checking for strerror... yes
checking for strndup... yes
checking for wcrtomb... yes
checking for strtol... yes
checking for strtoul... yes
checking for working alloca.h... yes
checking for alloca... yes
checking for vprintf... yes
checking for working malloc... yes
checking for working realloc... yes
checking host system type... i686-pc-linux-gnu
checking for langinfo.h... yes
checking for nl_langinfo... yes
checking for nl_langinfo and CODESET... yes
checking whether we are using the GNU C Library 2.1 or newer... yes
checking if malloc debugging is wanted... no
checking whether NLS is wanted... yes
checking for gettext... yes
checking for gettext in -lintl... no
checking whether the included gettext is preferred... no
checking for libintl.h... yes
checking for dcgettext... yes
checking for gettext... (cached) yes
checking for argz.h... yes
checking for limits.h... (cached) yes
checking for locale.h... (cached) yes
checking for malloc.h... yes
checking for string.h... (cached) yes
checking for unistd.h... (cached) yes
checking for sys/param.h... yes
checking for unistd.h... (cached) yes
checking for getpagesize... yes
checking for working mmap... yes
checking for getcwd... yes
checking for mempcpy... yes
checking for munmap... yes
checking for setlocale... (cached) yes
checking for stpcpy... yes
checking for strcasecmp... yes
checking for strchr... yes
checking for strdup... yes
checking for __argz_count... yes
checking for __argz_stringify... yes
checking for __argz_next... yes
checking for LC_MESSAGES... yes
checking which translations to install... be ca da de el eo es fr ga gl he id it nl pl pt pt_BR ro sl sv tr vi zh_CN
updating cache ./config.cache
creating ./config.status
creating Makefile
creating contrib/Makefile
creating doc/Makefile
creating i18n/Makefile
creating lib/Makefile
creating libiconv/Makefile
creating m4/Makefile
creating src/Makefile
creating tests/Makefile
creating tests/atconfig
creating config.h
/usr/bin/make CC="gcc" CFLAGS="-g -Wall -D_REENTRANT -O2"
make[1]: Entering directory `/build/buildd/recode-3.6'
/usr/bin/make all-recursive
make[2]: Entering directory `/build/buildd/recode-3.6'
Making all in m4
make[3]: Entering directory `/build/buildd/recode-3.6/m4'
make[3]: Nothing to be done for `all'.
make[3]: Leaving directory `/build/buildd/recode-3.6/m4'
Making all in doc
make[3]: Entering directory `/build/buildd/recode-3.6/doc'
make[3]: Leaving directory `/build/buildd/recode-3.6/doc'
Making all in lib
make[3]: Entering directory `/build/buildd/recode-3.6/lib'
gcc -DHAVE_CONFIG_H -I. -I. -I.. -I.. -I. -g -Wall -D_REENTRANT -O2 -c error.c
gcc -DHAVE_CONFIG_H -I. -I. -I.. -I.. -I. -g -Wall -D_REENTRANT -O2 -c getopt.c
gcc -DHAVE_CONFIG_H -I. -I. -I.. -I.. -I. -g -Wall -D_REENTRANT -O2 -c getopt1.c
gcc -DHAVE_CONFIG_H -I. -I. -I.. -I.. -I. -g -Wall -D_REENTRANT -O2 -c xstrdup.c
rm -f libreco.a
ar cru libreco.a error.o getopt.o getopt1.o xstrdup.o
ranlib libreco.a
make[3]: Leaving directory `/build/buildd/recode-3.6/lib'
Making all in libiconv
make[3]: Entering directory `/build/buildd/recode-3.6/libiconv'
/bin/sh ./config.charset 'i686-pc-linux-gnu' > t-charset.alias
mv t-charset.alias charset.alias
sed -e '/^#/d' -e 's/@''PACKAGE''@/recode/g' ref-add.sin > ref-add.sed-t
mv ref-add.sed-t ref-add.sed
sed -e '/^#/d' -e 's/@''PACKAGE''@/recode/g' ref-del.sin > ref-del.sed-t
mv ref-del.sed-t ref-del.sed
make[3]: Leaving directory `/build/buildd/recode-3.6/libiconv'
Making all in i18n
make[3]: Entering directory `/build/buildd/recode-3.6/i18n'
file=./`echo be | sed 's,.*/,,'`.mo \
&& rm -f $file && msgfmt -o $file be.po
file=./`echo ca | sed 's,.*/,,'`.mo \
&& rm -f $file && msgfmt -o $file ca.po
file=./`echo da | sed 's,.*/,,'`.mo \
&& rm -f $file && msgfmt -o $file da.po
file=./`echo de | sed 's,.*/,,'`.mo \
&& rm -f $file && msgfmt -o $file de.po
file=./`echo el | sed 's,.*/,,'`.mo \
&& rm -f $file && msgfmt -o $file el.po
file=./`echo eo | sed 's,.*/,,'`.mo \
&& rm -f $file && msgfmt -o $file eo.po
file=./`echo es | sed 's,.*/,,'`.mo \
&& rm -f $file && msgfmt -o $file es.po
file=./`echo fr | sed 's,.*/,,'`.mo \
&& rm -f $file && msgfmt -o $file fr.po
file=./`echo ga | sed 's,.*/,,'`.mo \
&& rm -f $file && msgfmt -o $file ga.po
file=./`echo gl | sed 's,.*/,,'`.mo \
&& rm -f $file && msgfmt -o $file gl.po
file=./`echo he | sed 's,.*/,,'`.mo \
&& rm -f $file && msgfmt -o $file he.po
file=./`echo id | sed 's,.*/,,'`.mo \
&& rm -f $file && msgfmt -o $file id.po
file=./`echo it | sed 's,.*/,,'`.mo \
&& rm -f $file && msgfmt -o $file it.po
file=./`echo nl | sed 's,.*/,,'`.mo \
&& rm -f $file && msgfmt -o $file nl.po
file=./`echo pl | sed 's,.*/,,'`.mo \
&& rm -f $file && msgfmt -o $file pl.po
file=./`echo pt | sed 's,.*/,,'`.mo \
&& rm -f $file && msgfmt -o $file pt.po
file=./`echo pt_BR | sed 's,.*/,,'`.mo \
&& rm -f $file && msgfmt -o $file pt_BR.po
file=./`echo ro | sed 's,.*/,,'`.mo \
&& rm -f $file && msgfmt -o $file ro.po
file=./`echo sl | sed 's,.*/,,'`.mo \
&& rm -f $file && msgfmt -o $file sl.po
file=./`echo sv | sed 's,.*/,,'`.mo \
&& rm -f $file && msgfmt -o $file sv.po
file=./`echo tr | sed 's,.*/,,'`.mo \
&& rm -f $file && msgfmt -o $file tr.po
file=./`echo vi | sed 's,.*/,,'`.mo \
&& rm -f $file && msgfmt -o $file vi.po
file=./`echo zh_CN | sed 's,.*/,,'`.mo \
&& rm -f $file && msgfmt -o $file zh_CN.po
make[3]: Leaving directory `/build/buildd/recode-3.6/i18n'
Making all in src
make[3]: Entering directory `/build/buildd/recode-3.6/src'
/bin/sh ../libtool --mode=compile gcc -DLIBDIR=\"/usr/lib\" -DHAVE_CONFIG_H -I.. -I. -I../lib -I../libiconv -g -Wall -D_REENTRANT -O2 -c argmatch.c
mkdir .libs
gcc -DLIBDIR=\"/usr/lib\" -DHAVE_CONFIG_H -I.. -I. -I../lib -I../libiconv -g -Wall -D_REENTRANT -O2 -c argmatch.c -fPIC -DPIC -o .libs/argmatch.lo
argmatch.c: In function '__argmatch_die':
argmatch.c:69: warning: implicit declaration of function 'exit'
argmatch.c:69: warning: incompatible implicit declaration of built-in function 'exit'
gcc -DLIBDIR=\"/usr/lib\" -DHAVE_CONFIG_H -I.. -I. -I../lib -I../libiconv -g -Wall -D_REENTRANT -O2 -c argmatch.c -o argmatch.o >/dev/null 2>&1
mv -f .libs/argmatch.lo argmatch.lo
/bin/sh ../libtool --mode=compile gcc -DLIBDIR=\"/usr/lib\" -DHAVE_CONFIG_H -I.. -I. -I../lib -I../libiconv -g -Wall -D_REENTRANT -O2 -c charname.c
rm -f .libs/charname.lo
gcc -DLIBDIR=\"/usr/lib\" -DHAVE_CONFIG_H -I.. -I. -I../lib -I../libiconv -g -Wall -D_REENTRANT -O2 -c charname.c -fPIC -DPIC -o .libs/charname.lo
In file included from common.h:140,
from charname.c:20:
recodext.h:221: error: width of 'ignore' exceeds its type
make[3]: *** [charname.lo] Error 1
make[3]: Leaving directory `/build/buildd/recode-3.6/src'
make[2]: *** [all-recursive] Error 1
make[2]: Leaving directory `/build/buildd/recode-3.6'
make[1]: *** [all-recursive-am] Error 2
make[1]: Leaving directory `/build/buildd/recode-3.6'
make: *** [build] Error 2
dpkg-buildpackage: failure: debian/rules build gave error exit status 2
******************************************************************************
Build finished at 20080124-1451
FAILED [dpkg-buildpackage died]
Purging chroot-toolchain-autotest/build/buildd/recode-3.6
------------------------------------------------------------------------------
/usr/bin/sudo dpkg --root=/home/buildd/build-toolchain-autotest/chroot-toolchain-autotest --purge texi2html gettext-base gettext
(Reading database ... 10802 files and directories currently installed.)
Removing texi2html ...
Removing gettext ...
Removing gettext-base ...
******************************************************************************
Finished at 20080124-1451
Build needed 00:00:07, 9576k disk space
More information about the ubuntu-autotest
mailing list