Log for failed build of aspell_0.60.5-1ubuntu1 (dist=toolchain-autotest)

Build Daemon user noreply at buildd.ubuntu.com
Thu Jan 24 11:08:15 GMT 2008


Automatic build of aspell_0.60.5-1ubuntu1 on terranova by sbuild/i386 1.170.5
Build started at 20080124-1107
******************************************************************************
Checking available source versions...
Fetching source files...
Reading package lists...
Building dependency tree...
Need to get 1837kB of source archives.
Get:1 http://toolchain.ubunut.com toolchain-autotest/main aspell 0.60.5-1ubuntu1 (dsc) [772B]
Get:2 http://toolchain.ubunut.com toolchain-autotest/main aspell 0.60.5-1ubuntu1 (tar) [1755kB]
Get:3 http://toolchain.ubunut.com toolchain-autotest/main aspell 0.60.5-1ubuntu1 (diff) [81.4kB]
Fetched 1837kB in 0s (18.4MB/s)
Download complete and in download only mode
** Using build dependencies supplied by package:
Build-Depends: debhelper (>= 4.0.4), libncursesw5-dev | libncurses-dev, cdbs (>= 0.4.0), dpatch
Checking for already installed source dependencies...
debhelper: missing
libncursesw5-dev: missing
libncurses-dev: missing
cdbs: missing
dpatch: missing
Checking for source dependency conflicts...
  /usr/bin/sudo /usr/bin/apt-get --purge $CHROOT_OPTIONS -q -y install debhelper libncursesw5-dev cdbs dpatch
Reading package lists...
Building dependency tree...
The following extra packages will be installed:
  autoconf automake1.7 autotools-dev fdupes file gettext gettext-base
  html2text intltool intltool-debian libexpat1 libhtml-parser-perl
  libhtml-tagset-perl libhtml-tree-perl libmagic1 libncursesw5 liburi-perl
  libwww-perl libxml-parser-perl m4 po-debconf
Suggested packages:
  autoconf2.13 autobook autoconf-archive gnu-standards autoconf-doc devscripts
  doc-base dh-make curl cvs gettext-doc libncurses5-dev libio-socket-ssl-perl
Recommended packages:
  patchutils libgpmg1 libmailtools-perl libhtml-format-perl
  libcompress-zlib-perl libmail-sendmail-perl libmail-box-perl
The following NEW packages will be installed:
  autoconf automake1.7 autotools-dev cdbs debhelper dpatch fdupes file gettext
  gettext-base html2text intltool intltool-debian libexpat1
  libhtml-parser-perl libhtml-tagset-perl libhtml-tree-perl libmagic1
  libncursesw5 libncursesw5-dev liburi-perl libwww-perl libxml-parser-perl m4
  po-debconf
0 upgraded, 25 newly installed, 0 to remove and 0 not upgraded.
Need to get 0B/7404kB of archives.
After unpacking 24.0MB of additional disk space will be used.
WARNING: The following packages cannot be authenticated!
  gettext-base libncursesw5 libmagic1 file libexpat1 libhtml-tagset-perl
  liburi-perl libhtml-parser-perl libhtml-tree-perl libwww-perl
  libxml-parser-perl m4 autoconf autotools-dev automake1.7 html2text gettext
  intltool-debian po-debconf debhelper fdupes intltool cdbs dpatch
  libncursesw5-dev
Authentication warning overridden.
Selecting previously deselected package gettext-base.
(Reading database ... 10461 files and directories currently installed.)
Unpacking gettext-base (from .../gettext-base_0.17-2ubuntu1_i386.deb) ...
Selecting previously deselected package libncursesw5.
Unpacking libncursesw5 (from .../libncursesw5_5.6+20071124-1ubuntu1_i386.deb) ...
Selecting previously deselected package libmagic1.
Unpacking libmagic1 (from .../libmagic1_4.21-3_i386.deb) ...
Selecting previously deselected package file.
Unpacking file (from .../archives/file_4.21-3_i386.deb) ...
Selecting previously deselected package libexpat1.
Unpacking libexpat1 (from .../libexpat1_2.0.1-0ubuntu1_i386.deb) ...
Selecting previously deselected package libhtml-tagset-perl.
Unpacking libhtml-tagset-perl (from .../libhtml-tagset-perl_3.10-2_all.deb) ...
Selecting previously deselected package liburi-perl.
Unpacking liburi-perl (from .../liburi-perl_1.35.dfsg.1-1_all.deb) ...
Selecting previously deselected package libhtml-parser-perl.
Unpacking libhtml-parser-perl (from .../libhtml-parser-perl_3.56-1_i386.deb) ...
Selecting previously deselected package libhtml-tree-perl.
Unpacking libhtml-tree-perl (from .../libhtml-tree-perl_3.23-1_all.deb) ...
Selecting previously deselected package libwww-perl.
Unpacking libwww-perl (from .../libwww-perl_5.805-1_all.deb) ...
Selecting previously deselected package libxml-parser-perl.
Unpacking libxml-parser-perl (from .../libxml-parser-perl_2.34-4.3_i386.deb) ...
Selecting previously deselected package m4.
Unpacking m4 (from .../archives/m4_1.4.10-1_i386.deb) ...
Selecting previously deselected package autoconf.
Unpacking autoconf (from .../autoconf_2.61-4_all.deb) ...
Selecting previously deselected package autotools-dev.
Unpacking autotools-dev (from .../autotools-dev_20070725.1_all.deb) ...
Selecting previously deselected package automake1.7.
Unpacking automake1.7 (from .../automake1.7_1.7.9-9_all.deb) ...
Selecting previously deselected package html2text.
Unpacking html2text (from .../html2text_1.3.2a-3build1_i386.deb) ...
Selecting previously deselected package gettext.
Unpacking gettext (from .../gettext_0.17-2ubuntu1_i386.deb) ...
Selecting previously deselected package intltool-debian.
Unpacking intltool-debian (from .../intltool-debian_0.35.0+20060710.1_all.deb) ...
Selecting previously deselected package po-debconf.
Unpacking po-debconf (from .../po-debconf_1.0.10_all.deb) ...
Selecting previously deselected package debhelper.
Unpacking debhelper (from .../debhelper_5.0.62ubuntu1_all.deb) ...
Selecting previously deselected package fdupes.
Unpacking fdupes (from .../fdupes_1.40-4build1_i386.deb) ...
Selecting previously deselected package intltool.
Unpacking intltool (from .../intltool_0.37.0-1_all.deb) ...
Selecting previously deselected package cdbs.
Unpacking cdbs (from .../cdbs_0.4.50ubuntu2_all.deb) ...
Selecting previously deselected package dpatch.
Unpacking dpatch (from .../archives/dpatch_2.0.28_all.deb) ...
Selecting previously deselected package libncursesw5-dev.
Unpacking libncursesw5-dev (from .../libncursesw5-dev_5.6+20071124-1ubuntu1_i386.deb) ...
Setting up gettext-base (0.17-2ubuntu1) ...

Setting up libncursesw5 (5.6+20071124-1ubuntu1) ...

Setting up libmagic1 (4.21-3) ...

Setting up file (4.21-3) ...
Setting up libexpat1 (2.0.1-0ubuntu1) ...

Setting up libhtml-tagset-perl (3.10-2) ...
Setting up liburi-perl (1.35.dfsg.1-1) ...
Setting up libhtml-parser-perl (3.56-1) ...
Setting up libhtml-tree-perl (3.23-1) ...
Setting up libwww-perl (5.805-1) ...
Setting up libxml-parser-perl (2.34-4.3) ...
Setting up m4 (1.4.10-1) ...

Setting up autoconf (2.61-4) ...

Setting up autotools-dev (20070725.1) ...
Setting up automake1.7 (1.7.9-9) ...

Setting up html2text (1.3.2a-3build1) ...

Setting up gettext (0.17-2ubuntu1) ...

Setting up intltool-debian (0.35.0+20060710.1) ...
Setting up po-debconf (1.0.10) ...

Setting up debhelper (5.0.62ubuntu1) ...
Setting up fdupes (1.40-4build1) ...
Setting up intltool (0.37.0-1) ...
Setting up cdbs (0.4.50ubuntu2) ...

Setting up dpatch (2.0.28) ...
Setting up libncursesw5-dev (5.6+20071124-1ubuntu1) ...
Checking correctness of source dependencies...
Toolchain package versions: libc6-dev_2.7-5ubuntu2 make_3.81-3build1 dpkg-dev_1.14.15ubuntu1 linux-libc-dev_2.6.24-4.7 gcc-4.3_4.3-20080122-0ubuntu1 g++-4.3_4.3-20080122-0ubuntu1 binutils_2.18.1~cvs20080103-0ubuntu1 libstdc++6_4.3-20080122-0ubuntu1 libstdc++6-4.3-dev_4.3-20080122-0ubuntu1
------------------------------------------------------------------------------
dpkg-source: extracting aspell in aspell-0.60.5
dpkg-source: unpacking aspell_0.60.5.orig.tar.gz
dpkg-source: applying /home/buildd/build-toolchain-autotest/aspell_0.60.5-1ubuntu1.diff.gz
dpkg-buildpackage: source package aspell
dpkg-buildpackage: source version 0.60.5-1ubuntu1
dpkg-buildpackage: host architecture i386
 /usr/bin/fakeroot debian/rules clean
test -x debian/rules
dh_testroot
for i in ./config.guess ./config.sub ./config.rpath ; do \
		if test -e $i.cdbs-orig ; then \
			mv $i.cdbs-orig $i ; \
		fi ; \
	done
dh_clean 
/usr/bin/make -C . -k distclean
make[1]: Entering directory `/build/buildd/aspell-0.60.5'
make[1]: *** No rule to make target `distclean'.
make[1]: Leaving directory `/build/buildd/aspell-0.60.5'
make: [makefile-clean] Error 2 (ignored)
rm -f debian/stamp-makefile-build
rm -f debian/stamp-autotools-files
/usr/bin/make -f debian/rules reverse-config
make[1]: Entering directory `/build/buildd/aspell-0.60.5'
for i in ./config.guess ./config.sub ./config.rpath ; do \
		if test -e $i.cdbs-orig ; then \
			mv $i.cdbs-orig $i ; \
		fi ; \
	done
make[1]: Leaving directory `/build/buildd/aspell-0.60.5'
dpatch deapply-all
10_autotools not applied to ./ .
02_u-deva_common_data not applied to ./ .
01_debctrl_filter not applied to ./ .
rm -rf debian/patched
rm -f debian/stamp-patched
 debian/rules build
test -x debian/rules
mkdir -p "."
if test -e /usr/share/misc/config.guess ; then \
		for i in ./config.guess ; do \
			if ! test -e $i.cdbs-orig ; then \
				mv $i $i.cdbs-orig ; \
				cp --remove-destination /usr/share/misc/config.guess $i ; \
			fi ; \
		done ; \
	fi
if test -e /usr/share/misc/config.sub ; then \
		for i in ./config.sub ; do \
			if ! test -e $i.cdbs-orig ; then \
				mv $i $i.cdbs-orig ; \
				cp --remove-destination /usr/share/misc/config.sub $i ; \
			fi ; \
		done ; \
	fi
if test -e /usr/share/gnulib/config/config.rpath ; then \
		for i in ./config.rpath ; do \
			if ! test -e $i.cdbs-orig ; then \
				mv $i $i.cdbs-orig ; \
				cp --remove-destination /usr/share/gnulib/config/config.rpath $i ; \
			fi ; \
		done ; \
	fi
/usr/bin/make -f debian/rules reverse-config
make[1]: Entering directory `/build/buildd/aspell-0.60.5'
for i in ./config.guess ./config.sub ./config.rpath ; do \
		if test -e $i.cdbs-orig ; then \
			mv $i.cdbs-orig $i ; \
		fi ; \
	done
make[1]: Leaving directory `/build/buildd/aspell-0.60.5'
dpatch apply-all
applying patch 01_debctrl_filter to ./ ... ok.
applying patch 02_u-deva_common_data to ./ ... ok.
applying patch 10_autotools to ./ ... ok.
/usr/bin/make -f debian/rules update-config
make[1]: Entering directory `/build/buildd/aspell-0.60.5'
if test -e /usr/share/misc/config.guess ; then \
		for i in ./config.guess ; do \
			if ! test -e $i.cdbs-orig ; then \
				mv $i $i.cdbs-orig ; \
				cp --remove-destination /usr/share/misc/config.guess $i ; \
			fi ; \
		done ; \
	fi
if test -e /usr/share/misc/config.sub ; then \
		for i in ./config.sub ; do \
			if ! test -e $i.cdbs-orig ; then \
				mv $i $i.cdbs-orig ; \
				cp --remove-destination /usr/share/misc/config.sub $i ; \
			fi ; \
		done ; \
	fi
if test -e /usr/share/gnulib/config/config.rpath ; then \
		for i in ./config.rpath ; do \
			if ! test -e $i.cdbs-orig ; then \
				mv $i $i.cdbs-orig ; \
				cp --remove-destination /usr/share/gnulib/config/config.rpath $i ; \
			fi ; \
		done ; \
	fi
make[1]: Leaving directory `/build/buildd/aspell-0.60.5'
touch debian/stamp-patched
touch debian/stamp-autotools-files
chmod a+x /build/buildd/aspell-0.60.5/./configure
cd . && CC="cc" CXX="g++ -fpermissive" CFLAGS="-g -Wall -O2" CXXFLAGS="-g -Wall -O2" CPPFLAGS="" LDFLAGS="" /build/buildd/aspell-0.60.5/./configure --build=i486-linux-gnu --prefix=/usr --includedir="\${prefix}/include" --mandir="\${prefix}/share/man" --infodir="\${prefix}/share/info" --sysconfdir=/etc --localstatedir=/var --libexecdir="\${prefix}/lib/aspell" --disable-maintainer-mode --disable-dependency-tracking --srcdir=.  --enable-pkgdatadir=/usr/lib/aspell --enable-pkglibdir=/usr/lib/aspell 
checking build system type... i486-pc-linux-gnu
checking host system type... i486-pc-linux-gnu
checking target system type... i486-pc-linux-gnu
checking for a BSD-compatible install... /usr/bin/install -c
checking whether build environment is sane... yes
checking for gawk... no
checking for mawk... mawk
checking whether make sets $(MAKE)... yes
checking whether to enable maintainer-specific portions of Makefiles... no
checking for C++ compiler default output file name... a.out
checking whether the C++ compiler works... yes
checking whether we are cross compiling... no
checking for suffix of executables... 
checking for suffix of object files... o
checking whether we are using the GNU C++ compiler... yes
checking whether g++ -fpermissive accepts -g... yes
checking for style of include used by make... GNU
checking dependency style of g++ -fpermissive... none
checking for gcc... cc
checking whether we are using the GNU C compiler... yes
checking whether cc accepts -g... yes
checking for cc option to accept ISO C89... none needed
checking dependency style of cc... none
checking whether cc understands -c and -o together... yes
checking for a sed that does not truncate output... /bin/sed
checking for grep that handles long lines and -e... /bin/grep
checking for egrep... /bin/grep -E
checking for ld used by cc... /usr/bin/ld
checking if the linker (/usr/bin/ld) is GNU ld... yes
checking for /usr/bin/ld option to reload object files... -r
checking for BSD-compatible nm... /usr/bin/nm -B
checking whether ln -s works... yes
checking how to recognise dependent libraries... pass_all
checking how to run the C preprocessor... cc -E
checking for ANSI C header files... yes
checking for sys/types.h... yes
checking for sys/stat.h... yes
checking for stdlib.h... yes
checking for string.h... yes
checking for memory.h... yes
checking for strings.h... yes
checking for inttypes.h... yes
checking for stdint.h... yes
checking for unistd.h... yes
checking dlfcn.h usability... yes
checking dlfcn.h presence... yes
checking for dlfcn.h... yes
checking how to run the C++ preprocessor... g++ -fpermissive -E
checking for g77... no
checking for xlf... no
checking for f77... no
checking for frt... no
checking for pgf77... no
checking for cf77... no
checking for fort77... no
checking for fl32... no
checking for af77... no
checking for xlf90... no
checking for f90... no
checking for pgf90... no
checking for pghpf... no
checking for epcf90... no
checking for gfortran... no
checking for g95... no
checking for xlf95... no
checking for f95... no
checking for fort... no
checking for ifort... no
checking for ifc... no
checking for efc... no
checking for pgf95... no
checking for lf95... no
checking for ftn... no
checking whether we are using the GNU Fortran 77 compiler... no
checking whether  accepts -g... no
checking the maximum length of command line arguments... 32768
checking command to parse /usr/bin/nm -B output from cc object... ok
checking for objdir... .libs
checking for ar... ar
checking for ranlib... ranlib
checking for strip... strip
checking if cc supports -fno-rtti -fno-exceptions... no
checking for cc option to produce PIC... -fPIC
checking if cc PIC flag -fPIC works... yes
checking if cc static flag -static works... yes
checking if cc supports -c -o file.o... yes
checking whether the cc linker (/usr/bin/ld) supports shared libraries... yes
checking whether -lc should be explicitly linked in... no
checking dynamic linker characteristics... GNU/Linux ld.so
checking how to hardcode library paths into programs... immediate
checking whether stripping libraries is possible... yes
checking for shl_load... no
checking for shl_load in -ldld... no
checking for dlopen... no
checking for dlopen in -ldl... yes
checking whether a program can dlopen itself... yes
checking whether a statically linked program can dlopen itself... no
checking if libtool supports shared libraries... yes
checking whether to build shared libraries... yes
checking whether to build static libraries... no
configure: creating libtool
appending configuration tag "CXX" to libtool
checking for ld used by g++ -fpermissive... /usr/bin/ld
checking if the linker (/usr/bin/ld) is GNU ld... yes
checking whether the g++ -fpermissive linker (/usr/bin/ld) supports shared libraries... yes
checking for g++ -fpermissive option to produce PIC... -fPIC
checking if g++ -fpermissive PIC flag -fPIC works... yes
checking if g++ -fpermissive static flag -static works... yes
checking if g++ -fpermissive supports -c -o file.o... yes
checking whether the g++ -fpermissive linker (/usr/bin/ld) supports shared libraries... yes
checking dynamic linker characteristics... GNU/Linux ld.so
checking how to hardcode library paths into programs... immediate
appending configuration tag "F77" to libtool
checking for dlfcn.h... (cached) yes
checking for dlopen... (cached) no
checking for dlopen in -ldl... (cached) yes
checking for sed... /bin/sed
checking for perl... /usr/bin/perl
checking whether NLS is requested... yes
checking for msgfmt... /usr/bin/msgfmt
checking for gmsgfmt... /usr/bin/msgfmt
checking for xgettext... /usr/bin/xgettext
checking for msgmerge... /usr/bin/msgmerge
checking for ld used by GCC... /usr/bin/ld
checking if the linker (/usr/bin/ld) is GNU ld... yes
checking for shared library run path origin... done
checking for CFPreferencesCopyAppValue... no
checking for CFLocaleCopyCurrent... no
checking for GNU gettext in libc... yes
checking whether to use NLS... yes
checking where the gettext function comes from... libc
checking for dlfcn.h... (cached) yes
checking for dlopen in -ldl... (cached) yes
checking if file locking and truncating is supported... yes
checking if mmap and friends is supported... yes
checking if file ino is supported... no
checking if posix locals are supported... yes
checking if posix regex are supported... yes
checking for nl_langinfo and CODESET... yes
checking if posix mutexes are supported... yes
checking if mblen is supported... yes
checking for working curses library... found in -lncursesw
checking for wide character support in curses libraray... yes
checking if standard curses include sequence will work... no
checking if curses workaround I will work... no
checking if curses without Unix stuff will work... yes
checking for STL rel_ops pollution... no
configure: creating ./config.status
config.status: creating Makefile
config.status: creating gen/Makefile
config.status: creating common/Makefile
config.status: creating lib/Makefile
config.status: creating data/Makefile
config.status: creating auto/Makefile
config.status: creating modules/Makefile
config.status: creating modules/tokenizer/Makefile
config.status: creating modules/speller/Makefile
config.status: creating modules/speller/default/Makefile
config.status: creating interfaces/Makefile
config.status: creating interfaces/cc/Makefile
config.status: creating scripts/Makefile
config.status: creating examples/Makefile
config.status: creating prog/Makefile
config.status: creating manual/Makefile
config.status: creating po/Makefile.in
config.status: creating m4/Makefile
config.status: creating modules/filter/Makefile
config.status: creating myspell/Makefile
config.status: creating lib5/Makefile
config.status: creating gen/settings.h
config.status: executing depfiles commands
config.status: executing po-directories commands
config.status: creating po/POTFILES
config.status: creating po/Makefile
/usr/bin/make -C . 
make[1]: Entering directory `/build/buildd/aspell-0.60.5'
Making all in .
make[2]: Entering directory `/build/buildd/aspell-0.60.5'
/bin/bash ./libtool --tag=CXX --mode=compile g++ -fpermissive -DHAVE_CONFIG_H -I. -I. -I./gen  -I./gen -I./common -I./interfaces/cc/ -I./modules/speller/default/ -DLOCALEDIR="/usr/share/locale"   -g -Wall -O2 -fno-exceptions -c -o modules/filter/debctrl.lo modules/filter/debctrl.cpp
mkdir modules/filter/.libs
 g++ -fpermissive -DHAVE_CONFIG_H -I. -I. -I./gen -I./gen -I./common -I./interfaces/cc/ -I./modules/speller/default/ -DLOCALEDIR=/usr/share/locale -g -Wall -O2 -fno-exceptions -c modules/filter/debctrl.cpp  -fPIC -DPIC -o modules/filter/.libs/debctrl.o
In file included from ./common/indiv_filter.hpp:12,
                 from modules/filter/debctrl.cpp:11:
./common/string.hpp:495: error: explicit template specialization cannot have a storage class
./common/errors.hpp:104: warning: 'acommon::other_error' defined but not used
./common/errors.hpp:105: warning: 'acommon::operation_not_supported_error' defined but not used
./common/errors.hpp:106: warning: 'acommon::cant_copy' defined but not used
./common/errors.hpp:107: warning: 'acommon::unimplemented_method' defined but not used
./common/errors.hpp:108: warning: 'acommon::file_error' defined but not used
./common/errors.hpp:109: warning: 'acommon::cant_open_file_error' defined but not used
./common/errors.hpp:110: warning: 'acommon::cant_read_file' defined but not used
./common/errors.hpp:111: warning: 'acommon::cant_write_file' defined but not used
./common/errors.hpp:112: warning: 'acommon::invalid_name' defined but not used
./common/errors.hpp:113: warning: 'acommon::bad_file_format' defined but not used
./common/errors.hpp:114: warning: 'acommon::dir_error' defined but not used
./common/errors.hpp:115: warning: 'acommon::cant_read_dir' defined but not used
./common/errors.hpp:116: warning: 'acommon::config_error' defined but not used
./common/errors.hpp:117: warning: 'acommon::unknown_key' defined but not used
./common/errors.hpp:118: warning: 'acommon::cant_change_value' defined but not used
./common/errors.hpp:119: warning: 'acommon::bad_key' defined but not used
./common/errors.hpp:120: warning: 'acommon::bad_value' defined but not used
./common/errors.hpp:121: warning: 'acommon::duplicate' defined but not used
./common/errors.hpp:122: warning: 'acommon::key_not_string' defined but not used
./common/errors.hpp:123: warning: 'acommon::key_not_int' defined but not used
./common/errors.hpp:124: warning: 'acommon::key_not_bool' defined but not used
./common/errors.hpp:125: warning: 'acommon::key_not_list' defined but not used
./common/errors.hpp:126: warning: 'acommon::no_value_reset' defined but not used
./common/errors.hpp:127: warning: 'acommon::no_value_enable' defined but not used
./common/errors.hpp:128: warning: 'acommon::no_value_disable' defined but not used
./common/errors.hpp:129: warning: 'acommon::no_value_clear' defined but not used
./common/errors.hpp:130: warning: 'acommon::language_related_error' defined but not used
./common/errors.hpp:131: warning: 'acommon::unknown_language' defined but not used
./common/errors.hpp:132: warning: 'acommon::unknown_soundslike' defined but not used
./common/errors.hpp:133: warning: 'acommon::language_not_supported' defined but not used
./common/errors.hpp:134: warning: 'acommon::no_wordlist_for_lang' defined but not used
./common/errors.hpp:135: warning: 'acommon::mismatched_language' defined but not used
./common/errors.hpp:136: warning: 'acommon::affix_error' defined but not used
./common/errors.hpp:137: warning: 'acommon::corrupt_affix' defined but not used
./common/errors.hpp:138: warning: 'acommon::invalid_cond' defined but not used
./common/errors.hpp:139: warning: 'acommon::invalid_cond_strip' defined but not used
./common/errors.hpp:140: warning: 'acommon::incorrect_encoding' defined but not used
./common/errors.hpp:141: warning: 'acommon::encoding_error' defined but not used
./common/errors.hpp:142: warning: 'acommon::unknown_encoding' defined but not used
./common/errors.hpp:143: warning: 'acommon::encoding_not_supported' defined but not used
./common/errors.hpp:144: warning: 'acommon::conversion_not_supported' defined but not used
./common/errors.hpp:145: warning: 'acommon::pipe_error' defined but not used
./common/errors.hpp:146: warning: 'acommon::cant_create_pipe' defined but not used
./common/errors.hpp:147: warning: 'acommon::process_died' defined but not used
./common/errors.hpp:148: warning: 'acommon::bad_input_error' defined but not used
./common/errors.hpp:149: warning: 'acommon::invalid_string' defined but not used
./common/errors.hpp:150: warning: 'acommon::invalid_word' defined but not used
./common/errors.hpp:151: warning: 'acommon::invalid_affix' defined but not used
./common/errors.hpp:152: warning: 'acommon::inapplicable_affix' defined but not used
./common/errors.hpp:153: warning: 'acommon::unknown_unichar' defined but not used
./common/errors.hpp:154: warning: 'acommon::word_list_flags_error' defined but not used
./common/errors.hpp:155: warning: 'acommon::invalid_flag' defined but not used
./common/errors.hpp:156: warning: 'acommon::conflicting_flags' defined but not used
./common/errors.hpp:157: warning: 'acommon::version_control_error' defined but not used
./common/errors.hpp:158: warning: 'acommon::bad_version_string' defined but not used
./common/errors.hpp:159: warning: 'acommon::filter_error' defined but not used
./common/errors.hpp:160: warning: 'acommon::cant_dlopen_file' defined but not used
./common/errors.hpp:161: warning: 'acommon::empty_filter' defined but not used
./common/errors.hpp:162: warning: 'acommon::no_such_filter' defined but not used
./common/errors.hpp:163: warning: 'acommon::confusing_version' defined but not used
./common/errors.hpp:164: warning: 'acommon::bad_version' defined but not used
./common/errors.hpp:165: warning: 'acommon::identical_option' defined but not used
./common/errors.hpp:166: warning: 'acommon::options_only' defined but not used
./common/errors.hpp:167: warning: 'acommon::invalid_option_modifier' defined but not used
./common/errors.hpp:168: warning: 'acommon::cant_describe_filter' defined but not used
./common/errors.hpp:169: warning: 'acommon::filter_mode_file_error' defined but not used
./common/errors.hpp:170: warning: 'acommon::mode_option_name' defined but not used
./common/errors.hpp:171: warning: 'acommon::no_filter_to_option' defined but not used
./common/errors.hpp:172: warning: 'acommon::bad_mode_key' defined but not used
./common/errors.hpp:173: warning: 'acommon::expect_mode_key' defined but not used
./common/errors.hpp:174: warning: 'acommon::mode_version_requirement' defined but not used
./common/errors.hpp:175: warning: 'acommon::confusing_mode_version' defined but not used
./common/errors.hpp:176: warning: 'acommon::bad_mode_version' defined but not used
./common/errors.hpp:177: warning: 'acommon::missing_magic_expression' defined but not used
./common/errors.hpp:178: warning: 'acommon::empty_file_ext' defined but not used
./common/errors.hpp:179: warning: 'acommon::filter_mode_expand_error' defined but not used
./common/errors.hpp:180: warning: 'acommon::unknown_mode' defined but not used
./common/errors.hpp:181: warning: 'acommon::mode_extend_expand' defined but not used
./common/errors.hpp:182: warning: 'acommon::filter_mode_magic_error' defined but not used
./common/errors.hpp:183: warning: 'acommon::file_magic_pos' defined but not used
./common/errors.hpp:184: warning: 'acommon::file_magic_range' defined but not used
./common/errors.hpp:185: warning: 'acommon::missing_magic' defined but not used
./common/errors.hpp:186: warning: 'acommon::bad_magic' defined but not used
./common/errors.hpp:187: warning: 'acommon::expression_error' defined but not used
./common/errors.hpp:188: warning: 'acommon::invalid_expression' defined but not used
make[2]: *** [modules/filter/debctrl.lo] Error 1
make[2]: Leaving directory `/build/buildd/aspell-0.60.5'
make[1]: *** [all-recursive] Error 1
make[1]: Leaving directory `/build/buildd/aspell-0.60.5'
make: *** [debian/stamp-makefile-build] Error 2
dpkg-buildpackage: failure: debian/rules build gave error exit status 2
******************************************************************************
Build finished at 20080124-1108
FAILED [dpkg-buildpackage died]
Purging chroot-toolchain-autotest/build/buildd/aspell-0.60.5
------------------------------------------------------------------------------
  /usr/bin/sudo dpkg --root=/home/buildd/build-toolchain-autotest/chroot-toolchain-autotest --purge m4 gettext file libhtml-parser-perl liburi-perl autotools-dev automake1.7 html2text debhelper libmagic1 libexpat1 fdupes intltool dpatch libwww-perl libhtml-tree-perl po-debconf libxml-parser-perl libhtml-tagset-perl intltool-debian cdbs gettext-base libncursesw5-dev libncursesw5 autoconf
(Reading database ... 11822 files and directories currently installed.)
Removing dpatch ...
Purging configuration files for dpatch ...
Removing cdbs ...
Removing libncursesw5-dev ...
Removing libncursesw5 ...
Purging configuration files for libncursesw5 ...
Removing debhelper ...
Removing fdupes ...
Removing intltool ...
Removing po-debconf ...
Removing libxml-parser-perl ...
Removing intltool-debian ...
Removing gettext ...
Removing file ...
Purging configuration files for file ...
Removing automake1.7 ...
Removing html2text ...
Purging configuration files for html2text ...
Removing libmagic1 ...
Purging configuration files for libmagic1 ...
Removing libexpat1 ...
Purging configuration files for libexpat1 ...
Removing libwww-perl ...
Removing libhtml-tree-perl ...
Removing gettext-base ...
Removing autoconf ...
Purging configuration files for autoconf ...
Removing m4 ...
Removing libhtml-parser-perl ...
Removing liburi-perl ...
Removing autotools-dev ...
Removing libhtml-tagset-perl ...
******************************************************************************
Finished at 20080124-1108
Build needed 00:00:13, 9676k disk space




More information about the ubuntu-autotest mailing list