Log for failed build of debtags_1.7.3ubuntu3 (dist=toolchain-autotest)

Build Daemon user noreply at buildd.ubuntu.com
Wed Jan 23 15:19:42 GMT 2008


Automatic build of debtags_1.7.3ubuntu3 on concordia by sbuild/lpia 1.170.5
Build started at 20080123-1518
******************************************************************************
Checking available source versions...
Fetching source files...
Reading package lists...
Building dependency tree...
Reading state information...
Need to get 806kB of source archives.
Get:1 http://toolchain.ubunut.com toolchain-autotest/main debtags 1.7.3ubuntu3 (dsc) [797B]
Get:2 http://toolchain.ubunut.com toolchain-autotest/main debtags 1.7.3ubuntu3 (tar) [805kB]
Fetched 806kB in 0s (11.6MB/s)
Download complete and in download only mode
** Using build dependencies supplied by package:
Build-Depends: c++abi2-dev, cdbs, debhelper (>> 4.1), dh-buildinfo, pkg-config, apt, libept-dev (>= 0.5.10ubuntu1), libept-dev (<< 0.6), zlib1g-dev, python-dev, python-docutils, libtagcoll2-dev (>= 2.0.4), libtagcoll2-dev (<< 2.1), libwibble-dev (>= 0.1.9), libwibble-dev (<< 0.2)
Checking for already installed source dependencies...
c++abi2-dev: already installed (=*=PROVIDED=*=)
cdbs: missing
debhelper: missing
dh-buildinfo: missing
pkg-config: missing
apt: already installed (0.7.9ubuntu5)
libept-dev: missing
libept-dev: missing
zlib1g-dev: missing
python-dev: missing
python-docutils: missing
libtagcoll2-dev: missing
libtagcoll2-dev: missing
libwibble-dev: missing
libwibble-dev: missing
Checking for source dependency conflicts...
  /usr/bin/sudo /usr/bin/apt-get --purge $CHROOT_OPTIONS -q -y install cdbs debhelper dh-buildinfo pkg-config libept-dev libept-dev zlib1g-dev python-dev python-docutils libtagcoll2-dev libtagcoll2-dev libwibble-dev libwibble-dev
Reading package lists...
Building dependency tree...
Reading state information...
The following extra packages will be installed:
  apt-utils autoconf automake1.7 autotools-dev fdupes file gettext
  gettext-base html2text intltool intltool-debian libapt-pkg-dev libboost-dev
  libept0 libexpat1 libglib2.0-0 libhtml-parser-perl libhtml-tagset-perl
  libhtml-tree-perl libmagic1 libncursesw5 libpcre3 libreadline5 libsqlite3-0
  libssl0.9.8 liburi-perl libwww-perl libxapian-dev libxapian15
  libxml-parser-perl m4 mime-support po-debconf python python-central
  python-roman python2.5 python2.5-dev readline-common
Suggested packages:
  autoconf2.13 autobook autoconf-archive gnu-standards autoconf-doc devscripts
  doc-base dh-make cvs gettext-doc libio-socket-ssl-perl xapian-tools
  python-doc python-tk python-profiler python2.5-doc
Recommended packages:
  automaken curl wget lynx libboost-date-time-dev libboost-doc
  libboost-filesystem-dev libboost-graph-dev libboost-iostreams-dev
  libboost-program-options-dev libboost-python-dev libboost-regex-dev
  libboost-serialization-dev libboost-signals-dev libboost-test-dev
  libboost-thread-dev libboost-wave-dev libglib2.0-data libgpmg1
  libmailtools-perl libhtml-format-perl libcompress-zlib-perl xapian-doc
  xapian-examples libmail-sendmail-perl libmail-box-perl
The following NEW packages will be installed:
  apt-utils autoconf automake1.7 autotools-dev cdbs debhelper dh-buildinfo
  fdupes file gettext gettext-base html2text intltool intltool-debian
  libapt-pkg-dev libboost-dev libept-dev libept0 libexpat1 libglib2.0-0
  libhtml-parser-perl libhtml-tagset-perl libhtml-tree-perl libmagic1
  libncursesw5 libpcre3 libreadline5 libsqlite3-0 libssl0.9.8 libtagcoll2-dev
  liburi-perl libwibble-dev libwww-perl libxapian-dev libxapian15
  libxml-parser-perl m4 mime-support pkg-config po-debconf python
  python-central python-dev python-docutils python-roman python2.5
  python2.5-dev readline-common zlib1g-dev
0 upgraded, 49 newly installed, 0 to remove and 1 not upgraded.
Need to get 972kB/21.5MB of archives.
After unpacking 94.4MB of additional disk space will be used.
WARNING: The following packages cannot be authenticated!
  apt-utils gettext-base libncursesw5 readline-common libreadline5
  libsqlite3-0 libssl0.9.8 mime-support python2.5 python libmagic1 file
  libexpat1 libhtml-tagset-perl liburi-perl libhtml-parser-perl
  libhtml-tree-perl libwww-perl libxml-parser-perl python-central m4 autoconf
  autotools-dev automake1.7 html2text gettext intltool-debian po-debconf
  debhelper fdupes intltool cdbs dh-buildinfo libapt-pkg-dev libboost-dev
  libxapian15 libept0 zlib1g-dev libwibble-dev libtagcoll2-dev libxapian-dev
  libept-dev libpcre3 libglib2.0-0 pkg-config python2.5-dev python-dev
  python-roman python-docutils
Authentication warning overridden.
Get:1 http://ftpmaster.internal hardy/main libept0 0.5.12ubuntu1 [183kB]
Get:2 http://ftpmaster.internal hardy/main libept-dev 0.5.12ubuntu1 [789kB]
Fetched 972kB in 0s (8461kB/s)
dpkg - warning, overriding problem because --force enabled:
 package architecture (lpia) does not match system (i386)
Selecting previously deselected package apt-utils.
(Reading database ... 9902 files and directories currently installed.)
Unpacking apt-utils (from .../apt-utils_0.7.9ubuntu5_lpia.deb) ...
dpkg - warning, overriding problem because --force enabled:
 package architecture (lpia) does not match system (i386)
Selecting previously deselected package gettext-base.
Unpacking gettext-base (from .../gettext-base_0.17-2ubuntu1_lpia.deb) ...
dpkg - warning, overriding problem because --force enabled:
 package architecture (lpia) does not match system (i386)
Selecting previously deselected package libncursesw5.
Unpacking libncursesw5 (from .../libncursesw5_5.6+20071124-1ubuntu1_lpia.deb) ...
Selecting previously deselected package readline-common.
Unpacking readline-common (from .../readline-common_5.2-3build1_all.deb) ...
dpkg - warning, overriding problem because --force enabled:
 package architecture (lpia) does not match system (i386)
Selecting previously deselected package libreadline5.
Unpacking libreadline5 (from .../libreadline5_5.2-3build1_lpia.deb) ...
dpkg - warning, overriding problem because --force enabled:
 package architecture (lpia) does not match system (i386)
Selecting previously deselected package libsqlite3-0.
Unpacking libsqlite3-0 (from .../libsqlite3-0_3.4.2-2_lpia.deb) ...
dpkg - warning, overriding problem because --force enabled:
 package architecture (lpia) does not match system (i386)
Selecting previously deselected package libssl0.9.8.
Unpacking libssl0.9.8 (from .../libssl0.9.8_0.9.8g-3ubuntu1_lpia.deb) ...
Selecting previously deselected package mime-support.
Unpacking mime-support (from .../mime-support_3.39-1_all.deb) ...
dpkg - warning, overriding problem because --force enabled:
 package architecture (lpia) does not match system (i386)
Selecting previously deselected package python2.5.
Unpacking python2.5 (from .../python2.5_2.5.1-6ubuntu1_lpia.deb) ...
Selecting previously deselected package python.
Unpacking python (from .../python_2.5.1-1ubuntu2_all.deb) ...
dpkg - warning, overriding problem because --force enabled:
 package architecture (lpia) does not match system (i386)
Selecting previously deselected package libmagic1.
Unpacking libmagic1 (from .../libmagic1_4.21-3_lpia.deb) ...
dpkg - warning, overriding problem because --force enabled:
 package architecture (lpia) does not match system (i386)
Selecting previously deselected package file.
Unpacking file (from .../archives/file_4.21-3_lpia.deb) ...
dpkg - warning, overriding problem because --force enabled:
 package architecture (lpia) does not match system (i386)
Selecting previously deselected package libexpat1.
Unpacking libexpat1 (from .../libexpat1_2.0.1-0ubuntu1_lpia.deb) ...
Selecting previously deselected package libhtml-tagset-perl.
Unpacking libhtml-tagset-perl (from .../libhtml-tagset-perl_3.10-2_all.deb) ...
Selecting previously deselected package liburi-perl.
Unpacking liburi-perl (from .../liburi-perl_1.35.dfsg.1-1_all.deb) ...
dpkg - warning, overriding problem because --force enabled:
 package architecture (lpia) does not match system (i386)
Selecting previously deselected package libhtml-parser-perl.
Unpacking libhtml-parser-perl (from .../libhtml-parser-perl_3.56-1_lpia.deb) ...
Selecting previously deselected package libhtml-tree-perl.
Unpacking libhtml-tree-perl (from .../libhtml-tree-perl_3.23-1_all.deb) ...
Selecting previously deselected package libwww-perl.
Unpacking libwww-perl (from .../libwww-perl_5.805-1_all.deb) ...
dpkg - warning, overriding problem because --force enabled:
 package architecture (lpia) does not match system (i386)
Selecting previously deselected package libxml-parser-perl.
Unpacking libxml-parser-perl (from .../libxml-parser-perl_2.34-4.3_lpia.deb) ...
Selecting previously deselected package python-central.
Unpacking python-central (from .../python-central_0.5.15ubuntu3_all.deb) ...
dpkg - warning, overriding problem because --force enabled:
 package architecture (lpia) does not match system (i386)
Selecting previously deselected package m4.
Unpacking m4 (from .../archives/m4_1.4.10-1_lpia.deb) ...
Selecting previously deselected package autoconf.
Unpacking autoconf (from .../autoconf_2.61-4_all.deb) ...
Selecting previously deselected package autotools-dev.
Unpacking autotools-dev (from .../autotools-dev_20070725.1_all.deb) ...
Selecting previously deselected package automake1.7.
Unpacking automake1.7 (from .../automake1.7_1.7.9-9_all.deb) ...
dpkg - warning, overriding problem because --force enabled:
 package architecture (lpia) does not match system (i386)
Selecting previously deselected package html2text.
Unpacking html2text (from .../html2text_1.3.2a-3build1_lpia.deb) ...
dpkg - warning, overriding problem because --force enabled:
 package architecture (lpia) does not match system (i386)
Selecting previously deselected package gettext.
Unpacking gettext (from .../gettext_0.17-2ubuntu1_lpia.deb) ...
Selecting previously deselected package intltool-debian.
Unpacking intltool-debian (from .../intltool-debian_0.35.0+20060710.1_all.deb) ...
Selecting previously deselected package po-debconf.
Unpacking po-debconf (from .../po-debconf_1.0.10_all.deb) ...
Selecting previously deselected package debhelper.
Unpacking debhelper (from .../debhelper_5.0.62ubuntu1_all.deb) ...
dpkg - warning, overriding problem because --force enabled:
 package architecture (lpia) does not match system (i386)
Selecting previously deselected package fdupes.
Unpacking fdupes (from .../fdupes_1.40-4build1_lpia.deb) ...
Selecting previously deselected package intltool.
Unpacking intltool (from .../intltool_0.37.0-1_all.deb) ...
Selecting previously deselected package cdbs.
Unpacking cdbs (from .../cdbs_0.4.50ubuntu2_all.deb) ...
Selecting previously deselected package dh-buildinfo.
Unpacking dh-buildinfo (from .../dh-buildinfo_0.9_all.deb) ...
dpkg - warning, overriding problem because --force enabled:
 package architecture (lpia) does not match system (i386)
Selecting previously deselected package libapt-pkg-dev.
Unpacking libapt-pkg-dev (from .../libapt-pkg-dev_0.7.9ubuntu5_lpia.deb) ...
dpkg - warning, overriding problem because --force enabled:
 package architecture (lpia) does not match system (i386)
Selecting previously deselected package libboost-dev.
Unpacking libboost-dev (from .../libboost-dev_1.34.1-4ubuntu1_lpia.deb) ...
dpkg - warning, overriding problem because --force enabled:
 package architecture (lpia) does not match system (i386)
Selecting previously deselected package libxapian15.
Unpacking libxapian15 (from .../libxapian15_1.0.5-1_lpia.deb) ...
dpkg - warning, overriding problem because --force enabled:
 package architecture (lpia) does not match system (i386)
Selecting previously deselected package libept0.
Unpacking libept0 (from .../libept0_0.5.12ubuntu1_lpia.deb) ...
dpkg - warning, overriding problem because --force enabled:
 package architecture (lpia) does not match system (i386)
Selecting previously deselected package zlib1g-dev.
Unpacking zlib1g-dev (from .../zlib1g-dev_1%3a1.2.3.3.dfsg-7ubuntu1_lpia.deb) ...
dpkg - warning, overriding problem because --force enabled:
 package architecture (lpia) does not match system (i386)
Selecting previously deselected package libwibble-dev.
Unpacking libwibble-dev (from .../libwibble-dev_0.1.11ubuntu1_lpia.deb) ...
dpkg - warning, overriding problem because --force enabled:
 package architecture (lpia) does not match system (i386)
Selecting previously deselected package libtagcoll2-dev.
Unpacking libtagcoll2-dev (from .../libtagcoll2-dev_2.0.7-1_lpia.deb) ...
dpkg - warning, overriding problem because --force enabled:
 package architecture (lpia) does not match system (i386)
Selecting previously deselected package libxapian-dev.
Unpacking libxapian-dev (from .../libxapian-dev_1.0.5-1_lpia.deb) ...
dpkg - warning, overriding problem because --force enabled:
 package architecture (lpia) does not match system (i386)
Selecting previously deselected package libept-dev.
Unpacking libept-dev (from .../libept-dev_0.5.12ubuntu1_lpia.deb) ...
dpkg - warning, overriding problem because --force enabled:
 package architecture (lpia) does not match system (i386)
Selecting previously deselected package libpcre3.
Unpacking libpcre3 (from .../libpcre3_7.3-2ubuntu1_lpia.deb) ...
dpkg - warning, overriding problem because --force enabled:
 package architecture (lpia) does not match system (i386)
Selecting previously deselected package libglib2.0-0.
Unpacking libglib2.0-0 (from .../libglib2.0-0_2.15.3-0ubuntu1_lpia.deb) ...
dpkg - warning, overriding problem because --force enabled:
 package architecture (lpia) does not match system (i386)
Selecting previously deselected package pkg-config.
Unpacking pkg-config (from .../pkg-config_0.22-1_lpia.deb) ...
dpkg - warning, overriding problem because --force enabled:
 package architecture (lpia) does not match system (i386)
Selecting previously deselected package python2.5-dev.
Unpacking python2.5-dev (from .../python2.5-dev_2.5.1-6ubuntu1_lpia.deb) ...
Selecting previously deselected package python-dev.
Unpacking python-dev (from .../python-dev_2.5.1-1ubuntu2_all.deb) ...
Selecting previously deselected package python-roman.
Unpacking python-roman (from .../python-roman_0.4-5_all.deb) ...
Selecting previously deselected package python-docutils.
Unpacking python-docutils (from .../python-docutils_0.4-5_all.deb) ...
Setting up apt-utils (0.7.9ubuntu5) ...

Setting up gettext-base (0.17-2ubuntu1) ...

Setting up libncursesw5 (5.6+20071124-1ubuntu1) ...

Setting up readline-common (5.2-3build1) ...

Setting up libreadline5 (5.2-3build1) ...

Setting up libsqlite3-0 (3.4.2-2) ...

Setting up libssl0.9.8 (0.9.8g-3ubuntu1) ...

Setting up mime-support (3.39-1) ...

Setting up python2.5 (2.5.1-6ubuntu1) ...

Setting up python (2.5.1-1ubuntu2) ...

Setting up libmagic1 (4.21-3) ...

Setting up file (4.21-3) ...
Setting up libexpat1 (2.0.1-0ubuntu1) ...

Setting up libhtml-tagset-perl (3.10-2) ...
Setting up liburi-perl (1.35.dfsg.1-1) ...
Setting up libhtml-parser-perl (3.56-1) ...
Setting up libhtml-tree-perl (3.23-1) ...
Setting up libwww-perl (5.805-1) ...
Setting up libxml-parser-perl (2.34-4.3) ...
Setting up python-central (0.5.15ubuntu3) ...
Setting up m4 (1.4.10-1) ...

Setting up autoconf (2.61-4) ...

Setting up autotools-dev (20070725.1) ...
Setting up automake1.7 (1.7.9-9) ...

Setting up html2text (1.3.2a-3build1) ...

Setting up gettext (0.17-2ubuntu1) ...

Setting up intltool-debian (0.35.0+20060710.1) ...
Setting up po-debconf (1.0.10) ...

Setting up debhelper (5.0.62ubuntu1) ...
Setting up fdupes (1.40-4build1) ...
Setting up intltool (0.37.0-1) ...
Setting up cdbs (0.4.50ubuntu2) ...

Setting up dh-buildinfo (0.9) ...
Setting up libapt-pkg-dev (0.7.9ubuntu5) ...
Setting up libboost-dev (1.34.1-4ubuntu1) ...
Setting up libxapian15 (1.0.5-1) ...

Setting up libept0 (0.5.12ubuntu1) ...

Setting up zlib1g-dev (1.2.3.3.dfsg-7ubuntu1) ...
Setting up libwibble-dev (0.1.11ubuntu1) ...
Setting up libtagcoll2-dev (2.0.7-1) ...
Setting up libxapian-dev (1.0.5-1) ...
Setting up libept-dev (0.5.12ubuntu1) ...
Setting up libpcre3 (7.3-2ubuntu1) ...

Setting up libglib2.0-0 (2.15.3-0ubuntu1) ...

Setting up pkg-config (0.22-1) ...
Setting up python2.5-dev (2.5.1-6ubuntu1) ...
Setting up python-dev (2.5.1-1ubuntu2) ...
Setting up python-roman (0.4-5) ...

Setting up python-docutils (0.4-5) ...

modified:
  fstab
  mtab
unknown:
  apt/apt.conf.d/99buildd
Checking correctness of source dependencies...
Toolchain package versions: libc6-dev_2.7-5ubuntu2 make_3.81-3build1 dpkg-dev_1.14.15ubuntu1 linux-libc-dev_2.6.24-4.7 gcc-4.3_4.3-20080122-0ubuntu1 g++-4.3_4.3-20080122-0ubuntu1 binutils_2.18.1~cvs20080103-0ubuntu1 libstdc++6_4.3-20080122-0ubuntu1 libstdc++6-4.3-dev_4.3-20080122-0ubuntu1
------------------------------------------------------------------------------
gpg: Signature made Tue Dec 18 15:01:25 2007 GMT using DSA key ID DD4D5088
gpg: Can't check signature: public key not found
dpkg-source: extracting debtags in debtags-1.7.3ubuntu3
dpkg-source: unpacking debtags_1.7.3ubuntu3.tar.gz
dpkg-buildpackage: source package debtags
dpkg-buildpackage: source version 1.7.3ubuntu3
dpkg-buildpackage: host architecture lpia
 /usr/bin/fakeroot debian/rules clean
test -x debian/rules
dh_testroot
for i in ./config.guess ./config.sub  ; do \
		if test -e $i.cdbs-orig ; then \
			mv $i.cdbs-orig $i ; \
		fi ; \
	done
dh_clean 
/usr/bin/make -C . -k distclean
make[1]: Entering directory `/build/buildd/debtags-1.7.3ubuntu3'
make[1]: *** No rule to make target `distclean'.
make[1]: Leaving directory `/build/buildd/debtags-1.7.3ubuntu3'
make: [makefile-clean] Error 2 (ignored)
rm -f debian/stamp-makefile-build
rm -f debian/stamp-autotools-files
 debian/rules build
test -x debian/rules
mkdir -p "."
if test -e /usr/share/misc/config.guess ; then \
		for i in ./config.guess ; do \
			if ! test -e $i.cdbs-orig ; then \
				mv $i $i.cdbs-orig ; \
				cp --remove-destination /usr/share/misc/config.guess $i ; \
			fi ; \
		done ; \
	fi
if test -e /usr/share/misc/config.sub ; then \
		for i in ./config.sub ; do \
			if ! test -e $i.cdbs-orig ; then \
				mv $i $i.cdbs-orig ; \
				cp --remove-destination /usr/share/misc/config.sub $i ; \
			fi ; \
		done ; \
	fi
touch debian/stamp-autotools-files
chmod a+x /build/buildd/debtags-1.7.3ubuntu3/./configure
cd . && CC="cc" CXX="g++" CFLAGS="-g -Wall -O2" CXXFLAGS="-g -Wall -O2" CPPFLAGS="" LDFLAGS="" /build/buildd/debtags-1.7.3ubuntu3/./configure --build=i686-linux-gnulp --prefix=/usr --includedir="\${prefix}/include" --mandir="\${prefix}/share/man" --infodir="\${prefix}/share/info" --sysconfdir=/etc --localstatedir=/var --libexecdir="\${prefix}/lib/debtags" --disable-maintainer-mode --disable-dependency-tracking --srcdir=.   --disable-shared 
checking for a BSD-compatible install... /usr/bin/install -c
checking whether build environment is sane... yes
checking for a thread-safe mkdir -p... /bin/mkdir -p
checking for gawk... no
checking for mawk... mawk
checking whether make sets $(MAKE)... yes
checking whether make sets $(MAKE)... (cached) yes
checking for C++ compiler default output file name... a.out
checking whether the C++ compiler works... yes
checking whether we are cross compiling... no
checking for suffix of executables... 
checking for suffix of object files... o
checking whether we are using the GNU C++ compiler... yes
checking whether g++ accepts -g... yes
checking for style of include used by make... GNU
checking dependency style of g++... none
checking how to run the C++ preprocessor... g++ -E
checking for gcc... cc
checking whether we are using the GNU C compiler... yes
checking whether cc accepts -g... yes
checking for cc option to accept ISO C89... none needed
checking dependency style of cc... none
checking for grep that handles long lines and -e... /bin/grep
checking for egrep... /bin/grep -E
checking for ANSI C header files... yes
checking build system type... i686-pc-linux-gnulp
checking host system type... i686-pc-linux-gnulp
checking for a sed that does not truncate output... /bin/sed
checking for ld used by cc... /usr/bin/ld
checking if the linker (/usr/bin/ld) is GNU ld... yes
checking for /usr/bin/ld option to reload object files... -r
checking for BSD-compatible nm... /usr/bin/nm -B
checking whether ln -s works... yes
checking how to recognise dependent libraries... pass_all
checking for sys/types.h... yes
checking for sys/stat.h... yes
checking for stdlib.h... yes
checking for string.h... yes
checking for memory.h... yes
checking for strings.h... yes
checking for inttypes.h... yes
checking for stdint.h... yes
checking for unistd.h... yes
checking how to run the C preprocessor... cc -E
checking dlfcn.h usability... yes
checking dlfcn.h presence... yes
checking for dlfcn.h... yes
checking how to run the C++ preprocessor... g++ -E
checking for g77... no
checking for xlf... no
checking for f77... no
checking for frt... no
checking for pgf77... no
checking for cf77... no
checking for fort77... no
checking for fl32... no
checking for af77... no
checking for xlf90... no
checking for f90... no
checking for pgf90... no
checking for pghpf... no
checking for epcf90... no
checking for gfortran... no
checking for g95... no
checking for xlf95... no
checking for f95... no
checking for fort... no
checking for ifort... no
checking for ifc... no
checking for efc... no
checking for pgf95... no
checking for lf95... no
checking for ftn... no
checking whether we are using the GNU Fortran 77 compiler... no
checking whether  accepts -g... no
checking the maximum length of command line arguments... 32768
checking command to parse /usr/bin/nm -B output from cc object... ok
checking for objdir... .libs
checking for ar... ar
checking for ranlib... ranlib
checking for strip... strip
checking if cc supports -fno-rtti -fno-exceptions... no
checking for cc option to produce PIC... -fPIC
checking if cc PIC flag -fPIC works... yes
checking if cc static flag -static works... yes
checking if cc supports -c -o file.o... yes
checking whether the cc linker (/usr/bin/ld) supports shared libraries... yes
checking dynamic linker characteristics... GNU/Linux ld.so
checking how to hardcode library paths into programs... immediate
checking whether stripping libraries is possible... yes
checking if libtool supports shared libraries... yes
checking whether to build shared libraries... no
checking whether to build static libraries... yes
configure: creating libtool
appending configuration tag "CXX" to libtool
checking for ld used by g++... /usr/bin/ld
checking if the linker (/usr/bin/ld) is GNU ld... yes
checking whether the g++ linker (/usr/bin/ld) supports shared libraries... yes
checking for g++ option to produce PIC... -fPIC
checking if g++ PIC flag -fPIC works... yes
checking if g++ static flag -static works... yes
checking if g++ supports -c -o file.o... yes
checking whether the g++ linker (/usr/bin/ld) supports shared libraries... yes
checking dynamic linker characteristics... GNU/Linux ld.so
checking how to hardcode library paths into programs... immediate
appending configuration tag "F77" to libtool
checking for python... /usr/bin/python
checking for python version... 2.5
checking for python platform... linux2
checking for python script directory... ${prefix}/lib/python2.5/site-packages
checking for python extension module directory... ${exec_prefix}/lib/python2.5/site-packages
checking for pkg-config... /usr/bin/pkg-config
checking pkg-config is at least version 0.9.0... yes
checking for LIBWIBBLE... yes
checking for LIBTAGCOLL2... yes
checking for LIBEPT... yes
checking for apt-get... /usr/bin/apt-get
configure: creating ./config.status
config.status: creating Makefile
config.status: creating tools/Makefile
config.status: creating examples/Makefile
config.status: creating doc/Makefile
config.status: creating config.h
config.status: executing depfiles commands
/usr/bin/make -C . 
make[1]: Entering directory `/build/buildd/debtags-1.7.3ubuntu3'
/usr/bin/make  all-recursive
make[2]: Entering directory `/build/buildd/debtags-1.7.3ubuntu3'
Making all in tools
make[3]: Entering directory `/build/buildd/debtags-1.7.3ubuntu3/tools'
g++ -DHAVE_CONFIG_H -I. -I.. -I.. -I/usr/include/tagcoll-2.0.7 -I/usr/include/boost-1_33_1/   -DSCRIPTDIR=\"/usr/share/debtags\"    -g -Wall -O2 -c -o Environment.o Environment.cc
g++ -DHAVE_CONFIG_H -I. -I.. -I.. -I/usr/include/tagcoll-2.0.7 -I/usr/include/boost-1_33_1/   -DSCRIPTDIR=\"/usr/share/debtags\"    -g -Wall -O2 -c -o SmartSearcher.o SmartSearcher.cc
g++ -DHAVE_CONFIG_H -I. -I.. -I.. -I/usr/include/tagcoll-2.0.7 -I/usr/include/boost-1_33_1/   -DSCRIPTDIR=\"/usr/share/debtags\"    -g -Wall -O2 -c -o debtags.o debtags.cc
debtags.cc: In member function 'bool SubstringTagMatcher::operator()(const ept::debtags::Facet&)':
debtags.cc:157: error: 'strcasestr' was not declared in this scope
debtags.cc:159: error: 'strcasestr' was not declared in this scope
debtags.cc:161: error: 'strcasestr' was not declared in this scope
debtags.cc: In member function 'bool SubstringTagMatcher::operator()(const ept::debtags::Tag&)':
debtags.cc:172: error: 'strcasestr' was not declared in this scope
debtags.cc:174: error: 'strcasestr' was not declared in this scope
debtags.cc:176: error: 'strcasestr' was not declared in this scope
In file included from debtags.cc:1287:
/usr/include/tagcoll-2.0.7/tagcoll/TextFormat.tcc: In function 'void tagcoll::textformat::parse(tagcoll::input::Input&, OUT)':
/usr/include/tagcoll-2.0.7/tagcoll/TextFormat.tcc:141: warning: suggest explicit braces to avoid ambiguous 'else'
/usr/include/tagcoll-2.0.7/tagcoll/TextFormat.tcc: In member function 'tagcoll::textformat::PatchAssembler<OUT>& tagcoll::textformat::PatchAssembler<OUT>::operator=(const std::pair<_U1, _U2>&)':
/usr/include/tagcoll-2.0.7/tagcoll/TextFormat.tcc:187: warning: suggest explicit braces to avoid ambiguous 'else'
/usr/include/tagcoll-2.0.7/tagcoll/TextFormat.tcc: In member function 'tagcoll::textformat::PatchBuilder<ITEM, TAG, ITEMSER, TAGSER>& tagcoll::textformat::PatchBuilder<ITEM, TAG, ITEMSER, TAGSER>::operator=(const std::pair<_U1, _U2>&)':
/usr/include/tagcoll-2.0.7/tagcoll/TextFormat.tcc:248: warning: suggest explicit braces to avoid ambiguous 'else'
make[3]: *** [debtags.o] Error 1
make[3]: Leaving directory `/build/buildd/debtags-1.7.3ubuntu3/tools'
make[2]: *** [all-recursive] Error 1
make[2]: Leaving directory `/build/buildd/debtags-1.7.3ubuntu3'
make[1]: *** [all] Error 2
make[1]: Leaving directory `/build/buildd/debtags-1.7.3ubuntu3'
make: *** [debian/stamp-makefile-build] Error 2
dpkg-buildpackage: failure: debian/rules build gave error exit status 2
******************************************************************************
Build finished at 20080123-1519
FAILED [dpkg-buildpackage died]
Purging chroot-toolchain-autotest/build/buildd/debtags-1.7.3ubuntu3
------------------------------------------------------------------------------
  /usr/bin/sudo dpkg --root=/home/buildd/build-toolchain-autotest/chroot-toolchain-autotest --purge python-docutils m4 readline-common gettext file zlib1g-dev libhtml-parser-perl python2.5 liburi-perl autotools-dev libssl0.9.8 automake1.7 html2text debhelper python-roman python libept0 libmagic1 libxapian15 libexpat1 fdupes libglib2.0-0 mime-support intltool libtagcoll2-dev libept-dev libwww-perl libhtml-tree-perl po-debconf libxml-parser-perl libhtml-tagset-perl libboost-dev libxapian-dev pkg-config python-dev intltool-debian cdbs gettext-base dh-buildinfo libapt-pkg-dev python-central libreadline5 libsqlite3-0 apt-utils python2.5-dev libwibble-dev libpcre3 libncursesw5 autoconf
(Reading database ... 16895 files and directories currently installed.)
Removing python-docutils ...
Purging configuration files for python-docutils ...
Removing python-roman ...
Removing libept-dev ...
Removing libxapian-dev ...
Removing pkg-config ...
Removing python-dev ...
Removing cdbs ...
Removing dh-buildinfo ...
Removing libapt-pkg-dev ...
Removing python-central ...
Purging configuration files for python-central ...
dpkg - warning: while removing python-central, directory `/usr/share/pycentral-data' not empty so not removed.
Removing apt-utils ...
Purging configuration files for apt-utils ...
Removing python2.5-dev ...
Removing debhelper ...
Removing python ...
Purging configuration files for python ...
Removing libept0 ...
Purging configuration files for libept0 ...
Removing libxapian15 ...
Purging configuration files for libxapian15 ...
Removing fdupes ...
Removing libglib2.0-0 ...
Purging configuration files for libglib2.0-0 ...
Removing intltool ...
Removing libtagcoll2-dev ...
Removing po-debconf ...
Removing libxml-parser-perl ...
Removing intltool-debian ...
Removing libwibble-dev ...
Removing libpcre3 ...
Purging configuration files for libpcre3 ...
Removing gettext ...
Removing file ...
Purging configuration files for file ...
Removing zlib1g-dev ...
Removing python2.5 ...
Purging configuration files for python2.5 ...
dpkg - warning: while removing python2.5, directory `/usr/share/applications' not empty so not removed.
Removing libssl0.9.8 ...
Purging configuration files for libssl0.9.8 ...
Removing automake1.7 ...
Removing html2text ...
Purging configuration files for html2text ...
Removing libmagic1 ...
Purging configuration files for libmagic1 ...
Removing libexpat1 ...
Purging configuration files for libexpat1 ...
Removing mime-support ...
Purging configuration files for mime-support ...
Removing libwww-perl ...
Removing libhtml-tree-perl ...
Removing libboost-dev ...
Removing gettext-base ...
Removing libreadline5 ...
Purging configuration files for libreadline5 ...
Removing libsqlite3-0 ...
Purging configuration files for libsqlite3-0 ...
Removing libncursesw5 ...
Purging configuration files for libncursesw5 ...
Removing autoconf ...
Purging configuration files for autoconf ...
Removing m4 ...
Removing readline-common ...
Purging configuration files for readline-common ...
Removing libhtml-parser-perl ...
Removing liburi-perl ...
Removing autotools-dev ...
Removing libhtml-tagset-perl ...
******************************************************************************
Finished at 20080123-1519
Build needed 00:00:12, 3692k disk space




More information about the ubuntu-autotest mailing list