Log for failed build of pychecker_0.8.17-5 (dist=hardy-autotest)

Build Daemon user noreply at buildd.ubuntu.com
Mon Jan 7 23:52:09 GMT 2008


Automatic build of pychecker_0.8.17-5 on terranova by sbuild/i386 1.170.5
Build started at 20080107-2351
******************************************************************************
Checking available source versions...
Fetching source files...
Reading package lists...
Building dependency tree...
Need to get 146kB of source archives.
Get:1 http://archive.internal hardy-autotest/main pychecker 0.8.17-5 (dsc) [610B]
Get:2 http://archive.internal hardy-autotest/main pychecker 0.8.17-5 (tar) [131kB]
Get:3 http://archive.internal hardy-autotest/main pychecker 0.8.17-5 (diff) [14.2kB]
Fetched 146kB in 0s (4557kB/s)
Download complete and in download only mode
** Using build dependencies supplied by package:
Build-Depends: python-support (>= 0.3), debhelper (>= 5.0.37.2)
Checking for already installed source dependencies...
python-support: missing
debhelper: missing
Checking for source dependency conflicts...
  /usr/bin/sudo /usr/bin/apt-get --purge $CHROOT_OPTIONS -q -y install python-support debhelper
Reading package lists...
Building dependency tree...
The following extra packages will be installed:
  file gettext gettext-base html2text intltool-debian libbz2-1.0 libmagic1
  libncursesw5 libreadline5 libsqlite3-0 libssl0.9.8 mime-support po-debconf
  python python2.5 readline-common
Suggested packages:
  dh-make cvs gettext-doc python-doc python-tk python-profiler python2.5-doc
Recommended packages:
  curl wget lynx libgpmg1 libmail-sendmail-perl libcompress-zlib-perl
  libmail-box-perl
The following NEW packages will be installed:
  debhelper file gettext gettext-base html2text intltool-debian libbz2-1.0
  libmagic1 libncursesw5 libreadline5 libsqlite3-0 libssl0.9.8 mime-support
  po-debconf python python-support python2.5 readline-common
0 upgraded, 18 newly installed, 0 to remove and 12 not upgraded.
Need to get 0B/9836kB of archives.
After unpacking 32.4MB of additional disk space will be used.
Selecting previously deselected package gettext-base.
(Reading database ... 9447 files and directories currently installed.)
Unpacking gettext-base (from .../gettext-base_0.17-2ubuntu1_i386.deb) ...
Selecting previously deselected package libbz2-1.0.
Unpacking libbz2-1.0 (from .../libbz2-1.0_1.0.4-2_i386.deb) ...
Selecting previously deselected package libncursesw5.
Unpacking libncursesw5 (from .../libncursesw5_5.6+20071124-1ubuntu1_i386.deb) ...
Selecting previously deselected package readline-common.
Unpacking readline-common (from .../readline-common_5.2-3build1_all.deb) ...
Selecting previously deselected package libreadline5.
Unpacking libreadline5 (from .../libreadline5_5.2-3build1_i386.deb) ...
Selecting previously deselected package libsqlite3-0.
Unpacking libsqlite3-0 (from .../libsqlite3-0_3.4.2-2_i386.deb) ...
Selecting previously deselected package libssl0.9.8.
Unpacking libssl0.9.8 (from .../libssl0.9.8_0.9.8g-3ubuntu1_i386.deb) ...
Selecting previously deselected package mime-support.
Unpacking mime-support (from .../mime-support_3.39-1_all.deb) ...
Selecting previously deselected package python2.5.
Unpacking python2.5 (from .../python2.5_2.5.1-6ubuntu1_i386.deb) ...
Selecting previously deselected package python.
Unpacking python (from .../python_2.5.1-1ubuntu2_all.deb) ...
Selecting previously deselected package libmagic1.
Unpacking libmagic1 (from .../libmagic1_4.21-3_i386.deb) ...
Selecting previously deselected package file.
Unpacking file (from .../archives/file_4.21-3_i386.deb) ...
Selecting previously deselected package python-support.
Unpacking python-support (from .../python-support_0.7.5_all.deb) ...
Selecting previously deselected package html2text.
Unpacking html2text (from .../html2text_1.3.2a-3build1_i386.deb) ...
Selecting previously deselected package gettext.
Unpacking gettext (from .../gettext_0.17-2ubuntu1_i386.deb) ...
Selecting previously deselected package intltool-debian.
Unpacking intltool-debian (from .../intltool-debian_0.35.0+20060710.1_all.deb) ...
Selecting previously deselected package po-debconf.
Unpacking po-debconf (from .../po-debconf_1.0.10_all.deb) ...
Selecting previously deselected package debhelper.
Unpacking debhelper (from .../debhelper_5.0.62ubuntu1_all.deb) ...
Setting up gettext-base (0.17-2ubuntu1) ...

Setting up libbz2-1.0 (1.0.4-2) ...

Setting up libncursesw5 (5.6+20071124-1ubuntu1) ...

Setting up readline-common (5.2-3build1) ...

Setting up libreadline5 (5.2-3build1) ...

Setting up libsqlite3-0 (3.4.2-2) ...

Setting up libssl0.9.8 (0.9.8g-3ubuntu1) ...

Setting up mime-support (3.39-1) ...

Setting up python2.5 (2.5.1-6ubuntu1) ...

Setting up python (2.5.1-1ubuntu2) ...

Setting up libmagic1 (4.21-3) ...

Setting up file (4.21-3) ...
Setting up python-support (0.7.5) ...

Setting up html2text (1.3.2a-3build1) ...

Setting up gettext (0.17-2ubuntu1) ...

Setting up intltool-debian (0.35.0+20060710.1) ...
Setting up po-debconf (1.0.10) ...

Setting up debhelper (5.0.62ubuntu1) ...
Checking correctness of source dependencies...
Toolchain package versions: libc6-dev_2.7-5ubuntu2 make_3.81-3build1 dpkg-dev_1.14.12ubuntu4 linux-libc-dev_2.6.24-3.5 gcc-4.2_4.2.2-4ubuntu3 g++-4.2_4.2.2-4ubuntu3 binutils_2.18.1~cvs20080103-0ubuntu1 libstdc++6_4.2.2-4ubuntu3 libstdc++6-4.2-dev_4.2.2-4ubuntu3
------------------------------------------------------------------------------
dpkg-source: extracting pychecker in pychecker-0.8.17
dpkg-source: unpacking pychecker_0.8.17.orig.tar.gz
dpkg-source: applying /home/buildd/build-hardy-autotest/pychecker_0.8.17-5.diff.gz
dpkg-buildpackage: source package pychecker
dpkg-buildpackage: source version 0.8.17-5
dpkg-buildpackage: host architecture i386
 /usr/bin/fakeroot debian/rules clean
dh_testdir
dh_testroot
rm -f build-stamp
/usr/bin/python ./setup.py --quiet clean
find . -name "*.pyc" | xargs rm -f
find . -name "*.pyo" | xargs rm -f
rm -f test_expected/*.results    # no need to keep around past regression test failures
rm -rf build debian/tmp
dh_clean
 debian/rules build
dh_testdir
/usr/bin/python ./setup.py --quiet build --build-base build install --no-compile --install-purelib debian/tmp/lib/pychecker
sh debian/regression.sh    # note: build will fail if regression tests fail
Running test1...
Running test2...
Running test3...
5c5
< UserDict.py:4: No doc string for class UserDict
---
> /usr/lib/python2.5/UserDict.py:4: No doc string for class UserDict
  test3 FAILED
Running test4...
Running test5...
Running test6...
Running test7...
Running test8...
Running test9...
Running test10...
Running test11...
Running test12...
Running test13...
Running test14...
Running test15...
Running test16...
Running test17...
8d7
< test_input/test17.py:16: Cannot return a value from __init__
  test17 FAILED
Running test18...
Running test19...
Running test20...
Running test21...
Running test22...
31,32d30
< test_input/test22.py:79: ... % 1 may be constant
< test_input/test22.py:81: ... % 1 may be constant
  test22 FAILED
Running test23...
Running test24...
Running test25...
Running test26...
Running test27...
Running test28...
Running test29...
Running test30...
Running test31...
Running test32...
Running test33...
Running test34...
5c5,9
< getopt.py:42: No doc string for class GetoptError
---
> /usr/lib/python2.5/getopt.py:42: No doc string for class GetoptError
> 
> /usr/lib/python2.5/locale.py:203: Local variable (digits) shadows global defined on line 4 in file test_input/test34.py
> /usr/lib/python2.5/locale.py:204: Local variable (digits) shadows global defined on line 4 in file test_input/test34.py
> /usr/lib/python2.5/locale.py:208: Local variable (digits) shadows global defined on line 4 in file test_input/test34.py
  test34 FAILED
Running test35...
Running test36...
Running test37...
Running test38...
Running test39...
Running test40...
Running test41...
Running test42...
Running test43...
Running test45...
Running test46...
Running test47...
Running test48...
25d24
< test_input/test48.py:57: Statement appears to have no effect
  test48 FAILED
Running test49...
Running test50...
Running test51...
Running test52...
Running test53...
5d4
< test_input/test53.py:5: Operator (~~) doesn't exist, statement has no effect
  test53 FAILED
Running test54...
Running test55...
Running test56...
Running test57...
Running test58...
Running test59...
Running test60...
Running test61...
Running test62...
Running test63...
Running test64...
Running test65...
Running test66...
Running test67...
Running test68...
Running test69...
Running test70...
Running test71...
5d4
< test_input/test71.py:8: Code appears to be unreachable
7d5
< test_input/test71.py:20: Code appears to be unreachable
  test71 FAILED
Running test72...
Running test73...
Running test74...
Running test75...
Running test76...
Running test77...
5c5
<     File "test_input/test77.py", line 8
---
>     File "test_input/test77.py", line 8, in <module>()
7c7
<   MyError: **error formatting exception value**
---
>   MyError: 
  test77 FAILED
Running test78...
Running test79...
Running test80...
Running test81...
Running test82...
Running test83...
Running test84...
Running test85...
Running test86...
Running test87...
15,16c15,16
< test_input/test87.py:16: Comparisons with True are not necessary and may not work as expected
< test_input/test87.py:16: Comparisons with true are not necessary and may not work as expected
---
> test_input/test87.py:17: Comparisons with True are not necessary and may not work as expected
> test_input/test87.py:18: Comparisons with true are not necessary and may not work as expected
  test87 FAILED
Running test88...
1a2,3
> test_input/test88.py:7: DeprecationWarning: the gopherlib module is deprecated
>   import gopherlib
  test88 FAILED
Running test89...
Running test90...
Running test92...
Running test93...
Running test94...
Running test95...
Running test96...
Running test97...
Running test98...
Running test1000...
Running test1001...
Running test1002...
Running test1003...
90/100 tests passed (10 failures).
Failed test(s): test3 test17 test22 test34 test48 test53 test71 test77 test87 test88
make: *** [build-stamp] Error 1
dpkg-buildpackage: failure: debian/rules build gave error exit status 2
******************************************************************************
Build finished at 20080107-2352
FAILED [dpkg-buildpackage died]
Purging chroot-hardy-autotest/build/buildd/pychecker-0.8.17
------------------------------------------------------------------------------
  /usr/bin/sudo dpkg --root=/home/buildd/build-hardy-autotest/chroot-hardy-autotest --purge readline-common gettext file python2.5 python-support libssl0.9.8 html2text debhelper python libmagic1 mime-support po-debconf intltool-debian gettext-base libreadline5 libbz2-1.0 libsqlite3-0 libncursesw5
(Reading database ... 10772 files and directories currently installed.)
Removing python-support ...
Purging configuration files for python-support ...
Removing debhelper ...
Removing python ...
Purging configuration files for python ...
Removing po-debconf ...
Removing intltool-debian ...
Removing gettext ...
Removing file ...
Purging configuration files for file ...
Removing python2.5 ...
Purging configuration files for python2.5 ...
dpkg - warning: while removing python2.5, directory `/usr/share/applications' not empty so not removed.
Removing libssl0.9.8 ...
Purging configuration files for libssl0.9.8 ...
Removing html2text ...
Purging configuration files for html2text ...
Removing libmagic1 ...
Purging configuration files for libmagic1 ...
Removing mime-support ...
Purging configuration files for mime-support ...
Removing gettext-base ...
Removing libreadline5 ...
Purging configuration files for libreadline5 ...
Removing libbz2-1.0 ...
Purging configuration files for libbz2-1.0 ...
Removing libsqlite3-0 ...
Purging configuration files for libsqlite3-0 ...
Removing libncursesw5 ...
Purging configuration files for libncursesw5 ...
Removing readline-common ...
Purging configuration files for readline-common ...
******************************************************************************
Finished at 20080107-2352
Build needed 00:00:07, 3280k disk space




More information about the ubuntu-autotest mailing list