Log for failed build of grub_0.97-29ubuntu14 (dist=hardy-autotest)
Build Daemon user
noreply at buildd.ubuntu.com
Mon Feb 18 00:12:39 GMT 2008
Automatic build of grub_0.97-29ubuntu14 on king by sbuild/amd64 1.170.5
Build started at 20080218-0011
******************************************************************************
Checking available source versions...
Fetching source files...
Reading package lists...
Building dependency tree...
Reading state information...
Need to get 1074kB of source archives.
Get:1 http://archive.internal hardy-autotest/main grub 0.97-29ubuntu14 (dsc) [1065B]
Get:2 http://archive.internal hardy-autotest/main grub 0.97-29ubuntu14 (tar) [972kB]
Get:3 http://archive.internal hardy-autotest/main grub 0.97-29ubuntu14 (diff) [101kB]
Fetched 1074kB in 0s (29.4MB/s)
Download complete and in download only mode
** Using build dependencies supplied by package:
Build-Depends: autoconf, automake1.9, autotools-dev, debhelper (>= 4.0.0), gcc-4.2-multilib [amd64 kfreebsd-amd64], libc6-dev-i386 [amd64 kfreebsd-amd64], libncurses5-dev | libncurses-dev, po-debconf, texinfo
Build-Depends-Indep: texi2html
Checking for already installed source dependencies...
autoconf: missing
automake1.9: missing
autotools-dev: missing
debhelper: missing
gcc-4.2-multilib: missing
libc6-dev-i386: missing
libncurses5-dev: missing
libncurses-dev: missing
po-debconf: missing
texinfo: missing
Checking for source dependency conflicts...
/usr/bin/sudo /usr/bin/apt-get --purge $CHROOT_OPTIONS -q -y install autoconf automake1.9 autotools-dev debhelper gcc-4.2-multilib libc6-dev-i386 libncurses5-dev po-debconf texinfo
Reading package lists...
Building dependency tree...
Reading state information...
The following packages were automatically installed and are no longer required:
upstart-compat-sysv system-services startup-tasks upstart
Use 'apt-get autoremove' to remove them.
The following extra packages will be installed:
file gettext gettext-base html2text intltool-debian lib32gomp1 libmagic1 m4
Suggested packages:
autoconf2.13 autobook autoconf-archive gnu-standards autoconf-doc
automake1.9-doc dh-make lib32mudflap0 cvs gettext-doc texlive-base
texlive-latex-base texlive-generic-recommended texinfo-doc-nonfree
Recommended packages:
automaken curl wget lynx gcc-multilib libmail-sendmail-perl
libcompress-zlib-perl libmail-box-perl
The following NEW packages will be installed:
autoconf automake1.9 autotools-dev debhelper file gcc-4.2-multilib gettext
gettext-base html2text intltool-debian lib32gomp1 libc6-dev-i386 libmagic1
libncurses5-dev m4 po-debconf texinfo
0 upgraded, 17 newly installed, 0 to remove and 0 not upgraded.
Need to get 0B/7966kB of archives.
After unpacking 32.2MB of additional disk space will be used.
WARNING: The following packages cannot be authenticated!
gettext-base libmagic1 file m4 autoconf autotools-dev automake1.9 html2text
gettext intltool-debian po-debconf debhelper lib32gomp1 libc6-dev-i386
gcc-4.2-multilib libncurses5-dev texinfo
Authentication warning overridden.
Selecting previously deselected package gettext-base.
(Reading database ... 9541 files and directories currently installed.)
Unpacking gettext-base (from .../gettext-base_0.17-2ubuntu1_amd64.deb) ...
Selecting previously deselected package libmagic1.
Unpacking libmagic1 (from .../libmagic1_4.21-3_amd64.deb) ...
Selecting previously deselected package file.
Unpacking file (from .../archives/file_4.21-3_amd64.deb) ...
Selecting previously deselected package m4.
Unpacking m4 (from .../archives/m4_1.4.10-1_amd64.deb) ...
Selecting previously deselected package autoconf.
Unpacking autoconf (from .../autoconf_2.61-4_all.deb) ...
Selecting previously deselected package autotools-dev.
Unpacking autotools-dev (from .../autotools-dev_20070725.1_all.deb) ...
Selecting previously deselected package automake1.9.
Unpacking automake1.9 (from .../automake1.9_1.9.6+nogfdl-3ubuntu1_all.deb) ...
Selecting previously deselected package html2text.
Unpacking html2text (from .../html2text_1.3.2a-3build1_amd64.deb) ...
Selecting previously deselected package gettext.
Unpacking gettext (from .../gettext_0.17-2ubuntu1_amd64.deb) ...
Selecting previously deselected package intltool-debian.
Unpacking intltool-debian (from .../intltool-debian_0.35.0+20060710.1_all.deb) ...
Selecting previously deselected package po-debconf.
Unpacking po-debconf (from .../po-debconf_1.0.10_all.deb) ...
Selecting previously deselected package debhelper.
Unpacking debhelper (from .../debhelper_6.0.4ubuntu1_all.deb) ...
Selecting previously deselected package lib32gomp1.
Unpacking lib32gomp1 (from .../lib32gomp1_4.2.3-1ubuntu2_amd64.deb) ...
Selecting previously deselected package libc6-dev-i386.
Unpacking libc6-dev-i386 (from .../libc6-dev-i386_2.7-5ubuntu2_amd64.deb) ...
Selecting previously deselected package gcc-4.2-multilib.
Unpacking gcc-4.2-multilib (from .../gcc-4.2-multilib_4.2.3-1ubuntu2_amd64.deb) ...
Selecting previously deselected package libncurses5-dev.
Unpacking libncurses5-dev (from .../libncurses5-dev_5.6+20071124-1ubuntu1_amd64.deb) ...
Selecting previously deselected package texinfo.
Unpacking texinfo (from .../texinfo_4.11.dfsg.1-2_amd64.deb) ...
Setting up gettext-base (0.17-2ubuntu1) ...
Setting up libmagic1 (4.21-3) ...
Setting up file (4.21-3) ...
Setting up m4 (1.4.10-1) ...
Setting up autoconf (2.61-4) ...
Setting up autotools-dev (20070725.1) ...
Setting up automake1.9 (1.9.6+nogfdl-3ubuntu1) ...
Setting up html2text (1.3.2a-3build1) ...
Setting up gettext (0.17-2ubuntu1) ...
Setting up intltool-debian (0.35.0+20060710.1) ...
Setting up po-debconf (1.0.10) ...
Setting up debhelper (6.0.4ubuntu1) ...
Setting up lib32gomp1 (4.2.3-1ubuntu2) ...
Setting up libc6-dev-i386 (2.7-5ubuntu2) ...
Setting up gcc-4.2-multilib (4.2.3-1ubuntu2) ...
Setting up libncurses5-dev (5.6+20071124-1ubuntu1) ...
Setting up texinfo (4.11.dfsg.1-2) ...
Checking correctness of source dependencies...
Toolchain package versions: libc6-dev_2.7-5ubuntu2 make_3.81-3build1 dpkg-dev_1.14.16.6ubuntu3 linux-libc-dev_2.6.24-8.14 gcc-4.2_4.2.3-1ubuntu2 g++-4.2_4.2.3-1ubuntu2 binutils_2.18.1~cvs20080103-0ubuntu1 libstdc++6_4.2.3-1ubuntu2 libstdc++6-4.2-dev_4.2.3-1ubuntu2
------------------------------------------------------------------------------
dpkg-source: extracting grub in grub-0.97
dpkg-source: unpacking grub_0.97.orig.tar.gz
dpkg-source: applying /home/buildd/build-hardy-autotest/grub_0.97-29ubuntu14.diff.gz
dpkg-buildpackage: set CPPFLAGS to default value:
dpkg-buildpackage: set CFLAGS to default value: -g -O2
dpkg-buildpackage: set CXXFLAGS to default value: -g -O2
dpkg-buildpackage: set FFLAGS to default value: -g -O2
dpkg-buildpackage: set LDFLAGS to default value: -Wl,-Bsymbolic-functions
dpkg-buildpackage: source package grub
dpkg-buildpackage: source version 0.97-29ubuntu14
dpkg-buildpackage: host architecture amd64
/usr/bin/fakeroot debian/rules clean
dh_testdir
dh_testroot
rm -f build-arch-stamp build-indep-stamp configure-stamp config.log
# Add here commands to clean up after the build process.
/usr/bin/make distclean
make[1]: Entering directory `/build/buildd/grub-0.97'
make[1]: *** No rule to make target `distclean'. Stop.
make[1]: Leaving directory `/build/buildd/grub-0.97'
make: [clean] Error 2 (ignored)
# The Makefile doesn't clean up the generated info files so we will do
# it here so the doco is uptodate.
( cd docs && rm -f *.info* )
# clean up generated html documentation
( cd docs && rm -f *.html )
# clean up documentation directory removing created dirs.
( cd docs && rm -rf grub multiboot )
# remove files that will be change due our automake and autoconf rebuilding
rm -f ./util/Makefile.in ./aclocal.m4 ./Makefile.in ./configure ./netboot/Makefile.in ./stage2/Makefile.in ./stage1/Makefile.in ./lib/Makefile.in ./grub/Makefile.in ./docs/Makefile.in
# reverse patches we applied. this has to happen after make distclean
/usr/bin/make -s -f debian/rules unpatch
dh_clean
debian/rules build
dh_testdir
# Add here commands to patch the source..
set -e ; for i in `cat debian/patches/00list | grep -v ^#` ; \
do \
echo "--- $i ---" ; patch -p1 < debian/patches/$i ; \
done
--- cvs-sync.patch ---
patching file ChangeLog
patching file docs/multiboot.texi
patching file grub/asmstub.c
patching file grub/main.c
patching file lib/device.c
patching file stage2/boot.c
patching file stage2/builtins.c
patching file stage2/shared.h
patching file stage2/stage2.c
patching file stamp-h.in
patching file THANKS
patching file util/grub-install.in
--- menu.lst_gnu-hurd.diff ---
patching file docs/menu.lst
Hunk #1 succeeded at 14 with fuzz 2.
patching file docs/menu.lst
--- graphics.diff ---
patching file configure.ac
patching file stage2/asm.S
patching file stage2/builtins.c
patching file stage2/char_io.c
patching file stage2/cmdline.c
patching file stage2/graphics.c
patching file stage2/graphics.h
patching file stage2/Makefile.am
patching file stage2/shared.h
Hunk #1 succeeded at 796 (offset 4 lines).
Hunk #2 succeeded at 880 (offset 4 lines).
patching file stage2/stage2.c
Hunk #20 succeeded at 740 (offset 3 lines).
Hunk #21 succeeded at 784 (offset 4 lines).
Hunk #22 succeeded at 1093 (offset 4 lines).
patching file stage2/term.h
--- raid.diff ---
patching file util/grub-install.in
--- raid_cciss.diff ---
patching file lib/device.c
Hunk #2 succeeded at 842 with fuzz 1 (offset 32 lines).
--- xfs_freeze.diff ---
patching file util/grub-install.in
Hunk #1 succeeded at 498 (offset 48 lines).
Hunk #2 succeeded at 519 (offset 48 lines).
--- 2gb_limit.diff ---
patching file stage2/char_io.c
Hunk #1 succeeded at 1231 (offset 56 lines).
Hunk #2 succeeded at 1248 (offset 56 lines).
patching file stage2/shared.h
Hunk #1 succeeded at 921 (offset 10 lines).
--- kfreebsd.diff ---
patching file stage2/boot.c
patching file stage2/freebsd.h
--- grub-special_device_names.diff ---
patching file lib/device.c
Hunk #1 succeeded at 973 (offset -142 lines).
--- initrd_max_address.diff ---
patching file stage2/boot.c
Hunk #1 succeeded at 831 (offset 21 lines).
--- splashimage_help.diff ---
patching file docs/grub.texi
Hunk #1 succeeded at 2199 with fuzz 2 (offset 308 lines).
Hunk #2 succeeded at 2579 (offset 318 lines).
--- grub-install_addsyncs.diff ---
patching file util/grub-install.in
Hunk #1 succeeded at 384 (offset 33 lines).
Hunk #2 succeeded at 516 with fuzz 2 (offset 55 lines).
--- grub-install_regexp.diff ---
patching file util/grub-install.in
Hunk #1 succeeded at 179 (offset 48 lines).
Hunk #2 succeeded at 196 (offset 48 lines).
--- grub-install_aoe_support.diff ---
patching file util/grub-install.in
--- grub-install_storeversion.diff ---
patching file util/grub-install.in
Hunk #1 succeeded at 539 (offset 77 lines).
--- geometry-26kernel.diff ---
patching file lib/device.c
Hunk #3 succeeded at 1094 (offset 112 lines).
Hunk #4 succeeded at 1129 (offset 113 lines).
--- print_func.diff ---
patching file docs/grub.texi
Hunk #1 succeeded at 2696 (offset 11 lines).
Hunk #2 succeeded at 3103 (offset 11 lines).
patching file stage2/builtins.c
Hunk #1 succeeded at 2595 (offset 272 lines).
Hunk #2 succeeded at 5161 (offset 294 lines).
--- mprotect.diff ---
patching file grub/asmstub.c
Hunk #2 succeeded at 154 (offset 6 lines).
--- savedefault.diff ---
patching file stage2/builtins.c
Hunk #1 succeeded at 86 (offset 4 lines).
Hunk #2 succeeded at 3516 (offset 291 lines).
Hunk #3 succeeded at 3694 (offset 291 lines).
patching file stage2/stage2.c
Hunk #1 succeeded at 934 (offset 43 lines).
--- find-grub-dir.diff ---
patching file util/grub-set-default.in
--- intelmac.diff ---
patching file stage2/asm.S
--- crossreference_manpages.diff ---
patching file docs/help2man
patching file docs/Makefile.am
patching file docs/grub.8.additions
patching file docs/grub-install.8.additions
--- varargs.diff ---
patching file netboot/misc.c
patching file stage1/Makefile.am
patching file stage2/char_io.c
patching file stage2/Makefile.am
patching file stage2/shared.h
Hunk #1 succeeded at 914 (offset -1 lines).
patching file stage2/tparm.c
--- quiet.diff ---
patching file stage2/boot.c
Hunk #1 succeeded at 282 (offset 2 lines).
Hunk #2 succeeded at 490 (offset 2 lines).
Hunk #3 succeeded at 499 (offset 2 lines).
Hunk #4 succeeded at 743 (offset 7 lines).
Hunk #5 succeeded at 850 (offset 10 lines).
patching file stage2/builtins.c
Hunk #1 succeeded at 79 (offset 4 lines).
Hunk #2 succeeded at 268 (offset 18 lines).
Hunk #3 succeeded at 370 (offset 25 lines).
Hunk #4 succeeded at 1879 (offset 276 lines).
Hunk #5 succeeded at 1962 (offset 276 lines).
Hunk #6 succeeded at 3337 (offset 295 lines).
Hunk #7 succeeded at 3428 (offset 295 lines).
Hunk #8 succeeded at 3440 (offset 295 lines).
Hunk #9 succeeded at 3488 (offset 295 lines).
Hunk #10 succeeded at 5020 (offset 413 lines).
Hunk #11 succeeded at 5304 (offset 424 lines).
patching file stage2/char_io.c
Hunk #1 succeeded at 270 (offset 33 lines).
patching file stage2/cmdline.c
Hunk #1 succeeded at 230 (offset 1 line).
patching file stage2/shared.h
Hunk #1 succeeded at 863 (offset 9 lines).
patching file stage2/stage2.c
Hunk #1 succeeded at 752 (offset 35 lines).
--- gpt.diff ---
patching file stage2/builtins.c
Hunk #1 succeeded at 1507 (offset 274 lines).
Hunk #2 succeeded at 3132 (offset 316 lines).
Hunk #3 succeeded at 3170 (offset 316 lines).
patching file stage2/disk_io.c
patching file stage2/gpt.h
patching file stage2/pc_slice.h
patching file stage2/shared.h
Hunk #1 succeeded at 945 (offset 11 lines).
--- use_genisoimage_instead_of_mkisofs.dpatch ---
patching file docs/grub.texi
patching file util/mkbimage
--- grub-0.95-mem_lower.patch ---
patching file stage2/common.c
touch patch-stamp
dh_testdir
# Add here commands to configure the package.
aclocal-1.9 && automake-1.9 && autoconf
CC=gcc LDFLAGS=-static ./configure \
--host=x86_64-linux-gnu \
--build=x86_64-linux-gnu \
--prefix=/usr \
--mandir=/usr/share/man \
--infodir=/usr/share/info \
--disable-auto-linux-mem-opt
checking for a BSD-compatible install... /usr/bin/install -c
checking whether build environment is sane... yes
checking for gawk... no
checking for mawk... mawk
checking whether make sets $(MAKE)... yes
checking build system type... x86_64-pc-linux-gnu
checking host system type... x86_64-pc-linux-gnu
checking whether to enable maintainer-specific portions of Makefiles... no
checking for x86_64-linux-gnu-gcc... gcc
checking for x86_64-linux-gnu-gcc... (cached) gcc
checking for C compiler default output file name... a.out
checking whether the C compiler works... yes
checking whether we are cross compiling... no
checking for suffix of executables...
checking for suffix of object files... o
checking whether we are using the GNU C compiler... yes
checking whether gcc accepts -g... yes
checking for gcc option to accept ISO C89... none needed
checking for style of include used by make... GNU
checking dependency style of gcc... gcc3
checking dependency style of gcc... (cached) gcc3
checking for x86_64-linux-gnu-ranlib... no
checking for ranlib... ranlib
checking whether -Wundef works... yes
checking whether -falign-loops works... yes
checking for x86_64-linux-gnu-objcopy... no
checking for objcopy... objcopy
checking if C symbols get an underscore after compilation... no
checking whether objcopy works for absolute addresses... yes
checking whether addr32 must be in the same line as the instruction... yes
checking for .code16 addr32 assembler support... yes
checking whether an absolute indirect call/jump must not be prefixed with an asterisk... no
checking if start is defined by the compiler... no
checking if _start is defined by the compiler... yes
checking if __bss_start is defined by the compiler... yes
checking if _edata is defined by the compiler... yes
checking if edata is defined by the compiler... yes
checking if end is defined by the compiler... yes
checking if _end is defined by the compiler... yes
checking for opendisk in -lutil... no
checking for wgetch in -lncurses... no
checking for wgetch in -lcurses... no
checking how to run the C preprocessor... gcc -E
checking for grep that handles long lines and -e... /bin/grep
checking for egrep... /bin/grep -E
checking for ANSI C header files... yes
checking for sys/types.h... yes
checking for sys/stat.h... yes
checking for stdlib.h... yes
checking for string.h... yes
checking for memory.h... yes
checking for strings.h... yes
checking for inttypes.h... yes
checking for stdint.h... yes
checking for unistd.h... yes
checking for string.h... (cached) yes
checking for strings.h... (cached) yes
checking ncurses/curses.h usability... no
checking ncurses/curses.h presence... no
checking for ncurses/curses.h... no
checking ncurses.h usability... yes
checking ncurses.h presence... yes
checking for ncurses.h... yes
checking curses.h usability... yes
checking curses.h presence... yes
checking for curses.h... yes
configure: creating ./config.status
config.status: creating Makefile
config.status: creating stage1/Makefile
config.status: creating stage2/Makefile
config.status: creating docs/Makefile
config.status: creating lib/Makefile
config.status: creating util/Makefile
config.status: creating grub/Makefile
config.status: creating netboot/Makefile
config.status: creating util/grub-image
config.status: creating util/grub-install
config.status: creating util/grub-md5-crypt
config.status: creating util/grub-terminfo
config.status: creating util/grub-set-default
config.status: creating config.h
config.status: executing depfiles commands
touch configure-stamp
dh_testdir
# Add here commands to compile the package.
/usr/bin/make
make[1]: Entering directory `/build/buildd/grub-0.97'
/usr/bin/make all-recursive
make[2]: Entering directory `/build/buildd/grub-0.97'
Making all in netboot
make[3]: Entering directory `/build/buildd/grub-0.97/netboot'
make[3]: Nothing to be done for `all'.
make[3]: Leaving directory `/build/buildd/grub-0.97/netboot'
Making all in stage2
make[3]: Entering directory `/build/buildd/grub-0.97/stage2'
gcc -fno-builtin -DSUPPORT_SERIAL=1 -DSUPPORT_HERCULES=1 -DSUPPORT_GRAPHICS=1 -DFSYS_EXT2FS=1 -DFSYS_FAT=1 -DFSYS_FFS=1 -DFSYS_UFS2=1 -DFSYS_MINIX=1 -DFSYS_REISERFS=1 -DFSYS_VSTAFS=1 -DFSYS_JFS=1 -DFSYS_XFS=1 -DFSYS_ISO9660=1 -DUSE_MD5_PASSWORDS=1 -DHAVE_CONFIG_H -I. -I. -I.. -I../stage1 -Wall -Wmissing-prototypes -Wunused -Wshadow -Wpointer-arith -falign-jumps=1 -falign-loops=1 -falign-functions=1 -Wundef -m32 -Wall -g -O2 -c -o pre_stage2_exec-asm.o `test -f 'asm.S' || echo './'`asm.S
if gcc -DHAVE_CONFIG_H -I. -I. -I.. -I../stage1 -Wall -Wmissing-prototypes -Wunused -Wshadow -Wpointer-arith -falign-jumps=1 -falign-loops=1 -falign-functions=1 -Wundef -fno-builtin -DSUPPORT_SERIAL=1 -DSUPPORT_HERCULES=1 -DSUPPORT_GRAPHICS=1 -DFSYS_EXT2FS=1 -DFSYS_FAT=1 -DFSYS_FFS=1 -DFSYS_UFS2=1 -DFSYS_MINIX=1 -DFSYS_REISERFS=1 -DFSYS_VSTAFS=1 -DFSYS_JFS=1 -DFSYS_XFS=1 -DFSYS_ISO9660=1 -DUSE_MD5_PASSWORDS=1 -m32 -Wall -g -O2 -MT pre_stage2_exec-bios.o -MD -MP -MF ".deps/pre_stage2_exec-bios.Tpo" -c -o pre_stage2_exec-bios.o `test -f 'bios.c' || echo './'`bios.c; \
then mv -f ".deps/pre_stage2_exec-bios.Tpo" ".deps/pre_stage2_exec-bios.Po"; else rm -f ".deps/pre_stage2_exec-bios.Tpo"; exit 1; fi
if gcc -DHAVE_CONFIG_H -I. -I. -I.. -I../stage1 -Wall -Wmissing-prototypes -Wunused -Wshadow -Wpointer-arith -falign-jumps=1 -falign-loops=1 -falign-functions=1 -Wundef -fno-builtin -DSUPPORT_SERIAL=1 -DSUPPORT_HERCULES=1 -DSUPPORT_GRAPHICS=1 -DFSYS_EXT2FS=1 -DFSYS_FAT=1 -DFSYS_FFS=1 -DFSYS_UFS2=1 -DFSYS_MINIX=1 -DFSYS_REISERFS=1 -DFSYS_VSTAFS=1 -DFSYS_JFS=1 -DFSYS_XFS=1 -DFSYS_ISO9660=1 -DUSE_MD5_PASSWORDS=1 -m32 -Wall -g -O2 -MT pre_stage2_exec-boot.o -MD -MP -MF ".deps/pre_stage2_exec-boot.Tpo" -c -o pre_stage2_exec-boot.o `test -f 'boot.c' || echo './'`boot.c; \
then mv -f ".deps/pre_stage2_exec-boot.Tpo" ".deps/pre_stage2_exec-boot.Po"; else rm -f ".deps/pre_stage2_exec-boot.Tpo"; exit 1; fi
boot.c: In function 'load_image':
boot.c:69: warning: pointer targets in passing argument 1 of 'grub_read' differ in signedness
boot.c:103: warning: pointer targets in passing argument 1 of 'grub_strcmp' differ in signedness
boot.c: In function 'bsd_boot':
boot.c:1096: warning: pointer targets in assignment differ in signedness
if gcc -DHAVE_CONFIG_H -I. -I. -I.. -I../stage1 -Wall -Wmissing-prototypes -Wunused -Wshadow -Wpointer-arith -falign-jumps=1 -falign-loops=1 -falign-functions=1 -Wundef -fno-builtin -DSUPPORT_SERIAL=1 -DSUPPORT_HERCULES=1 -DSUPPORT_GRAPHICS=1 -DFSYS_EXT2FS=1 -DFSYS_FAT=1 -DFSYS_FFS=1 -DFSYS_UFS2=1 -DFSYS_MINIX=1 -DFSYS_REISERFS=1 -DFSYS_VSTAFS=1 -DFSYS_JFS=1 -DFSYS_XFS=1 -DFSYS_ISO9660=1 -DUSE_MD5_PASSWORDS=1 -m32 -Wall -g -O2 -MT pre_stage2_exec-builtins.o -MD -MP -MF ".deps/pre_stage2_exec-builtins.Tpo" -c -o pre_stage2_exec-builtins.o `test -f 'builtins.c' || echo './'`builtins.c; \
then mv -f ".deps/pre_stage2_exec-builtins.Tpo" ".deps/pre_stage2_exec-builtins.Po"; else rm -f ".deps/pre_stage2_exec-builtins.Tpo"; exit 1; fi
builtins.c: In function 'uppermem_func':
builtins.c:5117: warning: dereferencing type-punned pointer will break strict-aliasing rules
builtins.c: At top level:
builtins.c:93: warning: 'savedefault_shell' declared 'static' but never defined
if gcc -DHAVE_CONFIG_H -I. -I. -I.. -I../stage1 -Wall -Wmissing-prototypes -Wunused -Wshadow -Wpointer-arith -falign-jumps=1 -falign-loops=1 -falign-functions=1 -Wundef -fno-builtin -DSUPPORT_SERIAL=1 -DSUPPORT_HERCULES=1 -DSUPPORT_GRAPHICS=1 -DFSYS_EXT2FS=1 -DFSYS_FAT=1 -DFSYS_FFS=1 -DFSYS_UFS2=1 -DFSYS_MINIX=1 -DFSYS_REISERFS=1 -DFSYS_VSTAFS=1 -DFSYS_JFS=1 -DFSYS_XFS=1 -DFSYS_ISO9660=1 -DUSE_MD5_PASSWORDS=1 -m32 -Wall -g -O2 -MT pre_stage2_exec-char_io.o -MD -MP -MF ".deps/pre_stage2_exec-char_io.Tpo" -c -o pre_stage2_exec-char_io.o `test -f 'char_io.c' || echo './'`char_io.c; \
then mv -f ".deps/pre_stage2_exec-char_io.Tpo" ".deps/pre_stage2_exec-char_io.Po"; else rm -f ".deps/pre_stage2_exec-char_io.Tpo"; exit 1; fi
char_io.c: In function 'grub_printf':
char_io.c:204: warning: passing argument 3 of 'convert_to_ascii' makes integer from pointer without a cast
char_io.c: In function 'grub_sprintf':
char_io.c:242: warning: passing argument 3 of 'convert_to_ascii' makes integer from pointer without a cast
if gcc -DHAVE_CONFIG_H -I. -I. -I.. -I../stage1 -Wall -Wmissing-prototypes -Wunused -Wshadow -Wpointer-arith -falign-jumps=1 -falign-loops=1 -falign-functions=1 -Wundef -fno-builtin -DSUPPORT_SERIAL=1 -DSUPPORT_HERCULES=1 -DSUPPORT_GRAPHICS=1 -DFSYS_EXT2FS=1 -DFSYS_FAT=1 -DFSYS_FFS=1 -DFSYS_UFS2=1 -DFSYS_MINIX=1 -DFSYS_REISERFS=1 -DFSYS_VSTAFS=1 -DFSYS_JFS=1 -DFSYS_XFS=1 -DFSYS_ISO9660=1 -DUSE_MD5_PASSWORDS=1 -m32 -Wall -g -O2 -MT pre_stage2_exec-cmdline.o -MD -MP -MF ".deps/pre_stage2_exec-cmdline.Tpo" -c -o pre_stage2_exec-cmdline.o `test -f 'cmdline.c' || echo './'`cmdline.c; \
then mv -f ".deps/pre_stage2_exec-cmdline.Tpo" ".deps/pre_stage2_exec-cmdline.Po"; else rm -f ".deps/pre_stage2_exec-cmdline.Tpo"; exit 1; fi
if gcc -DHAVE_CONFIG_H -I. -I. -I.. -I../stage1 -Wall -Wmissing-prototypes -Wunused -Wshadow -Wpointer-arith -falign-jumps=1 -falign-loops=1 -falign-functions=1 -Wundef -fno-builtin -DSUPPORT_SERIAL=1 -DSUPPORT_HERCULES=1 -DSUPPORT_GRAPHICS=1 -DFSYS_EXT2FS=1 -DFSYS_FAT=1 -DFSYS_FFS=1 -DFSYS_UFS2=1 -DFSYS_MINIX=1 -DFSYS_REISERFS=1 -DFSYS_VSTAFS=1 -DFSYS_JFS=1 -DFSYS_XFS=1 -DFSYS_ISO9660=1 -DUSE_MD5_PASSWORDS=1 -m32 -Wall -g -O2 -MT pre_stage2_exec-common.o -MD -MP -MF ".deps/pre_stage2_exec-common.Tpo" -c -o pre_stage2_exec-common.o `test -f 'common.c' || echo './'`common.c; \
then mv -f ".deps/pre_stage2_exec-common.Tpo" ".deps/pre_stage2_exec-common.Po"; else rm -f ".deps/pre_stage2_exec-common.Tpo"; exit 1; fi
if gcc -DHAVE_CONFIG_H -I. -I. -I.. -I../stage1 -Wall -Wmissing-prototypes -Wunused -Wshadow -Wpointer-arith -falign-jumps=1 -falign-loops=1 -falign-functions=1 -Wundef -fno-builtin -DSUPPORT_SERIAL=1 -DSUPPORT_HERCULES=1 -DSUPPORT_GRAPHICS=1 -DFSYS_EXT2FS=1 -DFSYS_FAT=1 -DFSYS_FFS=1 -DFSYS_UFS2=1 -DFSYS_MINIX=1 -DFSYS_REISERFS=1 -DFSYS_VSTAFS=1 -DFSYS_JFS=1 -DFSYS_XFS=1 -DFSYS_ISO9660=1 -DUSE_MD5_PASSWORDS=1 -m32 -Wall -g -O2 -MT pre_stage2_exec-console.o -MD -MP -MF ".deps/pre_stage2_exec-console.Tpo" -c -o pre_stage2_exec-console.o `test -f 'console.c' || echo './'`console.c; \
then mv -f ".deps/pre_stage2_exec-console.Tpo" ".deps/pre_stage2_exec-console.Po"; else rm -f ".deps/pre_stage2_exec-console.Tpo"; exit 1; fi
if gcc -DHAVE_CONFIG_H -I. -I. -I.. -I../stage1 -Wall -Wmissing-prototypes -Wunused -Wshadow -Wpointer-arith -falign-jumps=1 -falign-loops=1 -falign-functions=1 -Wundef -fno-builtin -DSUPPORT_SERIAL=1 -DSUPPORT_HERCULES=1 -DSUPPORT_GRAPHICS=1 -DFSYS_EXT2FS=1 -DFSYS_FAT=1 -DFSYS_FFS=1 -DFSYS_UFS2=1 -DFSYS_MINIX=1 -DFSYS_REISERFS=1 -DFSYS_VSTAFS=1 -DFSYS_JFS=1 -DFSYS_XFS=1 -DFSYS_ISO9660=1 -DUSE_MD5_PASSWORDS=1 -m32 -Wall -g -O2 -MT pre_stage2_exec-disk_io.o -MD -MP -MF ".deps/pre_stage2_exec-disk_io.Tpo" -c -o pre_stage2_exec-disk_io.o `test -f 'disk_io.c' || echo './'`disk_io.c; \
then mv -f ".deps/pre_stage2_exec-disk_io.Tpo" ".deps/pre_stage2_exec-disk_io.Po"; else rm -f ".deps/pre_stage2_exec-disk_io.Tpo"; exit 1; fi
disk_io.c: In function 'next_pc_slice':
disk_io.c:690: warning: integer constant is too large for 'unsigned long' type
disk_io.c: In function 'set_device':
disk_io.c:1112: warning: dereferencing type-punned pointer will break strict-aliasing rules
disk_io.c:1142: warning: dereferencing type-punned pointer will break strict-aliasing rules
if gcc -DHAVE_CONFIG_H -I. -I. -I.. -I../stage1 -Wall -Wmissing-prototypes -Wunused -Wshadow -Wpointer-arith -falign-jumps=1 -falign-loops=1 -falign-functions=1 -Wundef -fno-builtin -DSUPPORT_SERIAL=1 -DSUPPORT_HERCULES=1 -DSUPPORT_GRAPHICS=1 -DFSYS_EXT2FS=1 -DFSYS_FAT=1 -DFSYS_FFS=1 -DFSYS_UFS2=1 -DFSYS_MINIX=1 -DFSYS_REISERFS=1 -DFSYS_VSTAFS=1 -DFSYS_JFS=1 -DFSYS_XFS=1 -DFSYS_ISO9660=1 -DUSE_MD5_PASSWORDS=1 -m32 -Wall -g -O2 -MT pre_stage2_exec-fsys_ext2fs.o -MD -MP -MF ".deps/pre_stage2_exec-fsys_ext2fs.Tpo" -c -o pre_stage2_exec-fsys_ext2fs.o `test -f 'fsys_ext2fs.c' || echo './'`fsys_ext2fs.c; \
then mv -f ".deps/pre_stage2_exec-fsys_ext2fs.Tpo" ".deps/pre_stage2_exec-fsys_ext2fs.Po"; else rm -f ".deps/pre_stage2_exec-fsys_ext2fs.Tpo"; exit 1; fi
if gcc -DHAVE_CONFIG_H -I. -I. -I.. -I../stage1 -Wall -Wmissing-prototypes -Wunused -Wshadow -Wpointer-arith -falign-jumps=1 -falign-loops=1 -falign-functions=1 -Wundef -fno-builtin -DSUPPORT_SERIAL=1 -DSUPPORT_HERCULES=1 -DSUPPORT_GRAPHICS=1 -DFSYS_EXT2FS=1 -DFSYS_FAT=1 -DFSYS_FFS=1 -DFSYS_UFS2=1 -DFSYS_MINIX=1 -DFSYS_REISERFS=1 -DFSYS_VSTAFS=1 -DFSYS_JFS=1 -DFSYS_XFS=1 -DFSYS_ISO9660=1 -DUSE_MD5_PASSWORDS=1 -m32 -Wall -g -O2 -MT pre_stage2_exec-fsys_fat.o -MD -MP -MF ".deps/pre_stage2_exec-fsys_fat.Tpo" -c -o pre_stage2_exec-fsys_fat.o `test -f 'fsys_fat.c' || echo './'`fsys_fat.c; \
then mv -f ".deps/pre_stage2_exec-fsys_fat.Tpo" ".deps/pre_stage2_exec-fsys_fat.Po"; else rm -f ".deps/pre_stage2_exec-fsys_fat.Tpo"; exit 1; fi
if gcc -DHAVE_CONFIG_H -I. -I. -I.. -I../stage1 -Wall -Wmissing-prototypes -Wunused -Wshadow -Wpointer-arith -falign-jumps=1 -falign-loops=1 -falign-functions=1 -Wundef -fno-builtin -DSUPPORT_SERIAL=1 -DSUPPORT_HERCULES=1 -DSUPPORT_GRAPHICS=1 -DFSYS_EXT2FS=1 -DFSYS_FAT=1 -DFSYS_FFS=1 -DFSYS_UFS2=1 -DFSYS_MINIX=1 -DFSYS_REISERFS=1 -DFSYS_VSTAFS=1 -DFSYS_JFS=1 -DFSYS_XFS=1 -DFSYS_ISO9660=1 -DUSE_MD5_PASSWORDS=1 -m32 -Wall -g -O2 -MT pre_stage2_exec-fsys_ffs.o -MD -MP -MF ".deps/pre_stage2_exec-fsys_ffs.Tpo" -c -o pre_stage2_exec-fsys_ffs.o `test -f 'fsys_ffs.c' || echo './'`fsys_ffs.c; \
then mv -f ".deps/pre_stage2_exec-fsys_ffs.Tpo" ".deps/pre_stage2_exec-fsys_ffs.Po"; else rm -f ".deps/pre_stage2_exec-fsys_ffs.Tpo"; exit 1; fi
if gcc -DHAVE_CONFIG_H -I. -I. -I.. -I../stage1 -Wall -Wmissing-prototypes -Wunused -Wshadow -Wpointer-arith -falign-jumps=1 -falign-loops=1 -falign-functions=1 -Wundef -fno-builtin -DSUPPORT_SERIAL=1 -DSUPPORT_HERCULES=1 -DSUPPORT_GRAPHICS=1 -DFSYS_EXT2FS=1 -DFSYS_FAT=1 -DFSYS_FFS=1 -DFSYS_UFS2=1 -DFSYS_MINIX=1 -DFSYS_REISERFS=1 -DFSYS_VSTAFS=1 -DFSYS_JFS=1 -DFSYS_XFS=1 -DFSYS_ISO9660=1 -DUSE_MD5_PASSWORDS=1 -m32 -Wall -g -O2 -MT pre_stage2_exec-fsys_iso9660.o -MD -MP -MF ".deps/pre_stage2_exec-fsys_iso9660.Tpo" -c -o pre_stage2_exec-fsys_iso9660.o `test -f 'fsys_iso9660.c' || echo './'`fsys_iso9660.c; \
then mv -f ".deps/pre_stage2_exec-fsys_iso9660.Tpo" ".deps/pre_stage2_exec-fsys_iso9660.Po"; else rm -f ".deps/pre_stage2_exec-fsys_iso9660.Tpo"; exit 1; fi
In file included from fsys_iso9660.c:36:
iso9660.h:76: warning: 'packed' attribute ignored
iso9660.h:80: warning: 'packed' attribute ignored
fsys_iso9660.c: In function 'iso9660_mount':
fsys_iso9660.c:123: warning: pointer targets in passing argument 1 of 'grub_memcmp' differ in signedness
fsys_iso9660.c: In function 'iso9660_dir':
fsys_iso9660.c:178: warning: pointer targets in initialization differ in signedness
fsys_iso9660.c:203: warning: pointer targets in assignment differ in signedness
fsys_iso9660.c:231: warning: pointer targets in assignment differ in signedness
fsys_iso9660.c:332: warning: pointer targets in assignment differ in signedness
fsys_iso9660.c:334: warning: pointer targets in assignment differ in signedness
fsys_iso9660.c:336: warning: pointer targets in passing argument 4 of 'iso9660_devread' differ in signedness
fsys_iso9660.c:384: warning: pointer targets in passing argument 1 of 'print_a_completion' differ in signedness
if gcc -DHAVE_CONFIG_H -I. -I. -I.. -I../stage1 -Wall -Wmissing-prototypes -Wunused -Wshadow -Wpointer-arith -falign-jumps=1 -falign-loops=1 -falign-functions=1 -Wundef -fno-builtin -DSUPPORT_SERIAL=1 -DSUPPORT_HERCULES=1 -DSUPPORT_GRAPHICS=1 -DFSYS_EXT2FS=1 -DFSYS_FAT=1 -DFSYS_FFS=1 -DFSYS_UFS2=1 -DFSYS_MINIX=1 -DFSYS_REISERFS=1 -DFSYS_VSTAFS=1 -DFSYS_JFS=1 -DFSYS_XFS=1 -DFSYS_ISO9660=1 -DUSE_MD5_PASSWORDS=1 -m32 -Wall -g -O2 -MT pre_stage2_exec-fsys_jfs.o -MD -MP -MF ".deps/pre_stage2_exec-fsys_jfs.Tpo" -c -o pre_stage2_exec-fsys_jfs.o `test -f 'fsys_jfs.c' || echo './'`fsys_jfs.c; \
then mv -f ".deps/pre_stage2_exec-fsys_jfs.Tpo" ".deps/pre_stage2_exec-fsys_jfs.Po"; else rm -f ".deps/pre_stage2_exec-fsys_jfs.Tpo"; exit 1; fi
if gcc -DHAVE_CONFIG_H -I. -I. -I.. -I../stage1 -Wall -Wmissing-prototypes -Wunused -Wshadow -Wpointer-arith -falign-jumps=1 -falign-loops=1 -falign-functions=1 -Wundef -fno-builtin -DSUPPORT_SERIAL=1 -DSUPPORT_HERCULES=1 -DSUPPORT_GRAPHICS=1 -DFSYS_EXT2FS=1 -DFSYS_FAT=1 -DFSYS_FFS=1 -DFSYS_UFS2=1 -DFSYS_MINIX=1 -DFSYS_REISERFS=1 -DFSYS_VSTAFS=1 -DFSYS_JFS=1 -DFSYS_XFS=1 -DFSYS_ISO9660=1 -DUSE_MD5_PASSWORDS=1 -m32 -Wall -g -O2 -MT pre_stage2_exec-fsys_minix.o -MD -MP -MF ".deps/pre_stage2_exec-fsys_minix.Tpo" -c -o pre_stage2_exec-fsys_minix.o `test -f 'fsys_minix.c' || echo './'`fsys_minix.c; \
then mv -f ".deps/pre_stage2_exec-fsys_minix.Tpo" ".deps/pre_stage2_exec-fsys_minix.Po"; else rm -f ".deps/pre_stage2_exec-fsys_minix.Tpo"; exit 1; fi
if gcc -DHAVE_CONFIG_H -I. -I. -I.. -I../stage1 -Wall -Wmissing-prototypes -Wunused -Wshadow -Wpointer-arith -falign-jumps=1 -falign-loops=1 -falign-functions=1 -Wundef -fno-builtin -DSUPPORT_SERIAL=1 -DSUPPORT_HERCULES=1 -DSUPPORT_GRAPHICS=1 -DFSYS_EXT2FS=1 -DFSYS_FAT=1 -DFSYS_FFS=1 -DFSYS_UFS2=1 -DFSYS_MINIX=1 -DFSYS_REISERFS=1 -DFSYS_VSTAFS=1 -DFSYS_JFS=1 -DFSYS_XFS=1 -DFSYS_ISO9660=1 -DUSE_MD5_PASSWORDS=1 -m32 -Wall -g -O2 -MT pre_stage2_exec-fsys_reiserfs.o -MD -MP -MF ".deps/pre_stage2_exec-fsys_reiserfs.Tpo" -c -o pre_stage2_exec-fsys_reiserfs.o `test -f 'fsys_reiserfs.c' || echo './'`fsys_reiserfs.c; \
then mv -f ".deps/pre_stage2_exec-fsys_reiserfs.Tpo" ".deps/pre_stage2_exec-fsys_reiserfs.Po"; else rm -f ".deps/pre_stage2_exec-fsys_reiserfs.Tpo"; exit 1; fi
if gcc -DHAVE_CONFIG_H -I. -I. -I.. -I../stage1 -Wall -Wmissing-prototypes -Wunused -Wshadow -Wpointer-arith -falign-jumps=1 -falign-loops=1 -falign-functions=1 -Wundef -fno-builtin -DSUPPORT_SERIAL=1 -DSUPPORT_HERCULES=1 -DSUPPORT_GRAPHICS=1 -DFSYS_EXT2FS=1 -DFSYS_FAT=1 -DFSYS_FFS=1 -DFSYS_UFS2=1 -DFSYS_MINIX=1 -DFSYS_REISERFS=1 -DFSYS_VSTAFS=1 -DFSYS_JFS=1 -DFSYS_XFS=1 -DFSYS_ISO9660=1 -DUSE_MD5_PASSWORDS=1 -m32 -Wall -g -O2 -MT pre_stage2_exec-fsys_ufs2.o -MD -MP -MF ".deps/pre_stage2_exec-fsys_ufs2.Tpo" -c -o pre_stage2_exec-fsys_ufs2.o `test -f 'fsys_ufs2.c' || echo './'`fsys_ufs2.c; \
then mv -f ".deps/pre_stage2_exec-fsys_ufs2.Tpo" ".deps/pre_stage2_exec-fsys_ufs2.Po"; else rm -f ".deps/pre_stage2_exec-fsys_ufs2.Tpo"; exit 1; fi
if gcc -DHAVE_CONFIG_H -I. -I. -I.. -I../stage1 -Wall -Wmissing-prototypes -Wunused -Wshadow -Wpointer-arith -falign-jumps=1 -falign-loops=1 -falign-functions=1 -Wundef -fno-builtin -DSUPPORT_SERIAL=1 -DSUPPORT_HERCULES=1 -DSUPPORT_GRAPHICS=1 -DFSYS_EXT2FS=1 -DFSYS_FAT=1 -DFSYS_FFS=1 -DFSYS_UFS2=1 -DFSYS_MINIX=1 -DFSYS_REISERFS=1 -DFSYS_VSTAFS=1 -DFSYS_JFS=1 -DFSYS_XFS=1 -DFSYS_ISO9660=1 -DUSE_MD5_PASSWORDS=1 -m32 -Wall -g -O2 -MT pre_stage2_exec-fsys_vstafs.o -MD -MP -MF ".deps/pre_stage2_exec-fsys_vstafs.Tpo" -c -o pre_stage2_exec-fsys_vstafs.o `test -f 'fsys_vstafs.c' || echo './'`fsys_vstafs.c; \
then mv -f ".deps/pre_stage2_exec-fsys_vstafs.Tpo" ".deps/pre_stage2_exec-fsys_vstafs.Po"; else rm -f ".deps/pre_stage2_exec-fsys_vstafs.Tpo"; exit 1; fi
fsys_vstafs.c: In function 'vstafs_read':
fsys_vstafs.c:189: warning: declaration of 'a' shadows a global declaration
fsys_vstafs.c:66: warning: shadowed declaration is here
fsys_vstafs.c:191: warning: declaration of 'curr_ext' shadows a global declaration
fsys_vstafs.c:65: warning: shadowed declaration is here
if gcc -DHAVE_CONFIG_H -I. -I. -I.. -I../stage1 -Wall -Wmissing-prototypes -Wunused -Wshadow -Wpointer-arith -falign-jumps=1 -falign-loops=1 -falign-functions=1 -Wundef -fno-builtin -DSUPPORT_SERIAL=1 -DSUPPORT_HERCULES=1 -DSUPPORT_GRAPHICS=1 -DFSYS_EXT2FS=1 -DFSYS_FAT=1 -DFSYS_FFS=1 -DFSYS_UFS2=1 -DFSYS_MINIX=1 -DFSYS_REISERFS=1 -DFSYS_VSTAFS=1 -DFSYS_JFS=1 -DFSYS_XFS=1 -DFSYS_ISO9660=1 -DUSE_MD5_PASSWORDS=1 -m32 -Wall -g -O2 -MT pre_stage2_exec-fsys_xfs.o -MD -MP -MF ".deps/pre_stage2_exec-fsys_xfs.Tpo" -c -o pre_stage2_exec-fsys_xfs.o `test -f 'fsys_xfs.c' || echo './'`fsys_xfs.c; \
then mv -f ".deps/pre_stage2_exec-fsys_xfs.Tpo" ".deps/pre_stage2_exec-fsys_xfs.Po"; else rm -f ".deps/pre_stage2_exec-fsys_xfs.Tpo"; exit 1; fi
fsys_xfs.c:102: warning: type qualifiers ignored on function return type
fsys_xfs.c:111: warning: type qualifiers ignored on function return type
fsys_xfs.c:127: warning: type qualifiers ignored on function return type
fsys_xfs.c: In function 'next_dentry':
fsys_xfs.c:371: warning: pointer targets in assignment differ in signedness
if gcc -DHAVE_CONFIG_H -I. -I. -I.. -I../stage1 -Wall -Wmissing-prototypes -Wunused -Wshadow -Wpointer-arith -falign-jumps=1 -falign-loops=1 -falign-functions=1 -Wundef -fno-builtin -DSUPPORT_SERIAL=1 -DSUPPORT_HERCULES=1 -DSUPPORT_GRAPHICS=1 -DFSYS_EXT2FS=1 -DFSYS_FAT=1 -DFSYS_FFS=1 -DFSYS_UFS2=1 -DFSYS_MINIX=1 -DFSYS_REISERFS=1 -DFSYS_VSTAFS=1 -DFSYS_JFS=1 -DFSYS_XFS=1 -DFSYS_ISO9660=1 -DUSE_MD5_PASSWORDS=1 -m32 -Wall -g -O2 -MT pre_stage2_exec-gunzip.o -MD -MP -MF ".deps/pre_stage2_exec-gunzip.Tpo" -c -o pre_stage2_exec-gunzip.o `test -f 'gunzip.c' || echo './'`gunzip.c; \
then mv -f ".deps/pre_stage2_exec-gunzip.Tpo" ".deps/pre_stage2_exec-gunzip.Po"; else rm -f ".deps/pre_stage2_exec-gunzip.Tpo"; exit 1; fi
gunzip.c: In function 'gunzip_test_header':
gunzip.c:280: warning: pointer targets in passing argument 1 of 'grub_read' differ in signedness
gunzip.c:296: warning: pointer targets in passing argument 1 of 'grub_read' differ in signedness
gunzip.c:311: warning: pointer targets in passing argument 1 of 'grub_read' differ in signedness
gunzip.c: In function 'get_byte':
gunzip.c:497: warning: pointer targets in passing argument 1 of 'grub_read' differ in signedness
if gcc -DHAVE_CONFIG_H -I. -I. -I.. -I../stage1 -Wall -Wmissing-prototypes -Wunused -Wshadow -Wpointer-arith -falign-jumps=1 -falign-loops=1 -falign-functions=1 -Wundef -fno-builtin -DSUPPORT_SERIAL=1 -DSUPPORT_HERCULES=1 -DSUPPORT_GRAPHICS=1 -DFSYS_EXT2FS=1 -DFSYS_FAT=1 -DFSYS_FFS=1 -DFSYS_UFS2=1 -DFSYS_MINIX=1 -DFSYS_REISERFS=1 -DFSYS_VSTAFS=1 -DFSYS_JFS=1 -DFSYS_XFS=1 -DFSYS_ISO9660=1 -DUSE_MD5_PASSWORDS=1 -m32 -Wall -g -O2 -MT pre_stage2_exec-hercules.o -MD -MP -MF ".deps/pre_stage2_exec-hercules.Tpo" -c -o pre_stage2_exec-hercules.o `test -f 'hercules.c' || echo './'`hercules.c; \
then mv -f ".deps/pre_stage2_exec-hercules.Tpo" ".deps/pre_stage2_exec-hercules.Po"; else rm -f ".deps/pre_stage2_exec-hercules.Tpo"; exit 1; fi
if gcc -DHAVE_CONFIG_H -I. -I. -I.. -I../stage1 -Wall -Wmissing-prototypes -Wunused -Wshadow -Wpointer-arith -falign-jumps=1 -falign-loops=1 -falign-functions=1 -Wundef -fno-builtin -DSUPPORT_SERIAL=1 -DSUPPORT_HERCULES=1 -DSUPPORT_GRAPHICS=1 -DFSYS_EXT2FS=1 -DFSYS_FAT=1 -DFSYS_FFS=1 -DFSYS_UFS2=1 -DFSYS_MINIX=1 -DFSYS_REISERFS=1 -DFSYS_VSTAFS=1 -DFSYS_JFS=1 -DFSYS_XFS=1 -DFSYS_ISO9660=1 -DUSE_MD5_PASSWORDS=1 -m32 -Wall -g -O2 -MT pre_stage2_exec-md5.o -MD -MP -MF ".deps/pre_stage2_exec-md5.Tpo" -c -o pre_stage2_exec-md5.o `test -f 'md5.c' || echo './'`md5.c; \
then mv -f ".deps/pre_stage2_exec-md5.Tpo" ".deps/pre_stage2_exec-md5.Po"; else rm -f ".deps/pre_stage2_exec-md5.Tpo"; exit 1; fi
md5.c: In function 'md5_update':
md5.c:169: warning: pointer targets in passing argument 1 of 'md5_transform' differ in signedness
md5.c: In function 'md5_password':
md5.c:249: warning: pointer targets in passing argument 1 of 'md5_update' differ in signedness
md5.c:250: warning: pointer targets in passing argument 1 of 'md5_update' differ in signedness
md5.c:265: warning: pointer targets in passing argument 1 of 'md5_update' differ in signedness
md5.c:274: warning: pointer targets in passing argument 1 of 'md5_update' differ in signedness
if gcc -DHAVE_CONFIG_H -I. -I. -I.. -I../stage1 -Wall -Wmissing-prototypes -Wunused -Wshadow -Wpointer-arith -falign-jumps=1 -falign-loops=1 -falign-functions=1 -Wundef -fno-builtin -DSUPPORT_SERIAL=1 -DSUPPORT_HERCULES=1 -DSUPPORT_GRAPHICS=1 -DFSYS_EXT2FS=1 -DFSYS_FAT=1 -DFSYS_FFS=1 -DFSYS_UFS2=1 -DFSYS_MINIX=1 -DFSYS_REISERFS=1 -DFSYS_VSTAFS=1 -DFSYS_JFS=1 -DFSYS_XFS=1 -DFSYS_ISO9660=1 -DUSE_MD5_PASSWORDS=1 -m32 -Wall -g -O2 -MT pre_stage2_exec-serial.o -MD -MP -MF ".deps/pre_stage2_exec-serial.Tpo" -c -o pre_stage2_exec-serial.o `test -f 'serial.c' || echo './'`serial.c; \
then mv -f ".deps/pre_stage2_exec-serial.Tpo" ".deps/pre_stage2_exec-serial.Po"; else rm -f ".deps/pre_stage2_exec-serial.Tpo"; exit 1; fi
if gcc -DHAVE_CONFIG_H -I. -I. -I.. -I../stage1 -Wall -Wmissing-prototypes -Wunused -Wshadow -Wpointer-arith -falign-jumps=1 -falign-loops=1 -falign-functions=1 -Wundef -fno-builtin -DSUPPORT_SERIAL=1 -DSUPPORT_HERCULES=1 -DSUPPORT_GRAPHICS=1 -DFSYS_EXT2FS=1 -DFSYS_FAT=1 -DFSYS_FFS=1 -DFSYS_UFS2=1 -DFSYS_MINIX=1 -DFSYS_REISERFS=1 -DFSYS_VSTAFS=1 -DFSYS_JFS=1 -DFSYS_XFS=1 -DFSYS_ISO9660=1 -DUSE_MD5_PASSWORDS=1 -m32 -Wall -g -O2 -MT pre_stage2_exec-smp-imps.o -MD -MP -MF ".deps/pre_stage2_exec-smp-imps.Tpo" -c -o pre_stage2_exec-smp-imps.o `test -f 'smp-imps.c' || echo './'`smp-imps.c; \
then mv -f ".deps/pre_stage2_exec-smp-imps.Tpo" ".deps/pre_stage2_exec-smp-imps.Po"; else rm -f ".deps/pre_stage2_exec-smp-imps.Tpo"; exit 1; fi
if gcc -DHAVE_CONFIG_H -I. -I. -I.. -I../stage1 -Wall -Wmissing-prototypes -Wunused -Wshadow -Wpointer-arith -falign-jumps=1 -falign-loops=1 -falign-functions=1 -Wundef -fno-builtin -DSUPPORT_SERIAL=1 -DSUPPORT_HERCULES=1 -DSUPPORT_GRAPHICS=1 -DFSYS_EXT2FS=1 -DFSYS_FAT=1 -DFSYS_FFS=1 -DFSYS_UFS2=1 -DFSYS_MINIX=1 -DFSYS_REISERFS=1 -DFSYS_VSTAFS=1 -DFSYS_JFS=1 -DFSYS_XFS=1 -DFSYS_ISO9660=1 -DUSE_MD5_PASSWORDS=1 -m32 -Wall -g -O2 -MT pre_stage2_exec-stage2.o -MD -MP -MF ".deps/pre_stage2_exec-stage2.Tpo" -c -o pre_stage2_exec-stage2.o `test -f 'stage2.c' || echo './'`stage2.c; \
then mv -f ".deps/pre_stage2_exec-stage2.Tpo" ".deps/pre_stage2_exec-stage2.Po"; else rm -f ".deps/pre_stage2_exec-stage2.Tpo"; exit 1; fi
stage2.c: In function 'cmain':
stage2.c:944: warning: value computed is not used
stage2.c:945: warning: passing argument 1 of 'grub_strcpy' from incompatible pointer type
stage2.c:945: warning: passing argument 2 of 'grub_strcpy' from incompatible pointer type
stage2.c:947: warning: passing argument 1 of 'grub_strcpy' from incompatible pointer type
stage2.c:947: warning: passing argument 2 of 'grub_strcpy' from incompatible pointer type
if gcc -DHAVE_CONFIG_H -I. -I. -I.. -I../stage1 -Wall -Wmissing-prototypes -Wunused -Wshadow -Wpointer-arith -falign-jumps=1 -falign-loops=1 -falign-functions=1 -Wundef -fno-builtin -DSUPPORT_SERIAL=1 -DSUPPORT_HERCULES=1 -DSUPPORT_GRAPHICS=1 -DFSYS_EXT2FS=1 -DFSYS_FAT=1 -DFSYS_FFS=1 -DFSYS_UFS2=1 -DFSYS_MINIX=1 -DFSYS_REISERFS=1 -DFSYS_VSTAFS=1 -DFSYS_JFS=1 -DFSYS_XFS=1 -DFSYS_ISO9660=1 -DUSE_MD5_PASSWORDS=1 -m32 -Wall -g -O2 -MT pre_stage2_exec-terminfo.o -MD -MP -MF ".deps/pre_stage2_exec-terminfo.Tpo" -c -o pre_stage2_exec-terminfo.o `test -f 'terminfo.c' || echo './'`terminfo.c; \
then mv -f ".deps/pre_stage2_exec-terminfo.Tpo" ".deps/pre_stage2_exec-terminfo.Po"; else rm -f ".deps/pre_stage2_exec-terminfo.Tpo"; exit 1; fi
if gcc -DHAVE_CONFIG_H -I. -I. -I.. -I../stage1 -Wall -Wmissing-prototypes -Wunused -Wshadow -Wpointer-arith -falign-jumps=1 -falign-loops=1 -falign-functions=1 -Wundef -fno-builtin -DSUPPORT_SERIAL=1 -DSUPPORT_HERCULES=1 -DSUPPORT_GRAPHICS=1 -DFSYS_EXT2FS=1 -DFSYS_FAT=1 -DFSYS_FFS=1 -DFSYS_UFS2=1 -DFSYS_MINIX=1 -DFSYS_REISERFS=1 -DFSYS_VSTAFS=1 -DFSYS_JFS=1 -DFSYS_XFS=1 -DFSYS_ISO9660=1 -DUSE_MD5_PASSWORDS=1 -m32 -Wall -g -O2 -MT pre_stage2_exec-tparm.o -MD -MP -MF ".deps/pre_stage2_exec-tparm.Tpo" -c -o pre_stage2_exec-tparm.o `test -f 'tparm.c' || echo './'`tparm.c; \
then mv -f ".deps/pre_stage2_exec-tparm.Tpo" ".deps/pre_stage2_exec-tparm.Po"; else rm -f ".deps/pre_stage2_exec-tparm.Tpo"; exit 1; fi
if gcc -DHAVE_CONFIG_H -I. -I. -I.. -I../stage1 -Wall -Wmissing-prototypes -Wunused -Wshadow -Wpointer-arith -falign-jumps=1 -falign-loops=1 -falign-functions=1 -Wundef -fno-builtin -DSUPPORT_SERIAL=1 -DSUPPORT_HERCULES=1 -DSUPPORT_GRAPHICS=1 -DFSYS_EXT2FS=1 -DFSYS_FAT=1 -DFSYS_FFS=1 -DFSYS_UFS2=1 -DFSYS_MINIX=1 -DFSYS_REISERFS=1 -DFSYS_VSTAFS=1 -DFSYS_JFS=1 -DFSYS_XFS=1 -DFSYS_ISO9660=1 -DUSE_MD5_PASSWORDS=1 -m32 -Wall -g -O2 -MT pre_stage2_exec-graphics.o -MD -MP -MF ".deps/pre_stage2_exec-graphics.Tpo" -c -o pre_stage2_exec-graphics.o `test -f 'graphics.c' || echo './'`graphics.c; \
then mv -f ".deps/pre_stage2_exec-graphics.Tpo" ".deps/pre_stage2_exec-graphics.Po"; else rm -f ".deps/pre_stage2_exec-graphics.Tpo"; exit 1; fi
gcc -m32 -Wall -g -O2 -static -o pre_stage2.exec -nostdlib -Wl,-N -Wl,-Ttext -Wl,8200 pre_stage2_exec-asm.o pre_stage2_exec-bios.o pre_stage2_exec-boot.o pre_stage2_exec-builtins.o pre_stage2_exec-char_io.o pre_stage2_exec-cmdline.o pre_stage2_exec-common.o pre_stage2_exec-console.o pre_stage2_exec-disk_io.o pre_stage2_exec-fsys_ext2fs.o pre_stage2_exec-fsys_fat.o pre_stage2_exec-fsys_ffs.o pre_stage2_exec-fsys_iso9660.o pre_stage2_exec-fsys_jfs.o pre_stage2_exec-fsys_minix.o pre_stage2_exec-fsys_reiserfs.o pre_stage2_exec-fsys_ufs2.o pre_stage2_exec-fsys_vstafs.o pre_stage2_exec-fsys_xfs.o pre_stage2_exec-gunzip.o pre_stage2_exec-hercules.o pre_stage2_exec-md5.o pre_stage2_exec-serial.o pre_stage2_exec-smp-imps.o pre_stage2_exec-stage2.o pre_stage2_exec-terminfo.o pre_stage2_exec-tparm.o pre_stage2_exec-graphics.o
pre_stage2_exec-bios.o: In function `get_diskinfo':
/build/buildd/grub-0.97/stage2/bios.c:317: undefined reference to `__stack_chk_fail'
pre_stage2_exec-boot.o: In function `load_image':
/build/buildd/grub-0.97/stage2/boot.c:770: undefined reference to `__stack_chk_fail'
pre_stage2_exec-builtins.o: In function `vbeprobe_func':
/build/buildd/grub-0.97/stage2/builtins.c:5230: undefined reference to `__stack_chk_fail'
pre_stage2_exec-builtins.o: In function `testvbe_func':
/build/buildd/grub-0.97/stage2/builtins.c:5007: undefined reference to `__stack_chk_fail'
pre_stage2_exec-builtins.o: In function `terminfo_func':
/build/buildd/grub-0.97/stage2/builtins.c:4808: undefined reference to `__stack_chk_fail'
pre_stage2_exec-builtins.o:/build/buildd/grub-0.97/stage2/builtins.c:4278: more undefined references to `__stack_chk_fail' follow
collect2: ld returned 1 exit status
make[3]: *** [pre_stage2.exec] Error 1
make[3]: Leaving directory `/build/buildd/grub-0.97/stage2'
make[2]: *** [all-recursive] Error 1
make[2]: Leaving directory `/build/buildd/grub-0.97'
make[1]: *** [all] Error 2
make[1]: Leaving directory `/build/buildd/grub-0.97'
make: *** [build-arch-stamp] Error 2
dpkg-buildpackage: failure: debian/rules build gave error exit status 2
******************************************************************************
Build finished at 20080218-0012
FAILED [dpkg-buildpackage died]
Purging chroot-hardy-autotest/build/buildd/grub-0.97
------------------------------------------------------------------------------
/usr/bin/sudo dpkg --root=/home/buildd/build-hardy-autotest/chroot-hardy-autotest --purge intltool-debian m4 gettext file lib32gomp1 html2text gettext-base debhelper gcc-4.2-multilib autotools-dev po-debconf libncurses5-dev automake1.9 libmagic1 libc6-dev-i386 texinfo autoconf
(Reading database ... 11553 files and directories currently installed.)
Removing debhelper ...
Removing gcc-4.2-multilib ...
Removing po-debconf ...
Removing libncurses5-dev ...
Removing automake1.9 ...
Removing libc6-dev-i386 ...
Removing texinfo ...
Purging configuration files for texinfo ...
Removing autoconf ...
Purging configuration files for autoconf ...
Removing intltool-debian ...
Removing m4 ...
Removing gettext ...
Removing file ...
Purging configuration files for file ...
Removing lib32gomp1 ...
Purging configuration files for lib32gomp1 ...
Removing html2text ...
Purging configuration files for html2text ...
Removing gettext-base ...
Removing autotools-dev ...
Removing libmagic1 ...
Purging configuration files for libmagic1 ...
******************************************************************************
Finished at 20080218-0012
Build needed 00:00:20, 7648k disk space
More information about the ubuntu-autotest
mailing list