Log for failed build of libx86_0.99-1.2ubuntu4 (dist=hardy-autotest)

Build Daemon user noreply at buildd.ubuntu.com
Tue Apr 15 20:03:03 BST 2008


Automatic build of libx86_0.99-1.2ubuntu4 on royal by sbuild/powerpc 1.170.5
Build started at 20080415-2003
******************************************************************************
Checking available source versions...
Fetching source files...
Reading package lists...
Building dependency tree...
Reading state information...
Need to get 85.3kB of source archives.
Get:1 http://archive.internal hardy-autotest/main libx86 0.99-1.2ubuntu4 (dsc) [605B]
Get:2 http://archive.internal hardy-autotest/main libx86 0.99-1.2ubuntu4 (tar) [84.7kB]
Fetched 85.3kB in 0s (2918kB/s)
Download complete and in download only mode
** Using build dependencies supplied by package:
Build-Depends: debhelper (>= 5)
Checking for already installed source dependencies...
debhelper: already installed (6.0.4ubuntu1 >= 5 is satisfied)
Checking for source dependency conflicts...
Checking correctness of source dependencies...
Toolchain package versions: libc6-dev_2.7-10ubuntu3 make_3.81-3build1 dpkg-dev_1.14.16.6ubuntu3 linux-libc-dev_2.6.24-16.30 gcc-4.2_4.2.3-2ubuntu7 g++-4.2_4.2.3-2ubuntu7 binutils_2.18.1~cvs20080103-0ubuntu1 libstdc++6_4.2.3-2ubuntu7 libstdc++6-4.2-dev_4.2.3-2ubuntu7
------------------------------------------------------------------------------
dpkg-source: extracting libx86 in libx86-0.99
dpkg-source: unpacking libx86_0.99-1.2ubuntu4.tar.gz
dpkg-buildpackage: set CPPFLAGS to default value: 
dpkg-buildpackage: set CFLAGS to default value: -g -O2
dpkg-buildpackage: set CXXFLAGS to default value: -g -O2
dpkg-buildpackage: set FFLAGS to default value: -g -O2
dpkg-buildpackage: set LDFLAGS to default value: -Wl,-Bsymbolic-functions
dpkg-buildpackage: source package libx86
dpkg-buildpackage: source version 0.99-1.2ubuntu4
dpkg-buildpackage: host architecture powerpc
 /usr/bin/fakeroot debian/rules clean
dh_testdir
dh_testroot
rm -f build-stamp configure-stamp
# Add here commands to clean up after the build process.
/usr/bin/make clean
make[1]: Entering directory `/build/buildd/libx86-0.99'
/usr/bin/make -C x86emu clean
make[2]: Entering directory `/build/buildd/libx86-0.99/x86emu'
rm -f *.a *.o *~
make[2]: Leaving directory `/build/buildd/libx86-0.99/x86emu'
rm -f *.o *~
rm -f *.so.1 *.a
make[1]: Leaving directory `/build/buildd/libx86-0.99'
dh_clean 
 debian/rules build
dh_testdir
# Add here commands to configure the package.
touch configure-stamp
dh_testdir
# Add here commands to compile the package.
/usr/bin/make BACKEND="x86emu"
make[1]: Entering directory `/build/buildd/libx86-0.99'
/usr/bin/make LIBRARY=static static
make[2]: Entering directory `/build/buildd/libx86-0.99'
cc -O2 -Wall -DDEBUG -g   -c -o x86-common.o x86-common.c
cc -O2 -Wall -DDEBUG -g   -c -o thunk.o thunk.c
thunk.c:14:20: error: sys/io.h: No such file or directory
make[2]: *** [thunk.o] Error 1
make[2]: Leaving directory `/build/buildd/libx86-0.99'
make[1]: *** [default] Error 2
make[1]: Leaving directory `/build/buildd/libx86-0.99'
make: *** [build-stamp] Error 2
dpkg-buildpackage: failure: debian/rules build gave error exit status 2
******************************************************************************
Build finished at 20080415-2003
FAILED [dpkg-buildpackage died]
Purging chroot-hardy-autotest/build/buildd/libx86-0.99
------------------------------------------------------------------------------
******************************************************************************
Finished at 20080415-2003
Build needed 00:00:01, 944k disk space




More information about the ubuntu-autotest mailing list