Log for failed build of pygtk_2.12.1-0ubuntu1 (dist=hardy-autotest)
Build Daemon user
noreply at buildd.ubuntu.com
Sun Apr 13 01:41:47 BST 2008
Automatic build of pygtk_2.12.1-0ubuntu1 on king by sbuild/amd64 1.170.5
Build started at 20080412-2303
******************************************************************************
Checking available source versions...
Fetching source files...
Reading package lists...
Building dependency tree...
Reading state information...
Need to get 3062kB of source archives.
Get:1 http://archive.internal hardy-autotest/main pygtk 2.12.1-0ubuntu1 (dsc) [1333B]
Get:2 http://archive.internal hardy-autotest/main pygtk 2.12.1-0ubuntu1 (tar) [3050kB]
Get:3 http://archive.internal hardy-autotest/main pygtk 2.12.1-0ubuntu1 (diff) [10.8kB]
Fetched 3062kB in 0s (7894kB/s)
Download complete and in download only mode
** Using build dependencies supplied by package:
Build-Depends: autotools-dev, cdbs, debhelper (>= 5), docbook-xsl, gnome-pkg-tools (>= 0.10), libatk1.0-dev (>= 1.12.0), libglade2-dev (>= 2.5.0), libglib2.0-dev (>= 2.8.0), libgtk2.0-dev (>= 2.12.0), libpango1.0-dev (>= 1.16.0), python-all-dbg, python-all-dev (>= 2.3.5-11), python-cairo-dev (>= 1.0.2), python-gobject-dev (>= 2.14), python-numeric (>= 24.2-3), python-support (>= 0.7.3), xsltproc, xvfb
Checking for already installed source dependencies...
autotools-dev: missing
cdbs: missing
debhelper: missing
docbook-xsl: missing
gnome-pkg-tools: missing
libatk1.0-dev: missing
libglade2-dev: missing
libglib2.0-dev: missing
libgtk2.0-dev: missing
libpango1.0-dev: missing
python-all-dbg: missing
python-all-dev: missing
python-cairo-dev: missing
python-gobject-dev: missing
python-numeric: missing
python-support: missing
xsltproc: missing
xvfb: missing
Checking for source dependency conflicts...
/usr/bin/sudo /usr/bin/apt-get --purge $CHROOT_OPTIONS -q -y install autotools-dev cdbs debhelper docbook-xsl gnome-pkg-tools libatk1.0-dev libglade2-dev libglib2.0-dev libgtk2.0-dev libpango1.0-dev python-all-dbg python-all-dev python-cairo-dev python-gobject-dev python-numeric python-support xsltproc xvfb
Reading package lists...
Building dependency tree...
Reading state information...
The following packages were automatically installed and are no longer required:
procps upstart-compat-sysv system-services startup-tasks upstart
Use 'apt-get autoremove' to remove them.
The following extra packages will be installed:
autoconf automake1.7 defoma fdupes file fontconfig fontconfig-config gettext
gettext-base html2text ifupdown intltool intltool-debian libatk1.0-0
libcairo2 libcairo2-dev libcupsys2 libdatrie0 libdbus-1-3 libexpat1
libexpat1-dev libffi4 libffi4-dev libfontconfig1 libfontconfig1-dev
libfontenc1 libfreetype6 libfreetype6-dev libgcrypt11 libglade2-0
libglib2.0-0 libgnutls13 libgpg-error0 libgtk2.0-0 libgtk2.0-common libhal1
libhtml-parser-perl libhtml-tagset-perl libhtml-tree-perl libice-dev libice6
libjpeg62 libkeyutils1 libkrb53 liblzo2-2 libmagic1 libncursesw5 libnewt0.52
libopencdk10 libpango1.0-0 libpango1.0-common libpcre3 libpixman-1-0
libpixman-1-dev libpng12-0 libpng12-dev libpopt0 libpthread-stubs0
libpthread-stubs0-dev libreadline5 libsm-dev libsm6 libsqlite3-0 libssl0.9.8
libtasn1-3 libthai-data libthai0 libtiff4 liburi-perl libwww-perl libx11-6
libx11-data libx11-dev libxau-dev libxau6 libxcb-xlib0 libxcb-xlib0-dev
libxcb1 libxcb1-dev libxcomposite-dev libxcomposite1 libxcursor-dev
libxcursor1 libxdamage-dev libxdamage1 libxdmcp-dev libxdmcp6 libxext-dev
libxext6 libxfixes-dev libxfixes3 libxfont1 libxft-dev libxft2 libxi-dev
libxi6 libxinerama-dev libxinerama1 libxml-parser-perl libxml2 libxml2-dev
libxmuu1 libxrandr-dev libxrandr2 libxrender-dev libxrender1 libxslt1.1 m4
mime-support net-tools netbase pkg-config po-debconf python python-all
python-cairo python-central python-dbg python-dev python-gobject python2.4
python2.4-dbg python2.4-dev python2.4-minimal python2.5 python2.5-dbg
python2.5-dev readline-common sgml-base ttf-dejavu ttf-dejavu-core
ttf-dejavu-extra ucf update-inetd whiptail x11-common x11proto-composite-dev
x11proto-core-dev x11proto-damage-dev x11proto-fixes-dev x11proto-input-dev
x11proto-kb-dev x11proto-randr-dev x11proto-render-dev x11proto-xext-dev
x11proto-xinerama-dev xauth xfonts-base xfonts-encodings xfonts-utils
xml-core xtrans-dev zlib1g-dev
Suggested packages:
autobook autoconf-archive autoconf-doc autoconf2.13 gnu-standards devscripts
doc-base dh-make defoma-doc dfontmgr psfontmgr x-ttcidfont-conf xalan fop
libsaxon-java libxalan2-java cvs gettext-doc dhcp3-client dhcp-client
iproute ppp libcairo2-doc cupsys-common lib32ffi4 rng-tools glade
glade-gnome libglib2.0-doc gnutls-bin librsvg2-common libgtk2.0-doc krb5-doc
krb5-user ttf-arphic-bkai00mp ttf-arphic-bsmi00lp ttf-arphic-gbsn00lp
ttf-arphic-gkai00mp ttf-baekmuk ttf-kochi-gothic ttf-kochi-mincho
ttf-thryomanes imagemagick libpango1.0-doc libio-socket-ssl-perl python-doc
python-profiler python-tk python-gobject-dbg python-numeric-dbg
python-numeric-ext python-numeric-tutorial python2.4-doc python-gdbm-dbg
python-tk-dbg binfmt-support python2.5-doc sgml-base-doc pdksh xfs xserver
Recommended packages:
automaken libft-perl docbook-xml docbook-xsl-doc-html docbook-xsl-doc-pdf
docbook-xsl-doc-text docbook-xsl-doc curl wget lynx svn-buildpackage
libatk1.0-data dbus libglib2.0-data hicolor-icon-theme libgtk2.0-bin
libgpmg1 libfribidi0 libcompress-zlib-perl libhtml-format-perl
libmailtools-perl libmail-box-perl libmail-sendmail-perl xbase-clients
The following NEW packages will be installed:
autoconf automake1.7 autotools-dev cdbs debhelper defoma docbook-xsl fdupes
file fontconfig fontconfig-config gettext gettext-base gnome-pkg-tools
html2text ifupdown intltool intltool-debian libatk1.0-0 libatk1.0-dev
libcairo2 libcairo2-dev libcupsys2 libdatrie0 libdbus-1-3 libexpat1
libexpat1-dev libffi4 libffi4-dev libfontconfig1 libfontconfig1-dev
libfontenc1 libfreetype6 libfreetype6-dev libgcrypt11 libglade2-0
libglade2-dev libglib2.0-0 libglib2.0-dev libgnutls13 libgpg-error0
libgtk2.0-0 libgtk2.0-common libgtk2.0-dev libhal1 libhtml-parser-perl
libhtml-tagset-perl libhtml-tree-perl libice-dev libice6 libjpeg62
libkeyutils1 libkrb53 liblzo2-2 libmagic1 libncursesw5 libnewt0.52
libopencdk10 libpango1.0-0 libpango1.0-common libpango1.0-dev libpcre3
libpixman-1-0 libpixman-1-dev libpng12-0 libpng12-dev libpopt0
libpthread-stubs0 libpthread-stubs0-dev libreadline5 libsm-dev libsm6
libsqlite3-0 libssl0.9.8 libtasn1-3 libthai-data libthai0 libtiff4
liburi-perl libwww-perl libx11-6 libx11-data libx11-dev libxau-dev libxau6
libxcb-xlib0 libxcb-xlib0-dev libxcb1 libxcb1-dev libxcomposite-dev
libxcomposite1 libxcursor-dev libxcursor1 libxdamage-dev libxdamage1
libxdmcp-dev libxdmcp6 libxext-dev libxext6 libxfixes-dev libxfixes3
libxfont1 libxft-dev libxft2 libxi-dev libxi6 libxinerama-dev libxinerama1
libxml-parser-perl libxml2 libxml2-dev libxmuu1 libxrandr-dev libxrandr2
libxrender-dev libxrender1 libxslt1.1 m4 mime-support net-tools netbase
pkg-config po-debconf python python-all python-all-dbg python-all-dev
python-cairo python-cairo-dev python-central python-dbg python-dev
python-gobject python-gobject-dev python-numeric python-support python2.4
python2.4-dbg python2.4-dev python2.4-minimal python2.5 python2.5-dbg
python2.5-dev readline-common sgml-base ttf-dejavu ttf-dejavu-core
ttf-dejavu-extra ucf update-inetd whiptail x11-common x11proto-composite-dev
x11proto-core-dev x11proto-damage-dev x11proto-fixes-dev x11proto-input-dev
x11proto-kb-dev x11proto-randr-dev x11proto-render-dev x11proto-xext-dev
x11proto-xinerama-dev xauth xfonts-base xfonts-encodings xfonts-utils
xml-core xsltproc xtrans-dev xvfb zlib1g-dev
0 upgraded, 171 newly installed, 0 to remove and 6 not upgraded.
Need to get 0B/76.9MB of archives.
After unpacking 241MB of additional disk space will be used.
WARNING: The following packages cannot be authenticated!
x11-common libice6 x11proto-core-dev libice-dev libsm6 libsm-dev libx11-data
libxau6 libxdmcp6 libxcb1 libxcb-xlib0 libx11-6 libxau-dev libpthread-stubs0
libpthread-stubs0-dev libxdmcp-dev libxcb1-dev libxcb-xlib0-dev
x11proto-input-dev x11proto-kb-dev xtrans-dev libx11-dev libxext6 libxfixes3
libxcomposite1 x11proto-xext-dev x11proto-fixes-dev libxfixes-dev
x11proto-composite-dev libxcomposite-dev libxrender1 libxcursor1
x11proto-render-dev libxrender-dev libxcursor-dev libxdamage1
x11proto-damage-dev libxdamage-dev libxext-dev libexpat1 libexpat1-dev
libmagic1 file libnewt0.52 libpopt0 whiptail defoma ttf-dejavu-core
ttf-dejavu-extra ttf-dejavu ucf fontconfig-config libfreetype6
libfontconfig1 zlib1g-dev libfreetype6-dev libpcre3 libglib2.0-0 pkg-config
libfontconfig1-dev libxft2 libxft-dev libxi6 libxi-dev libxinerama1
x11proto-xinerama-dev libxinerama-dev libxrandr2 x11proto-randr-dev
libxrandr-dev libxmuu1 xauth gettext-base net-tools ifupdown libdbus-1-3
libgpg-error0 libgcrypt11 liblzo2-2 libopencdk10 libtasn1-3 libgnutls13
libkeyutils1 libkrb53 libncursesw5 readline-common libreadline5 libsqlite3-0
libssl0.9.8 mime-support update-inetd netbase python2.5 python
libhtml-tagset-perl liburi-perl libhtml-parser-perl libhtml-tree-perl
libwww-perl libxml-parser-perl python-central python-support m4 autoconf
autotools-dev automake1.7 html2text gettext intltool-debian po-debconf
debhelper fdupes intltool cdbs sgml-base xml-core docbook-xsl fontconfig
gnome-pkg-tools libatk1.0-0 libglib2.0-dev libatk1.0-dev libpixman-1-0
libpng12-0 libcairo2 libpixman-1-dev libpng12-dev libcairo2-dev libcupsys2
libdatrie0 libffi4 libffi4-dev libfontenc1 libgtk2.0-common libjpeg62
libpango1.0-common libthai-data libthai0 libpango1.0-0 libtiff4 libgtk2.0-0
libxml2 libglade2-0 libpango1.0-dev libgtk2.0-dev libxml2-dev libglade2-dev
libhal1 libxfont1 libxslt1.1 python2.4-minimal python2.4 python-all
python2.5-dev python-dev python2.4-dev python-all-dev python-cairo
python-cairo-dev python-gobject python-gobject-dev python-numeric
xfonts-encodings xfonts-utils xfonts-base xsltproc xvfb python2.5-dbg
python-dbg python2.4-dbg python-all-dbg
Authentication warning overridden.
Selecting previously deselected package x11-common.
(Reading database ... 9482 files and directories currently installed.)
Unpacking x11-common (from .../x11-common_1%3a7.3+10ubuntu8_amd64.deb) ...
Selecting previously deselected package libice6.
Unpacking libice6 (from .../libice6_2%3a1.0.4-1_amd64.deb) ...
Setting up x11-common (7.3+10ubuntu8) ...
Selecting previously deselected package x11proto-core-dev.
(Reading database ... 9528 files and directories currently installed.)
Unpacking x11proto-core-dev (from .../x11proto-core-dev_7.0.11-1_all.deb) ...
Selecting previously deselected package libice-dev.
Unpacking libice-dev (from .../libice-dev_2%3a1.0.4-1_amd64.deb) ...
Selecting previously deselected package libsm6.
Unpacking libsm6 (from .../libsm6_2%3a1.0.3-1_amd64.deb) ...
Selecting previously deselected package libsm-dev.
Unpacking libsm-dev (from .../libsm-dev_2%3a1.0.3-1_amd64.deb) ...
Selecting previously deselected package libx11-data.
Unpacking libx11-data (from .../libx11-data_2%3a1.1.3-1ubuntu2_all.deb) ...
Selecting previously deselected package libxau6.
Unpacking libxau6 (from .../libxau6_1%3a1.0.3-2_amd64.deb) ...
Selecting previously deselected package libxdmcp6.
Unpacking libxdmcp6 (from .../libxdmcp6_1%3a1.0.2-2_amd64.deb) ...
Selecting previously deselected package libxcb1.
Unpacking libxcb1 (from .../libxcb1_1.1-1ubuntu1_amd64.deb) ...
Selecting previously deselected package libxcb-xlib0.
Unpacking libxcb-xlib0 (from .../libxcb-xlib0_1.1-1ubuntu1_amd64.deb) ...
Selecting previously deselected package libx11-6.
Unpacking libx11-6 (from .../libx11-6_2%3a1.1.3-1ubuntu2_amd64.deb) ...
Selecting previously deselected package libxau-dev.
Unpacking libxau-dev (from .../libxau-dev_1%3a1.0.3-2_amd64.deb) ...
Selecting previously deselected package libpthread-stubs0.
Unpacking libpthread-stubs0 (from .../libpthread-stubs0_0.1-2_amd64.deb) ...
Selecting previously deselected package libpthread-stubs0-dev.
Unpacking libpthread-stubs0-dev (from .../libpthread-stubs0-dev_0.1-2_amd64.deb) ...
Selecting previously deselected package libxdmcp-dev.
Unpacking libxdmcp-dev (from .../libxdmcp-dev_1%3a1.0.2-2_amd64.deb) ...
Selecting previously deselected package libxcb1-dev.
Unpacking libxcb1-dev (from .../libxcb1-dev_1.1-1ubuntu1_amd64.deb) ...
Selecting previously deselected package libxcb-xlib0-dev.
Unpacking libxcb-xlib0-dev (from .../libxcb-xlib0-dev_1.1-1ubuntu1_amd64.deb) ...
Selecting previously deselected package x11proto-input-dev.
Unpacking x11proto-input-dev (from .../x11proto-input-dev_1.4.2-1_all.deb) ...
Selecting previously deselected package x11proto-kb-dev.
Unpacking x11proto-kb-dev (from .../x11proto-kb-dev_1.0.3-2ubuntu1_all.deb) ...
Selecting previously deselected package xtrans-dev.
Unpacking xtrans-dev (from .../xtrans-dev_1.0.4-1_all.deb) ...
Selecting previously deselected package libx11-dev.
Unpacking libx11-dev (from .../libx11-dev_2%3a1.1.3-1ubuntu2_amd64.deb) ...
Selecting previously deselected package libxext6.
Unpacking libxext6 (from .../libxext6_2%3a1.0.3-2build1_amd64.deb) ...
Selecting previously deselected package libxfixes3.
Unpacking libxfixes3 (from .../libxfixes3_1%3a4.0.3-2_amd64.deb) ...
Selecting previously deselected package libxcomposite1.
Unpacking libxcomposite1 (from .../libxcomposite1_1%3a0.4.0-1_amd64.deb) ...
Selecting previously deselected package x11proto-xext-dev.
Unpacking x11proto-xext-dev (from .../x11proto-xext-dev_7.0.2-5ubuntu1_all.deb) ...
Selecting previously deselected package x11proto-fixes-dev.
Unpacking x11proto-fixes-dev (from .../x11proto-fixes-dev_1%3a4.0-2ubuntu1_all.deb) ...
Selecting previously deselected package libxfixes-dev.
Unpacking libxfixes-dev (from .../libxfixes-dev_1%3a4.0.3-2_amd64.deb) ...
Selecting previously deselected package x11proto-composite-dev.
Unpacking x11proto-composite-dev (from .../x11proto-composite-dev_1%3a0.4-2_all.deb) ...
Selecting previously deselected package libxcomposite-dev.
Unpacking libxcomposite-dev (from .../libxcomposite-dev_1%3a0.4.0-1_amd64.deb) ...
Selecting previously deselected package libxrender1.
Unpacking libxrender1 (from .../libxrender1_1%3a0.9.4-1_amd64.deb) ...
Selecting previously deselected package libxcursor1.
Unpacking libxcursor1 (from .../libxcursor1_1%3a1.1.9-1_amd64.deb) ...
Selecting previously deselected package x11proto-render-dev.
Unpacking x11proto-render-dev (from .../x11proto-render-dev_2%3a0.9.3-2_all.deb) ...
Selecting previously deselected package libxrender-dev.
Unpacking libxrender-dev (from .../libxrender-dev_1%3a0.9.4-1_amd64.deb) ...
Selecting previously deselected package libxcursor-dev.
Unpacking libxcursor-dev (from .../libxcursor-dev_1%3a1.1.9-1_amd64.deb) ...
Selecting previously deselected package libxdamage1.
Unpacking libxdamage1 (from .../libxdamage1_1%3a1.1.1-3_amd64.deb) ...
Selecting previously deselected package x11proto-damage-dev.
Unpacking x11proto-damage-dev (from .../x11proto-damage-dev_1%3a1.1.0-2build1_all.deb) ...
Selecting previously deselected package libxdamage-dev.
Unpacking libxdamage-dev (from .../libxdamage-dev_1%3a1.1.1-3_amd64.deb) ...
Selecting previously deselected package libxext-dev.
Unpacking libxext-dev (from .../libxext-dev_2%3a1.0.3-2build1_amd64.deb) ...
Selecting previously deselected package libexpat1.
Unpacking libexpat1 (from .../libexpat1_2.0.1-0ubuntu1_amd64.deb) ...
Selecting previously deselected package libexpat1-dev.
Unpacking libexpat1-dev (from .../libexpat1-dev_2.0.1-0ubuntu1_amd64.deb) ...
Selecting previously deselected package libmagic1.
Unpacking libmagic1 (from .../libmagic1_4.21-3_amd64.deb) ...
Selecting previously deselected package file.
Unpacking file (from .../archives/file_4.21-3_amd64.deb) ...
Selecting previously deselected package libnewt0.52.
Unpacking libnewt0.52 (from .../libnewt0.52_0.52.2-11.2ubuntu1_amd64.deb) ...
Selecting previously deselected package libpopt0.
Unpacking libpopt0 (from .../libpopt0_1.10-3build1_amd64.deb) ...
Selecting previously deselected package whiptail.
Unpacking whiptail (from .../whiptail_0.52.2-11.2ubuntu1_amd64.deb) ...
Selecting previously deselected package defoma.
Unpacking defoma (from .../defoma_0.11.10-0.2_all.deb) ...
Selecting previously deselected package ttf-dejavu-core.
Unpacking ttf-dejavu-core (from .../ttf-dejavu-core_2.23-1_all.deb) ...
Selecting previously deselected package ttf-dejavu-extra.
Unpacking ttf-dejavu-extra (from .../ttf-dejavu-extra_2.23-1_all.deb) ...
Selecting previously deselected package ttf-dejavu.
Unpacking ttf-dejavu (from .../ttf-dejavu_2.23-1_all.deb) ...
Selecting previously deselected package ucf.
Unpacking ucf (from .../apt/archives/ucf_3.005_all.deb) ...
Moving old data out of the way
Selecting previously deselected package fontconfig-config.
Unpacking fontconfig-config (from .../fontconfig-config_2.5.0-2ubuntu3_all.deb) ...
Selecting previously deselected package libfreetype6.
Unpacking libfreetype6 (from .../libfreetype6_2.3.5-1ubuntu4_amd64.deb) ...
Selecting previously deselected package libfontconfig1.
Unpacking libfontconfig1 (from .../libfontconfig1_2.5.0-2ubuntu3_amd64.deb) ...
Selecting previously deselected package zlib1g-dev.
Unpacking zlib1g-dev (from .../zlib1g-dev_1%3a1.2.3.3.dfsg-7ubuntu1_amd64.deb) ...
Selecting previously deselected package libfreetype6-dev.
Unpacking libfreetype6-dev (from .../libfreetype6-dev_2.3.5-1ubuntu4_amd64.deb) ...
Selecting previously deselected package libpcre3.
Unpacking libpcre3 (from .../libpcre3_7.4-1ubuntu2_amd64.deb) ...
Selecting previously deselected package libglib2.0-0.
Unpacking libglib2.0-0 (from .../libglib2.0-0_2.16.3-1_amd64.deb) ...
Selecting previously deselected package pkg-config.
Unpacking pkg-config (from .../pkg-config_0.22-1_amd64.deb) ...
Selecting previously deselected package libfontconfig1-dev.
Unpacking libfontconfig1-dev (from .../libfontconfig1-dev_2.5.0-2ubuntu3_amd64.deb) ...
Selecting previously deselected package libxft2.
Unpacking libxft2 (from .../libxft2_2.1.12-2ubuntu5_amd64.deb) ...
Selecting previously deselected package libxft-dev.
Unpacking libxft-dev (from .../libxft-dev_2.1.12-2ubuntu5_amd64.deb) ...
Selecting previously deselected package libxi6.
Unpacking libxi6 (from .../libxi6_2%3a1.1.3-1_amd64.deb) ...
Selecting previously deselected package libxi-dev.
Unpacking libxi-dev (from .../libxi-dev_2%3a1.1.3-1_amd64.deb) ...
Selecting previously deselected package libxinerama1.
Unpacking libxinerama1 (from .../libxinerama1_2%3a1.0.2-1build1_amd64.deb) ...
Selecting previously deselected package x11proto-xinerama-dev.
Unpacking x11proto-xinerama-dev (from .../x11proto-xinerama-dev_1.1.2-4ubuntu1_all.deb) ...
Selecting previously deselected package libxinerama-dev.
Unpacking libxinerama-dev (from .../libxinerama-dev_2%3a1.0.2-1build1_amd64.deb) ...
Selecting previously deselected package libxrandr2.
Unpacking libxrandr2 (from .../libxrandr2_2%3a1.2.2-1_amd64.deb) ...
Selecting previously deselected package x11proto-randr-dev.
Unpacking x11proto-randr-dev (from .../x11proto-randr-dev_1.2.1-2_all.deb) ...
Selecting previously deselected package libxrandr-dev.
Unpacking libxrandr-dev (from .../libxrandr-dev_2%3a1.2.2-1_amd64.deb) ...
Selecting previously deselected package libxmuu1.
Unpacking libxmuu1 (from .../libxmuu1_2%3a1.0.4-1_amd64.deb) ...
Selecting previously deselected package xauth.
Unpacking xauth (from .../xauth_1%3a1.0.2-2_amd64.deb) ...
Selecting previously deselected package gettext-base.
Unpacking gettext-base (from .../gettext-base_0.17-2ubuntu1_amd64.deb) ...
Selecting previously deselected package net-tools.
Unpacking net-tools (from .../net-tools_1.60-19ubuntu1_amd64.deb) ...
Selecting previously deselected package ifupdown.
Unpacking ifupdown (from .../ifupdown_0.6.8ubuntu8_amd64.deb) ...
Selecting previously deselected package libdbus-1-3.
Unpacking libdbus-1-3 (from .../libdbus-1-3_1.1.20-1ubuntu1_amd64.deb) ...
Selecting previously deselected package libgpg-error0.
Unpacking libgpg-error0 (from .../libgpg-error0_1.4-2ubuntu7_amd64.deb) ...
Selecting previously deselected package libgcrypt11.
Unpacking libgcrypt11 (from .../libgcrypt11_1.2.4-2ubuntu7_amd64.deb) ...
Selecting previously deselected package liblzo2-2.
Unpacking liblzo2-2 (from .../liblzo2-2_2.02-3_amd64.deb) ...
Selecting previously deselected package libopencdk10.
Unpacking libopencdk10 (from .../libopencdk10_0.6.6-1ubuntu1_amd64.deb) ...
Selecting previously deselected package libtasn1-3.
Unpacking libtasn1-3 (from .../libtasn1-3_1.1-1_amd64.deb) ...
Selecting previously deselected package libgnutls13.
Unpacking libgnutls13 (from .../libgnutls13_2.0.4-1ubuntu2_amd64.deb) ...
Selecting previously deselected package libkeyutils1.
Unpacking libkeyutils1 (from .../libkeyutils1_1.2-4_amd64.deb) ...
Selecting previously deselected package libkrb53.
Unpacking libkrb53 (from .../libkrb53_1.6.dfsg.3~beta1-2ubuntu1_amd64.deb) ...
Selecting previously deselected package libncursesw5.
Unpacking libncursesw5 (from .../libncursesw5_5.6+20071124-1ubuntu2_amd64.deb) ...
Selecting previously deselected package readline-common.
Unpacking readline-common (from .../readline-common_5.2-3build1_all.deb) ...
Selecting previously deselected package libreadline5.
Unpacking libreadline5 (from .../libreadline5_5.2-3build1_amd64.deb) ...
Selecting previously deselected package libsqlite3-0.
Unpacking libsqlite3-0 (from .../libsqlite3-0_3.4.2-2_amd64.deb) ...
Selecting previously deselected package libssl0.9.8.
Unpacking libssl0.9.8 (from .../libssl0.9.8_0.9.8g-4ubuntu2_amd64.deb) ...
Selecting previously deselected package mime-support.
Unpacking mime-support (from .../mime-support_3.39-1ubuntu1_all.deb) ...
Selecting previously deselected package update-inetd.
Unpacking update-inetd (from .../update-inetd_4.27-0.6_all.deb) ...
Selecting previously deselected package netbase.
Unpacking netbase (from .../netbase_4.30ubuntu1_all.deb) ...
Selecting previously deselected package python2.5.
Unpacking python2.5 (from .../python2.5_2.5.2-2ubuntu3_amd64.deb) ...
Selecting previously deselected package python.
Unpacking python (from .../python_2.5.2-0ubuntu1_all.deb) ...
Selecting previously deselected package libhtml-tagset-perl.
Unpacking libhtml-tagset-perl (from .../libhtml-tagset-perl_3.10-2_all.deb) ...
Selecting previously deselected package liburi-perl.
Unpacking liburi-perl (from .../liburi-perl_1.35.dfsg.1-1_all.deb) ...
Selecting previously deselected package libhtml-parser-perl.
Unpacking libhtml-parser-perl (from .../libhtml-parser-perl_3.56-1_amd64.deb) ...
Selecting previously deselected package libhtml-tree-perl.
Unpacking libhtml-tree-perl (from .../libhtml-tree-perl_3.23-1_all.deb) ...
Selecting previously deselected package libwww-perl.
Unpacking libwww-perl (from .../libwww-perl_5.808-1_all.deb) ...
Selecting previously deselected package libxml-parser-perl.
Unpacking libxml-parser-perl (from .../libxml-parser-perl_2.34-4.3_amd64.deb) ...
Selecting previously deselected package python-central.
Unpacking python-central (from .../python-central_0.6.1ubuntu2_all.deb) ...
Selecting previously deselected package python-support.
Unpacking python-support (from .../python-support_0.7.5ubuntu1_all.deb) ...
Selecting previously deselected package m4.
Unpacking m4 (from .../archives/m4_1.4.10-1_amd64.deb) ...
Selecting previously deselected package autoconf.
Unpacking autoconf (from .../autoconf_2.61-4_all.deb) ...
Selecting previously deselected package autotools-dev.
Unpacking autotools-dev (from .../autotools-dev_20070725.1_all.deb) ...
Selecting previously deselected package automake1.7.
Unpacking automake1.7 (from .../automake1.7_1.7.9-9_all.deb) ...
Selecting previously deselected package html2text.
Unpacking html2text (from .../html2text_1.3.2a-3build2_amd64.deb) ...
Selecting previously deselected package gettext.
Unpacking gettext (from .../gettext_0.17-2ubuntu1_amd64.deb) ...
Selecting previously deselected package intltool-debian.
Unpacking intltool-debian (from .../intltool-debian_0.35.0+20060710.1_all.deb) ...
Selecting previously deselected package po-debconf.
Unpacking po-debconf (from .../po-debconf_1.0.10_all.deb) ...
Selecting previously deselected package debhelper.
Unpacking debhelper (from .../debhelper_6.0.4ubuntu1_all.deb) ...
Selecting previously deselected package fdupes.
Unpacking fdupes (from .../fdupes_1.40-4build1_amd64.deb) ...
Selecting previously deselected package intltool.
Unpacking intltool (from .../intltool_0.37.1-1ubuntu1_all.deb) ...
Selecting previously deselected package cdbs.
Unpacking cdbs (from .../cdbs_0.4.51ubuntu1_all.deb) ...
Selecting previously deselected package sgml-base.
Unpacking sgml-base (from .../sgml-base_1.26_all.deb) ...
Selecting previously deselected package xml-core.
Unpacking xml-core (from .../archives/xml-core_0.11_all.deb) ...
Selecting previously deselected package docbook-xsl.
Unpacking docbook-xsl (from .../docbook-xsl_1.73.2.dfsg.1-2_all.deb) ...
Selecting previously deselected package fontconfig.
Unpacking fontconfig (from .../fontconfig_2.5.0-2ubuntu3_amd64.deb) ...
Selecting previously deselected package gnome-pkg-tools.
Unpacking gnome-pkg-tools (from .../gnome-pkg-tools_0.13_all.deb) ...
Selecting previously deselected package libatk1.0-0.
Unpacking libatk1.0-0 (from .../libatk1.0-0_1.22.0-0ubuntu1_amd64.deb) ...
Selecting previously deselected package libglib2.0-dev.
Unpacking libglib2.0-dev (from .../libglib2.0-dev_2.16.3-1_amd64.deb) ...
Selecting previously deselected package libatk1.0-dev.
Unpacking libatk1.0-dev (from .../libatk1.0-dev_1.22.0-0ubuntu1_amd64.deb) ...
Selecting previously deselected package libpixman-1-0.
Unpacking libpixman-1-0 (from .../libpixman-1-0_0.10.0-0ubuntu1_amd64.deb) ...
Selecting previously deselected package libpng12-0.
Unpacking libpng12-0 (from .../libpng12-0_1.2.15~beta5-3_amd64.deb) ...
Selecting previously deselected package libcairo2.
Unpacking libcairo2 (from .../libcairo2_1.6.0-0ubuntu1_amd64.deb) ...
Selecting previously deselected package libpixman-1-dev.
Unpacking libpixman-1-dev (from .../libpixman-1-dev_0.10.0-0ubuntu1_amd64.deb) ...
Selecting previously deselected package libpng12-dev.
Unpacking libpng12-dev (from .../libpng12-dev_1.2.15~beta5-3_amd64.deb) ...
Selecting previously deselected package libcairo2-dev.
Unpacking libcairo2-dev (from .../libcairo2-dev_1.6.0-0ubuntu1_amd64.deb) ...
Selecting previously deselected package libcupsys2.
Unpacking libcupsys2 (from .../libcupsys2_1.3.7-1ubuntu2_amd64.deb) ...
Selecting previously deselected package libdatrie0.
Unpacking libdatrie0 (from .../libdatrie0_0.1.2-2_amd64.deb) ...
Selecting previously deselected package libffi4.
Unpacking libffi4 (from .../libffi4_4.2.3-2ubuntu7_amd64.deb) ...
Selecting previously deselected package libffi4-dev.
Unpacking libffi4-dev (from .../libffi4-dev_4.2.3-2ubuntu7_amd64.deb) ...
Selecting previously deselected package libfontenc1.
Unpacking libfontenc1 (from .../libfontenc1_1%3a1.0.4-2_amd64.deb) ...
Selecting previously deselected package libgtk2.0-common.
Unpacking libgtk2.0-common (from .../libgtk2.0-common_2.12.9-2ubuntu2_all.deb) ...
Selecting previously deselected package libjpeg62.
Unpacking libjpeg62 (from .../libjpeg62_6b-14_amd64.deb) ...
Selecting previously deselected package libpango1.0-common.
Unpacking libpango1.0-common (from .../libpango1.0-common_1.20.1-1_all.deb) ...
Selecting previously deselected package libthai-data.
Unpacking libthai-data (from .../libthai-data_0.1.9-1_all.deb) ...
Selecting previously deselected package libthai0.
Unpacking libthai0 (from .../libthai0_0.1.9-1_amd64.deb) ...
Selecting previously deselected package libpango1.0-0.
Unpacking libpango1.0-0 (from .../libpango1.0-0_1.20.1-1_amd64.deb) ...
Selecting previously deselected package libtiff4.
Unpacking libtiff4 (from .../libtiff4_3.8.2-7ubuntu3_amd64.deb) ...
Selecting previously deselected package libgtk2.0-0.
Unpacking libgtk2.0-0 (from .../libgtk2.0-0_2.12.9-2ubuntu2_amd64.deb) ...
Selecting previously deselected package libxml2.
Unpacking libxml2 (from .../libxml2_2.6.31.dfsg-2ubuntu1_amd64.deb) ...
Selecting previously deselected package libglade2-0.
Unpacking libglade2-0 (from .../libglade2-0_1%3a2.6.2-1_amd64.deb) ...
Selecting previously deselected package libpango1.0-dev.
Unpacking libpango1.0-dev (from .../libpango1.0-dev_1.20.1-1_amd64.deb) ...
Selecting previously deselected package libgtk2.0-dev.
Unpacking libgtk2.0-dev (from .../libgtk2.0-dev_2.12.9-2ubuntu2_amd64.deb) ...
Selecting previously deselected package libxml2-dev.
Unpacking libxml2-dev (from .../libxml2-dev_2.6.31.dfsg-2ubuntu1_amd64.deb) ...
Selecting previously deselected package libglade2-dev.
Unpacking libglade2-dev (from .../libglade2-dev_1%3a2.6.2-1_amd64.deb) ...
Selecting previously deselected package libhal1.
Unpacking libhal1 (from .../libhal1_0.5.11~rc2-1ubuntu6_amd64.deb) ...
Selecting previously deselected package libxfont1.
Unpacking libxfont1 (from .../libxfont1_1%3a1.3.1-2_amd64.deb) ...
Selecting previously deselected package libxslt1.1.
Unpacking libxslt1.1 (from .../libxslt1.1_1.1.22-1ubuntu1_amd64.deb) ...
Selecting previously deselected package python2.4-minimal.
Unpacking python2.4-minimal (from .../python2.4-minimal_2.4.5-1ubuntu2_amd64.deb) ...
Selecting previously deselected package python2.4.
Unpacking python2.4 (from .../python2.4_2.4.5-1ubuntu2_amd64.deb) ...
Selecting previously deselected package python-all.
Unpacking python-all (from .../python-all_2.5.2-0ubuntu1_all.deb) ...
Selecting previously deselected package python2.5-dev.
Unpacking python2.5-dev (from .../python2.5-dev_2.5.2-2ubuntu3_amd64.deb) ...
Selecting previously deselected package python-dev.
Unpacking python-dev (from .../python-dev_2.5.2-0ubuntu1_all.deb) ...
Selecting previously deselected package python2.4-dev.
Unpacking python2.4-dev (from .../python2.4-dev_2.4.5-1ubuntu2_amd64.deb) ...
Selecting previously deselected package python-all-dev.
Unpacking python-all-dev (from .../python-all-dev_2.5.2-0ubuntu1_all.deb) ...
Selecting previously deselected package python-cairo.
Unpacking python-cairo (from .../python-cairo_1.4.0-2ubuntu2_amd64.deb) ...
Selecting previously deselected package python-cairo-dev.
Unpacking python-cairo-dev (from .../python-cairo-dev_1.4.0-2ubuntu2_all.deb) ...
Selecting previously deselected package python-gobject.
Unpacking python-gobject (from .../python-gobject_2.14.1-2ubuntu2_amd64.deb) ...
Selecting previously deselected package python-gobject-dev.
Unpacking python-gobject-dev (from .../python-gobject-dev_2.14.1-2ubuntu2_all.deb) ...
Selecting previously deselected package python-numeric.
Unpacking python-numeric (from .../python-numeric_24.2-8ubuntu2_amd64.deb) ...
Selecting previously deselected package xfonts-encodings.
Unpacking xfonts-encodings (from .../xfonts-encodings_1%3a1.0.2-3_all.deb) ...
Selecting previously deselected package xfonts-utils.
Unpacking xfonts-utils (from .../xfonts-utils_1%3a1.0.1-2ubuntu1_amd64.deb) ...
Selecting previously deselected package xfonts-base.
Unpacking xfonts-base (from .../xfonts-base_1%3a1.0.0-5_all.deb) ...
Selecting previously deselected package xsltproc.
Unpacking xsltproc (from .../xsltproc_1.1.22-1ubuntu1_amd64.deb) ...
Selecting previously deselected package xvfb.
Unpacking xvfb (from .../xvfb_2%3a1.4.1~git20080131-1ubuntu7_amd64.deb) ...
Selecting previously deselected package python2.5-dbg.
Unpacking python2.5-dbg (from .../python2.5-dbg_2.5.2-2ubuntu3_amd64.deb) ...
Selecting previously deselected package python-dbg.
Unpacking python-dbg (from .../python-dbg_2.5.2-0ubuntu1_all.deb) ...
Selecting previously deselected package python2.4-dbg.
Unpacking python2.4-dbg (from .../python2.4-dbg_2.4.5-1ubuntu2_amd64.deb) ...
Selecting previously deselected package python-all-dbg.
Unpacking python-all-dbg (from .../python-all-dbg_2.5.2-0ubuntu1_all.deb) ...
Setting up libice6 (1.0.4-1) ...
Setting up x11proto-core-dev (7.0.11-1) ...
Setting up libice-dev (1.0.4-1) ...
Setting up libsm6 (1.0.3-1) ...
Setting up libsm-dev (1.0.3-1) ...
Setting up libx11-data (1.1.3-1ubuntu2) ...
Setting up libxau6 (1.0.3-2) ...
Setting up libxdmcp6 (1.0.2-2) ...
Setting up libxcb1 (1.1-1ubuntu1) ...
Setting up libxcb-xlib0 (1.1-1ubuntu1) ...
Setting up libx11-6 (1.1.3-1ubuntu2) ...
Setting up libxau-dev (1.0.3-2) ...
Setting up libpthread-stubs0 (0.1-2) ...
Setting up libpthread-stubs0-dev (0.1-2) ...
Setting up libxdmcp-dev (1.0.2-2) ...
Setting up libxcb1-dev (1.1-1ubuntu1) ...
Setting up libxcb-xlib0-dev (1.1-1ubuntu1) ...
Setting up x11proto-input-dev (1.4.2-1) ...
Setting up x11proto-kb-dev (1.0.3-2ubuntu1) ...
Setting up xtrans-dev (1.0.4-1) ...
Setting up libx11-dev (1.1.3-1ubuntu2) ...
Setting up libxext6 (1.0.3-2build1) ...
Setting up libxfixes3 (4.0.3-2) ...
Setting up libxcomposite1 (0.4.0-1) ...
Setting up x11proto-xext-dev (7.0.2-5ubuntu1) ...
Setting up x11proto-fixes-dev (4.0-2ubuntu1) ...
Setting up libxfixes-dev (4.0.3-2) ...
Setting up x11proto-composite-dev (0.4-2) ...
Setting up libxcomposite-dev (0.4.0-1) ...
Setting up libxrender1 (0.9.4-1) ...
Setting up libxcursor1 (1.1.9-1) ...
Setting up x11proto-render-dev (0.9.3-2) ...
Setting up libxrender-dev (0.9.4-1) ...
Setting up libxcursor-dev (1.1.9-1) ...
Setting up libxdamage1 (1.1.1-3) ...
Setting up x11proto-damage-dev (1.1.0-2build1) ...
Setting up libxdamage-dev (1.1.1-3) ...
Setting up libxext-dev (1.0.3-2build1) ...
Setting up libexpat1 (2.0.1-0ubuntu1) ...
Setting up libexpat1-dev (2.0.1-0ubuntu1) ...
Setting up libmagic1 (4.21-3) ...
Setting up file (4.21-3) ...
Setting up libnewt0.52 (0.52.2-11.2ubuntu1) ...
Setting up libpopt0 (1.10-3build1) ...
Setting up whiptail (0.52.2-11.2ubuntu1) ...
Setting up defoma (0.11.10-0.2) ...
Setting up ttf-dejavu-core (2.23-1) ...
Setting up ttf-dejavu-extra (2.23-1) ...
Setting up ttf-dejavu (2.23-1) ...
Setting up ucf (3.005) ...
Setting up fontconfig-config (2.5.0-2ubuntu3) ...
Setting up libfreetype6 (2.3.5-1ubuntu4) ...
Setting up libfontconfig1 (2.5.0-2ubuntu3) ...
Setting up zlib1g-dev (1.2.3.3.dfsg-7ubuntu1) ...
Setting up libfreetype6-dev (2.3.5-1ubuntu4) ...
Setting up libpcre3 (7.4-1ubuntu2) ...
Setting up libglib2.0-0 (2.16.3-1) ...
Setting up pkg-config (0.22-1) ...
Setting up libfontconfig1-dev (2.5.0-2ubuntu3) ...
Setting up libxft2 (2.1.12-2ubuntu5) ...
Setting up libxft-dev (2.1.12-2ubuntu5) ...
Setting up libxi6 (1.1.3-1) ...
Setting up libxi-dev (1.1.3-1) ...
Setting up libxinerama1 (1.0.2-1build1) ...
Setting up x11proto-xinerama-dev (1.1.2-4ubuntu1) ...
Setting up libxinerama-dev (1.0.2-1build1) ...
Setting up libxrandr2 (1.2.2-1) ...
Setting up x11proto-randr-dev (1.2.1-2) ...
Setting up libxrandr-dev (1.2.2-1) ...
Setting up libxmuu1 (1.0.4-1) ...
Setting up xauth (1.0.2-2) ...
Setting up gettext-base (0.17-2ubuntu1) ...
Setting up net-tools (1.60-19ubuntu1) ...
Setting up ifupdown (0.6.8ubuntu8) ...
ifupdown.postinst: Warning: No 'iface lo' definition found in /etc/network/interfaces
ifupdown.postinst: Warning: No 'auto lo' statement found in /etc/network/interfaces
Setting up libdbus-1-3 (1.1.20-1ubuntu1) ...
Setting up libgpg-error0 (1.4-2ubuntu7) ...
Setting up libgcrypt11 (1.2.4-2ubuntu7) ...
Setting up liblzo2-2 (2.02-3) ...
Setting up libopencdk10 (0.6.6-1ubuntu1) ...
Setting up libtasn1-3 (1.1-1) ...
Setting up libgnutls13 (2.0.4-1ubuntu2) ...
Setting up libkeyutils1 (1.2-4) ...
Setting up libkrb53 (1.6.dfsg.3~beta1-2ubuntu1) ...
Setting up libncursesw5 (5.6+20071124-1ubuntu2) ...
Setting up readline-common (5.2-3build1) ...
Setting up libreadline5 (5.2-3build1) ...
Setting up libsqlite3-0 (3.4.2-2) ...
Setting up libssl0.9.8 (0.9.8g-4ubuntu2) ...
Setting up mime-support (3.39-1ubuntu1) ...
Setting up update-inetd (4.27-0.6) ...
Setting up netbase (4.30ubuntu1) ...
Setting up python2.5 (2.5.2-2ubuntu3) ...
Setting up python (2.5.2-0ubuntu1) ...
Setting up libhtml-tagset-perl (3.10-2) ...
Setting up liburi-perl (1.35.dfsg.1-1) ...
Setting up libhtml-parser-perl (3.56-1) ...
Setting up libhtml-tree-perl (3.23-1) ...
Setting up libwww-perl (5.808-1) ...
Setting up libxml-parser-perl (2.34-4.3) ...
Setting up python-central (0.6.1ubuntu2) ...
Setting up python-support (0.7.5ubuntu1) ...
Setting up m4 (1.4.10-1) ...
Setting up autoconf (2.61-4) ...
Setting up autotools-dev (20070725.1) ...
Setting up automake1.7 (1.7.9-9) ...
Setting up html2text (1.3.2a-3build2) ...
Setting up gettext (0.17-2ubuntu1) ...
Setting up intltool-debian (0.35.0+20060710.1) ...
Setting up po-debconf (1.0.10) ...
Setting up debhelper (6.0.4ubuntu1) ...
Setting up fdupes (1.40-4build1) ...
Setting up intltool (0.37.1-1ubuntu1) ...
Setting up cdbs (0.4.51ubuntu1) ...
Setting up sgml-base (1.26) ...
Setting up xml-core (0.11) ...
Setting up docbook-xsl (1.73.2.dfsg.1-2) ...
Setting up fontconfig (2.5.0-2ubuntu3) ...
Updating font configuration of fontconfig...
Cleaning up category cid..
Cleaning up category truetype..
Cleaning up category type1..
Updating category type1..
Updating category truetype..
Updating category cid..
Updating fontconfig cache for /usr/share/fonts/truetype/ttf-dejavu
Cleaning up old fontconfig caches... done.
Regenerating fonts cache... done.
Setting up gnome-pkg-tools (0.13) ...
Setting up libatk1.0-0 (1.22.0-0ubuntu1) ...
Setting up libglib2.0-dev (2.16.3-1) ...
Setting up libatk1.0-dev (1.22.0-0ubuntu1) ...
Setting up libpixman-1-0 (0.10.0-0ubuntu1) ...
Setting up libpng12-0 (1.2.15~beta5-3) ...
Setting up libcairo2 (1.6.0-0ubuntu1) ...
Setting up libpixman-1-dev (0.10.0-0ubuntu1) ...
Setting up libpng12-dev (1.2.15~beta5-3) ...
Setting up libcairo2-dev (1.6.0-0ubuntu1) ...
Setting up libcupsys2 (1.3.7-1ubuntu2) ...
Setting up libdatrie0 (0.1.2-2) ...
Setting up libffi4 (4.2.3-2ubuntu7) ...
Setting up libffi4-dev (4.2.3-2ubuntu7) ...
Setting up libfontenc1 (1.0.4-2) ...
Setting up libgtk2.0-common (2.12.9-2ubuntu2) ...
Setting up libjpeg62 (6b-14) ...
Setting up libpango1.0-common (1.20.1-1) ...
I: Purging /etc/pango/pango.modules
Cleaning up font configuration of pango...
Updating font configuration of pango...
Cleaning up category xfont..
Updating category xfont..
*** You don't have any defomized font packages.
*** So we are trying to force to generate pangox.aliases...
Setting up libthai-data (0.1.9-1) ...
Setting up libthai0 (0.1.9-1) ...
Setting up libpango1.0-0 (1.20.1-1) ...
Setting up libtiff4 (3.8.2-7ubuntu3) ...
Setting up libgtk2.0-0 (2.12.9-2ubuntu2) ...
Removing generated module files coming from the previous Gtk binary version...
Setting up libxml2 (2.6.31.dfsg-2ubuntu1) ...
Setting up libglade2-0 (2.6.2-1) ...
Setting up libpango1.0-dev (1.20.1-1) ...
Setting up libgtk2.0-dev (2.12.9-2ubuntu2) ...
Setting up libxml2-dev (2.6.31.dfsg-2ubuntu1) ...
Setting up libglade2-dev (2.6.2-1) ...
Setting up libhal1 (0.5.11~rc2-1ubuntu6) ...
Setting up libxfont1 (1.3.1-2) ...
Setting up libxslt1.1 (1.1.22-1ubuntu1) ...
Setting up python2.4-minimal (2.4.5-1ubuntu2) ...
Setting up python2.4 (2.4.5-1ubuntu2) ...
Setting up python-all (2.5.2-0ubuntu1) ...
Setting up python2.5-dev (2.5.2-2ubuntu3) ...
Setting up python-dev (2.5.2-0ubuntu1) ...
Setting up python2.4-dev (2.4.5-1ubuntu2) ...
Setting up python-all-dev (2.5.2-0ubuntu1) ...
Setting up python-cairo (1.4.0-2ubuntu2) ...
Setting up python-cairo-dev (1.4.0-2ubuntu2) ...
Setting up python-gobject (2.14.1-2ubuntu2) ...
Setting up python-gobject-dev (2.14.1-2ubuntu2) ...
Setting up python-numeric (24.2-8ubuntu2) ...
Setting up xfonts-encodings (1.0.2-3) ...
Setting up xfonts-utils (1.0.1-2ubuntu1) ...
Setting up xfonts-base (1.0.0-5) ...
Setting up xsltproc (1.1.22-1ubuntu1) ...
Setting up xvfb (1.4.1~git20080131-1ubuntu7) ...
Setting up python2.5-dbg (2.5.2-2ubuntu3) ...
Setting up python-dbg (2.5.2-0ubuntu1) ...
Setting up python2.4-dbg (2.4.5-1ubuntu2) ...
Setting up python-all-dbg (2.5.2-0ubuntu1) ...
Checking correctness of source dependencies...
Toolchain package versions: libc6-dev_2.7-10ubuntu3 make_3.81-3build1 dpkg-dev_1.14.16.6ubuntu3 linux-libc-dev_2.6.24-16.30 gcc-4.2_4.2.3-2ubuntu7 g++-4.2_4.2.3-2ubuntu7 binutils_2.18.1~cvs20080103-0ubuntu1 libstdc++6_4.2.3-2ubuntu7 libstdc++6-4.2-dev_4.2.3-2ubuntu7
------------------------------------------------------------------------------
dpkg-source: extracting pygtk in pygtk-2.12.1
dpkg-source: unpacking pygtk_2.12.1.orig.tar.gz
dpkg-source: applying /home/buildd/build-hardy-autotest/pygtk_2.12.1-0ubuntu1.diff.gz
dpkg-buildpackage: set CPPFLAGS to default value:
dpkg-buildpackage: set CFLAGS to default value: -g -O2
dpkg-buildpackage: set CXXFLAGS to default value: -g -O2
dpkg-buildpackage: set FFLAGS to default value: -g -O2
dpkg-buildpackage: set LDFLAGS to default value: -Wl,-Bsymbolic-functions
dpkg-buildpackage: source package pygtk
dpkg-buildpackage: source version 2.12.1-0ubuntu1
dpkg-buildpackage: host architecture amd64
/usr/bin/fakeroot debian/rules clean
test -x debian/rules
test "`id -u`" = 0
/usr/bin/make -f debian/rules reverse-config
make[1]: Entering directory `/build/buildd/pygtk-2.12.1'
for i in ./config.guess ./config.sub ; do \
if test -e $i.cdbs-orig ; then \
mv $i.cdbs-orig $i ; \
fi ; \
done
make[1]: Leaving directory `/build/buildd/pygtk-2.12.1'
if [ "reverse-patches" = "reverse-patches" ]; then rm -f debian/stamp-patched; fi
patches: debian/patches/10_use-default-python.patch
Patch debian/patches/10_use-default-python.patch is not applied.
if [ "reverse-patches" != "reverse-patches" ]; then touch debian/stamp-patched; fi
if [ "reverse-patches" != "reverse-patches" ] ; then \
/usr/bin/make -f debian/rules update-config ; \
fi
for dir in debian/patches ; do \
rm -f $dir/*.log ; \
done
for i in ./config.guess ./config.sub ; do \
if test -e $i.cdbs-orig ; then \
mv $i.cdbs-orig $i ; \
fi ; \
done
sed "s/@GNOME_TEAM@/Debian GNOME Maintainers <pkg-gnome-maintainers at lists.alioth.debian.org>, Josselin Mouette <joss at debian.org>, Loic Minier <lool at dooz.org>/" \
debian/control.in > debian/control
dh_testdir
dh_testroot
rm -Rf debian/tmp-*
rm -Rf build-* dbg-build-*
test -f config.sub && \
test -r /usr/share/misc/config.sub && \
cp -f /usr/share/misc/config.sub config.sub
test -f config.guess && \
test -r /usr/share/misc/config.guess && \
cp -f /usr/share/misc/config.guess config.guess
dh_clean codegen/*.pyc
debian/rules build
test -x debian/rules
mkdir -p "."
/usr/bin/make -f debian/rules reverse-config
make[1]: Entering directory `/build/buildd/pygtk-2.12.1'
for i in ./config.guess ./config.sub ; do \
if test -e $i.cdbs-orig ; then \
mv $i.cdbs-orig $i ; \
fi ; \
done
make[1]: Leaving directory `/build/buildd/pygtk-2.12.1'
if [ "debian/stamp-patched" = "reverse-patches" ]; then rm -f debian/stamp-patched; fi
patches: debian/patches/10_use-default-python.patch
Trying patch debian/patches/10_use-default-python.patch at level 1 ... success.
if [ "debian/stamp-patched" != "reverse-patches" ]; then touch debian/stamp-patched; fi
if [ "debian/stamp-patched" != "reverse-patches" ] ; then \
/usr/bin/make -f debian/rules update-config ; \
fi
make[1]: Entering directory `/build/buildd/pygtk-2.12.1'
if test -e /usr/share/misc/config.guess ; then \
for i in ./config.guess ; do \
if ! test -e $i.cdbs-orig ; then \
mv $i $i.cdbs-orig ; \
cp --remove-destination /usr/share/misc/config.guess $i ; \
fi ; \
done ; \
fi
if test -e /usr/share/misc/config.sub ; then \
for i in ./config.sub ; do \
if ! test -e $i.cdbs-orig ; then \
mv $i $i.cdbs-orig ; \
cp --remove-destination /usr/share/misc/config.sub $i ; \
fi ; \
done ; \
fi
make[1]: Leaving directory `/build/buildd/pygtk-2.12.1'
if test -e /usr/share/misc/config.guess ; then \
for i in ./config.guess ; do \
if ! test -e $i.cdbs-orig ; then \
mv $i $i.cdbs-orig ; \
cp --remove-destination /usr/share/misc/config.guess $i ; \
fi ; \
done ; \
fi
if test -e /usr/share/misc/config.sub ; then \
for i in ./config.sub ; do \
if ! test -e $i.cdbs-orig ; then \
mv $i $i.cdbs-orig ; \
cp --remove-destination /usr/share/misc/config.sub $i ; \
fi ; \
done ; \
fi
dh_testdir
mkdir -p build-2.5
cd build-2.5 && \
PYTHON=/usr/bin/python2.5 CFLAGS="-g -O2 -Wall -g -O2" \
/build/buildd/pygtk-2.12.1/configure --prefix=/usr --enable-thread --build=x86_64-linux-gnu
checking for a BSD-compatible install... /usr/bin/install -c
checking whether build environment is sane... yes
checking for gawk... no
checking for mawk... mawk
checking whether make sets $(MAKE)... yes
checking for style of include used by make... GNU
checking for gcc... gcc
checking for C compiler default output file name... a.out
checking whether the C compiler works... yes
checking whether we are cross compiling... no
checking for suffix of executables...
checking for suffix of object files... o
checking whether we are using the GNU C compiler... yes
checking whether gcc accepts -g... yes
checking for gcc option to accept ISO C89... none needed
checking dependency style of gcc... gcc3
checking for bind_textdomain_codeset... yes
checking build system type... x86_64-pc-linux-gnu
checking host system type... x86_64-pc-linux-gnu
checking for some Win32 platform... no
checking for native Win32... no
checking for a sed that does not truncate output... /bin/sed
checking for grep that handles long lines and -e... /bin/grep
checking for egrep... /bin/grep -E
checking for ld used by gcc... /usr/bin/ld
checking if the linker (/usr/bin/ld) is GNU ld... yes
checking for /usr/bin/ld option to reload object files... -r
checking for BSD-compatible nm... /usr/bin/nm -B
checking whether ln -s works... yes
checking how to recognize dependent libraries... pass_all
checking how to run the C preprocessor... gcc -E
checking for ANSI C header files... yes
checking for sys/types.h... yes
checking for sys/stat.h... yes
checking for stdlib.h... yes
checking for string.h... yes
checking for memory.h... yes
checking for strings.h... yes
checking for inttypes.h... yes
checking for stdint.h... yes
checking for unistd.h... yes
checking dlfcn.h usability... yes
checking dlfcn.h presence... yes
checking for dlfcn.h... yes
checking the maximum length of command line arguments... 98304
checking command to parse /usr/bin/nm -B output from gcc object... ok
checking for objdir... .libs
checking for ar... ar
checking for ranlib... ranlib
checking for strip... strip
checking if gcc supports -fno-rtti -fno-exceptions... no
checking for gcc option to produce PIC... -fPIC
checking if gcc PIC flag -fPIC works... yes
checking if gcc static flag -static works... yes
checking if gcc supports -c -o file.o... yes
checking whether the gcc linker (/usr/bin/ld -m elf_x86_64) supports shared libraries... yes
checking whether -lc should be explicitly linked in... no
checking dynamic linker characteristics... GNU/Linux ld.so
checking how to hardcode library paths into programs... immediate
checking whether stripping libraries is possible... yes
checking if libtool supports shared libraries... yes
checking whether to build shared libraries... yes
checking whether to build static libraries... no
configure: creating libtool
checking whether /usr/bin/python2.5 version >= 2.3.5... yes
checking for /usr/bin/python2.5 version... 2.5
checking for /usr/bin/python2.5 platform... linux2
checking for /usr/bin/python2.5 script directory... ${prefix}/lib/python2.5/site-packages
checking for /usr/bin/python2.5 extension module directory... ${exec_prefix}/lib/python2.5/site-packages
checking for headers required to compile python extensions... found
checking for PySignal_SetWakeupFd in Python.h... yes
checking for python module thread... yes
checking whether to enable threading in pygtk... yes
checking for pkg-config... /usr/bin/pkg-config
checking pkg-config is at least version 0.16... yes
checking for GLIB - version >= 2.8.0... yes (version 2.16.3)
checking for PYGOBJECT... yes
checking for ATK... yes
checking for PANGO... yes
checking for PYCAIRO... yes
checking for PANGOCAIRO... yes
checking for GTK... yes
checking for GTK210... yes
checking for GTK212... yes
checking for LIBGLADE... yes
checking for GTKUNIXPRINT... yes
checking for GDK target... x11
checking for Numeric/arrayobject.h... yes
checking whether gcc understands -fno-strict-aliasing... yes
checking whether gcc understands -std=c9x... yes
configure: creating ./config.status
config.status: creating Makefile
config.status: creating pygtk-2.0.pc
config.status: creating codegen/Makefile
config.status: creating gtk/Makefile
config.status: creating docs/Makefile
config.status: creating docs/reference/entities.docbook
config.status: creating examples/Makefile
config.status: creating tests/Makefile
config.status: creating codegen/pygtk-codegen-2.0
config.status: creating pygtk.spec
config.status: creating PKG-INFO
config.status: creating config.h
config.status: executing depfiles commands
The following modules will be built:
atk
pango
pangocairo
gtk with 2.12 API
gtk.glade
gtk.unixprint
touch build-2.5/configure-stamp
dh_testdir
/usr/bin/make -C build-2.5
make[1]: Entering directory `/build/buildd/pygtk-2.12.1/build-2.5'
/usr/bin/make all-recursive
make[2]: Entering directory `/build/buildd/pygtk-2.12.1/build-2.5'
Making all in codegen
make[3]: Entering directory `/build/buildd/pygtk-2.12.1/build-2.5/codegen'
make[3]: Nothing to be done for `all'.
make[3]: Leaving directory `/build/buildd/pygtk-2.12.1/build-2.5/codegen'
Making all in .
make[3]: Entering directory `/build/buildd/pygtk-2.12.1/build-2.5'
if /bin/bash ./libtool --tag=CC --mode=compile gcc -DHAVE_CONFIG_H -I. -I/build/buildd/pygtk-2.12.1 -I. -I/usr/include/python2.5 -I/usr/include/pygtk-2.0 -I/usr/include/glib-2.0 -I/usr/lib/glib-2.0/include -pthread -I/usr/include/glib-2.0 -I/usr/lib/glib-2.0/include -I/build/buildd/pygtk-2.12.1/gtk -I/usr/include/atk-1.0 -I/usr/include/glib-2.0 -I/usr/lib/glib-2.0/include -g -O2 -Wall -g -O2 -fno-strict-aliasing -std=c9x -MT atk_la-atkmodule.lo -MD -MP -MF ".deps/atk_la-atkmodule.Tpo" -c -o atk_la-atkmodule.lo `test -f 'atkmodule.c' || echo '/build/buildd/pygtk-2.12.1/'`atkmodule.c; \
then mv -f ".deps/atk_la-atkmodule.Tpo" ".deps/atk_la-atkmodule.Plo"; else rm -f ".deps/atk_la-atkmodule.Tpo"; exit 1; fi
mkdir .libs
gcc -DHAVE_CONFIG_H -I. -I/build/buildd/pygtk-2.12.1 -I. -I/usr/include/python2.5 -I/usr/include/pygtk-2.0 -I/usr/include/glib-2.0 -I/usr/lib/glib-2.0/include -pthread -I/usr/include/glib-2.0 -I/usr/lib/glib-2.0/include -I/build/buildd/pygtk-2.12.1/gtk -I/usr/include/atk-1.0 -I/usr/include/glib-2.0 -I/usr/lib/glib-2.0/include -g -O2 -Wall -g -O2 -fno-strict-aliasing -std=c9x -MT atk_la-atkmodule.lo -MD -MP -MF .deps/atk_la-atkmodule.Tpo -c /build/buildd/pygtk-2.12.1/atkmodule.c -fPIC -DPIC -o .libs/atk_la-atkmodule.o
(cd /build/buildd/pygtk-2.12.1\
&& /usr/bin/python2.5 codegen/codegen.py \
--py_ssize_t-clean \
--register pango-types.defs \
--register atk-types.defs \
--register gtk/gtk-base-types.defs \
--override atk.override \
--prefix pyatk atk.defs) > ./gen-atk.c \
&& cp ./gen-atk.c ./atk.c \
&& rm -f ./gen-atk.c
Could not write method AtkObject.get_attributes: No ArgType for AtkAttributeSet*
Could not write method AtkObject.connect_property_change_handler: No ArgType for AtkPropertyChangeHandler*
Could not write method AtkObject.notify_state_change: No ArgType for AtkState
Could not write method AtkObject.initialize: No ArgType for gpointer
Could not write virtual accessor method AtkObject.get_attributes: No ArgType for AtkAttributeSet*
Could not write virtual accessor method AtkObject.connect_property_change_handler: No ArgType for AtkPropertyChangeHandler*
Could not write virtual accessor method AtkObject.initialize: No ArgType for gpointer
Could not write virtual accessor method AtkObject.children_changed: No ArgType for gpointer
Could not write virtual accessor method AtkObject.property_change: No ArgType for AtkPropertyValues*
Could not write virtual accessor method AtkObject.active_descendant_changed: No ArgType for gpointer*
Could not write virtual proxy AtkObject.get_attributes: No ArgType for AtkAttributeSet*
Could not write virtual proxy AtkObject.connect_property_change_handler: No ArgType for AtkPropertyChangeHandler*
Could not write virtual proxy AtkObject.initialize: No ArgType for gpointer
Could not write virtual proxy AtkObject.children_changed: No ArgType for gpointer
Could not write virtual proxy AtkObject.property_change: No ArgType for AtkPropertyValues*
Could not write virtual proxy AtkObject.active_descendant_changed: No ArgType for gpointer*
Warning: generating old-style constructor for:atk_no_op_object_new
Could not write method AtkComponent.add_focus_handler: No ArgType for AtkFocusHandler
Could not write virtual accessor method AtkComponent.add_focus_handler: No ArgType for AtkFocusHandler
Could not write virtual accessor method AtkComponent.get_extents: No ArgType for gint*
Could not write virtual accessor method AtkComponent.get_position: No ArgType for gint*
Could not write virtual accessor method AtkComponent.get_size: No ArgType for gint*
Could not write interface proxy AtkComponent.add_focus_handler: No ArgType for AtkFocusHandler
Could not write interface proxy AtkComponent.get_extents: cannot use int* parameter with direction 'None'
Could not write interface proxy AtkComponent.get_position: cannot use int* parameter with direction 'None'
Could not write interface proxy AtkComponent.get_size: cannot use int* parameter with direction 'None'
Could not write method AtkDocument.get_document: No ArgType for gpointer
Could not write method AtkDocument.get_attributes: No ArgType for AtkAttributeSet*
Could not write virtual accessor method AtkDocument.get_document: No ArgType for gpointer
Could not write virtual accessor method AtkDocument.get_document_attributes: No ArgType for AtkAttributeSet*
Could not write virtual accessor method AtkDocument.get_document_attribute_value: No ArgType for G_CONST_RETURNgchar*
Could not write interface proxy AtkDocument.get_document: No ArgType for gpointer
Could not write interface proxy AtkDocument.get_document_attributes: No ArgType for AtkAttributeSet*
Could not write interface proxy AtkDocument.get_document_attribute_value: No ArgType for G_CONST_RETURNgchar*
Could not write virtual accessor method AtkEditableText.set_run_attributes: No ArgType for AtkAttributeSet*
Could not write virtual accessor method AtkEditableText.insert_text: No ArgType for gint*
Could not write interface proxy AtkEditableText.set_run_attributes: No ArgType for AtkAttributeSet*
Could not write interface proxy AtkEditableText.insert_text: cannot use int* parameter with direction 'None'
Could not write virtual accessor method AtkImage.get_image_position: No ArgType for gint*
Could not write virtual accessor method AtkImage.get_image_size: No ArgType for gint*
Could not write interface proxy AtkImage.get_image_position: cannot use int* parameter with direction 'None'
Could not write interface proxy AtkImage.get_image_size: cannot use int* parameter with direction 'None'
Could not write method AtkStreamableContent.get_stream: No ArgType for GIOChannel*
Could not write virtual accessor method AtkStreamableContent.get_stream: No ArgType for GIOChannel*
Could not write virtual accessor method AtkStreamableContent.get_uri: No ArgType for G_CONST_RETURNgchar*
Could not write interface proxy AtkStreamableContent.get_stream: No ArgType for GIOChannel*
Could not write interface proxy AtkStreamableContent.get_uri: No ArgType for G_CONST_RETURNgchar*
Could not write virtual accessor method AtkTable.get_selected_columns: No ArgType for gint**
Could not write virtual accessor method AtkTable.get_selected_rows: No ArgType for gint**
Could not write interface proxy AtkTable.get_selected_columns: No ArgType for gint**
Could not write interface proxy AtkTable.get_selected_rows: No ArgType for gint**
Could not write virtual accessor method AtkText.get_text_after_offset: No ArgType for gint*
Could not write virtual accessor method AtkText.get_text_at_offset: No ArgType for gint*
Could not write virtual accessor method AtkText.get_text_before_offset: No ArgType for gint*
Could not write virtual accessor method AtkText.get_run_attributes: No ArgType for gint*
Could not write virtual accessor method AtkText.get_default_attributes: No ArgType for AtkAttributeSet*
Could not write virtual accessor method AtkText.get_character_extents: No ArgType for gint*
Could not write virtual accessor method AtkText.get_selection: No ArgType for gint*
Could not write virtual accessor method AtkText.get_range_extents: No ArgType for AtkTextRectangle*
Could not write virtual accessor method AtkText.get_bounded_ranges: No ArgType for AtkTextRectangle*
Could not write interface proxy AtkText.get_text_after_offset: cannot use int* parameter with direction 'None'
Could not write interface proxy AtkText.get_text_at_offset: cannot use int* parameter with direction 'None'
Could not write interface proxy AtkText.get_character_at_offset: No ArgType for gunichar
Could not write interface proxy AtkText.get_text_before_offset: cannot use int* parameter with direction 'None'
Could not write interface proxy AtkText.get_run_attributes: No ArgType for AtkAttributeSet*
Could not write interface proxy AtkText.get_default_attributes: No ArgType for AtkAttributeSet*
Could not write interface proxy AtkText.get_character_extents: cannot use int* parameter with direction 'None'
Could not write interface proxy AtkText.get_selection: cannot use int* parameter with direction 'None'
Could not write interface proxy AtkText.get_range_extents: No ArgType for AtkTextRectangle*
Could not write interface proxy AtkText.get_bounded_ranges: No ArgType for AtkTextRange**
Could not write method AtkValue.get_minimum_increment: No ArgType for GValue*
Could not write virtual accessor method AtkValue.get_current_value: No ArgType for GValue*
Could not write virtual accessor method AtkValue.get_maximum_value: No ArgType for GValue*
Could not write virtual accessor method AtkValue.get_minimum_value: No ArgType for GValue*
Could not write virtual accessor method AtkValue.set_current_value: No ArgType for const-GValue*
Could not write virtual accessor method AtkValue.get_minimum_increment: No ArgType for GValue*
Could not write interface proxy AtkValue.get_current_value: No ArgType for GValue*
Could not write interface proxy AtkValue.get_maximum_value: No ArgType for GValue*
Could not write interface proxy AtkValue.get_minimum_value: No ArgType for GValue*
Could not write interface proxy AtkValue.set_current_value: No ArgType for const-GValue*
Could not write interface proxy AtkValue.get_minimum_increment: No ArgType for GValue*
Could not write function add_focus_tracker: No ArgType for AtkEventListener
Could not write function focus_tracker_init: No ArgType for AtkEventListenerInit
Could not write function add_global_event_listener: No ArgType for GSignalEmissionHook
Could not write function add_key_event_listener: No ArgType for AtkKeySnoopFunc
Warning: Constructor for AtkNoOpObject needs to be updated to new API
See http://live.gnome.org/PyGTK_2fWhatsNew28#update-constructors
Warning: Constructor for AtkRelation needs to be updated to new API
See http://live.gnome.org/PyGTK_2fWhatsNew28#update-constructors
***INFO*** The coverage of global functions is 85.71% (24/28)
***INFO*** The coverage of methods is 94.48% (154/163)
***INFO*** The coverage of virtual proxies is 82.86% (29/35)
***INFO*** The coverage of virtual accessors is 77.27% (119/154)
***INFO*** The coverage of interface proxies is 74.79% (89/119)
if /bin/bash ./libtool --tag=CC --mode=compile gcc -DHAVE_CONFIG_H -I. -I/build/buildd/pygtk-2.12.1 -I. -I/usr/include/python2.5 -I/usr/include/pygtk-2.0 -I/usr/include/glib-2.0 -I/usr/lib/glib-2.0/include -pthread -I/usr/include/glib-2.0 -I/usr/lib/glib-2.0/include -I/build/buildd/pygtk-2.12.1/gtk -I/usr/include/atk-1.0 -I/usr/include/glib-2.0 -I/usr/lib/glib-2.0/include -g -O2 -Wall -g -O2 -fno-strict-aliasing -std=c9x -MT atk_la-atk.lo -MD -MP -MF ".deps/atk_la-atk.Tpo" -c -o atk_la-atk.lo `test -f 'atk.c' || echo '/build/buildd/pygtk-2.12.1/'`atk.c; \
then mv -f ".deps/atk_la-atk.Tpo" ".deps/atk_la-atk.Plo"; else rm -f ".deps/atk_la-atk.Tpo"; exit 1; fi
gcc -DHAVE_CONFIG_H -I. -I/build/buildd/pygtk-2.12.1 -I. -I/usr/include/python2.5 -I/usr/include/pygtk-2.0 -I/usr/include/glib-2.0 -I/usr/lib/glib-2.0/include -pthread -I/usr/include/glib-2.0 -I/usr/lib/glib-2.0/include -I/build/buildd/pygtk-2.12.1/gtk -I/usr/include/atk-1.0 -I/usr/include/glib-2.0 -I/usr/lib/glib-2.0/include -g -O2 -Wall -g -O2 -fno-strict-aliasing -std=c9x -MT atk_la-atk.lo -MD -MP -MF .deps/atk_la-atk.Tpo -c atk.c -fPIC -DPIC -o .libs/atk_la-atk.o
/bin/bash ./libtool --tag=CC --mode=link gcc -g -O2 -Wall -g -O2 -fno-strict-aliasing -std=c9x -Wl,-Bsymbolic-functions -o atk.la -rpath /usr/lib/python2.5/site-packages/gtk-2.0 -module -avoid-version -export-symbols-regex initatk atk_la-atkmodule.lo atk_la-atk.lo -latk-1.0 -lgobject-2.0 -lgmodule-2.0 -ldl -lglib-2.0
generating symbol list for `atk.la'
/usr/bin/nm -B .libs/atk_la-atkmodule.o .libs/atk_la-atk.o | sed -n -e 's/^.*[ ]\([ABCDGIRSTW][ABCDGIRSTW]*\)[ ][ ]*\([_A-Za-z][_A-Za-z0-9]*\)$/\1 \2 \2/p' | /bin/sed 's/.* //' | sort | uniq > .libs/atk.exp
/bin/grep -E -e "initatk" ".libs/atk.exp" > ".libs/atk.expT"
mv -f ".libs/atk.expT" ".libs/atk.exp"
echo "{ global:" > .libs/atk.ver
cat .libs/atk.exp | sed -e "s/\(.*\)/\1;/" >> .libs/atk.ver
echo "local: *; };" >> .libs/atk.ver
gcc -shared .libs/atk_la-atkmodule.o .libs/atk_la-atk.o /usr/lib/libatk-1.0.so /usr/lib/libgobject-2.0.so /usr/lib/libgmodule-2.0.so -ldl /usr/lib/libglib-2.0.so -Wl,-Bsymbolic-functions -Wl,-soname -Wl,atk.so -Wl,-version-script -Wl,.libs/atk.ver -o .libs/atk.so
creating atk.la
(cd .libs && rm -f atk.la && ln -s ../atk.la atk.la)
if /bin/bash ./libtool --tag=CC --mode=compile gcc -DHAVE_CONFIG_H -I. -I/build/buildd/pygtk-2.12.1 -I. -I/usr/include/python2.5 -I/usr/include/pygtk-2.0 -I/usr/include/glib-2.0 -I/usr/lib/glib-2.0/include -pthread -I/usr/include/glib-2.0 -I/usr/lib/glib-2.0/include -I/build/buildd/pygtk-2.12.1/gtk -I/usr/include/pango-1.0 -I/usr/include/glib-2.0 -I/usr/lib/glib-2.0/include -g -O2 -Wall -g -O2 -fno-strict-aliasing -std=c9x -MT pango_la-pangomodule.lo -MD -MP -MF ".deps/pango_la-pangomodule.Tpo" -c -o pango_la-pangomodule.lo `test -f 'pangomodule.c' || echo '/build/buildd/pygtk-2.12.1/'`pangomodule.c; \
then mv -f ".deps/pango_la-pangomodule.Tpo" ".deps/pango_la-pangomodule.Plo"; else rm -f ".deps/pango_la-pangomodule.Tpo"; exit 1; fi
gcc -DHAVE_CONFIG_H -I. -I/build/buildd/pygtk-2.12.1 -I. -I/usr/include/python2.5 -I/usr/include/pygtk-2.0 -I/usr/include/glib-2.0 -I/usr/lib/glib-2.0/include -pthread -I/usr/include/glib-2.0 -I/usr/lib/glib-2.0/include -I/build/buildd/pygtk-2.12.1/gtk -I/usr/include/pango-1.0 -I/usr/include/glib-2.0 -I/usr/lib/glib-2.0/include -g -O2 -Wall -g -O2 -fno-strict-aliasing -std=c9x -MT pango_la-pangomodule.lo -MD -MP -MF .deps/pango_la-pangomodule.Tpo -c /build/buildd/pygtk-2.12.1/pangomodule.c -fPIC -DPIC -o .libs/pango_la-pangomodule.o
(cd /build/buildd/pygtk-2.12.1\
&& /usr/bin/python2.5 codegen/codegen.py \
--py_ssize_t-clean \
--register pango-types.defs \
--register atk-types.defs \
--register gtk/gtk-base-types.defs \
--override pango.override \
--prefix pypango pango.defs) > ./gen-pango.c \
&& cp ./gen-pango.c ./pango.c \
&& rm -f ./gen-pango.c
Could not write getter for PangoGlyphString.glyphs: No ArgType for PangoGlyphInfo*
Could not write getter for PangoGlyphString.log_clusters: No ArgType for gint*
Could not write getter for PangoItem.analysis_extra_attrs: No ArgType for GSList*
Could not write method PangoLayoutIter.get_run: No ArgType for PangoLayoutRun*
Could not write method PangoLayoutIter.get_run_readonly: No ArgType for PangoLayoutRun*
Could not write method PangoLayoutLine.get_x_ranges: No ArgType for int**
Could not write method PangoMatrix.transform_point: No ArgType for double*
Could not write method PangoMatrix.transform_distance: No ArgType for double*
Could not write method PangoMatrix.transform_rectangle: No ArgType for PangoRectangle*
Could not write method PangoMatrix.transform_pixel_rectangle: No ArgType for PangoRectangle*
Could not write virtual accessor method PangoFont.get_coverage: No ArgType for PangoCoverage*
Could not write virtual accessor method PangoFont.get_glyph_extents: No ArgType for PangoGlyph
Could not write virtual proxy PangoFont.get_coverage: No ArgType for PangoCoverage*
Could not write virtual proxy PangoFont.find_shaper: No ArgType for guint32
Could not write virtual proxy PangoFont.get_glyph_extents: No ArgType for PangoGlyph
Could not write virtual accessor method PangoFontFace.list_sizes: No ArgType for int**
Could not write virtual proxy PangoFontFace.get_face_name: No ArgType for const-char*
Could not write virtual proxy PangoFontFace.list_sizes: No ArgType for int**
Could not write virtual accessor method PangoFontFamily.list_faces: No ArgType for PangoFontFace***
Could not write virtual proxy PangoFontFamily.list_faces: No ArgType for PangoFontFace***
Could not write virtual proxy PangoFontFamily.get_name: No ArgType for const-char*
Could not write virtual accessor method PangoFontMap.list_families: No ArgType for PangoFontFamily***
Could not write virtual proxy PangoFontMap.list_families: No ArgType for PangoFontFamily***
Could not write virtual accessor method PangoFontset.foreach: No ArgType for PangoFontsetForeachFunc
Could not write virtual proxy PangoFontset.foreach: No ArgType for PangoFontsetForeachFunc
Warning: generating old-style constructor for:pango_fontset_simple_new
Warning: generating old-style constructor for:pango_layout_new
Could not write method PangoLayout.get_lines: No ArgType for GSList*
Could not write method PangoLayout.get_lines_readonly: No ArgType for GSList*
Could not write method PangoRenderer.draw_glyph: No ArgType for PangoGlyph
Could not write virtual accessor method PangoRenderer.draw_shape: No ArgType for PangoAttrShape*
Could not write virtual accessor method PangoRenderer.draw_glyph: No ArgType for PangoGlyph
Could not write virtual accessor method PangoRenderer.prepare_run: No ArgType for PangoLayoutRun*
Could not write virtual proxy PangoRenderer.draw_shape: No ArgType for PangoAttrShape*
Could not write virtual proxy PangoRenderer.draw_glyph: No ArgType for PangoGlyph
Could not write virtual proxy PangoRenderer.prepare_run: No ArgType for PangoLayoutRun*
Could not write function attr_shape_new_with_data: No ArgType for const-PangoRectangle*
Could not write function find_paragraph_boundary: No ArgType for gint*
Could not write function get_log_attrs: No ArgType for PangoLogAttr*
Could not write function itemize: No ArgType for PangoAttrIterator*
Could not write function itemize_with_base_dir: No ArgType for PangoAttrIterator*
Could not write function reorder_items: No ArgType for GList*
Could not write function get_mirror_char: No ArgType for gunichar*
Could not write function extents_to_pixels: No ArgType for PangoRectangle*
Warning: Constructor for PangoContext needs to be updated to new API
See http://live.gnome.org/PyGTK_2fWhatsNew28#update-constructors
Warning: Constructor for PangoFontsetSimple needs to be updated to new API
See http://live.gnome.org/PyGTK_2fWhatsNew28#update-constructors
Warning: Constructor for PangoLayout needs to be updated to new API
See http://live.gnome.org/PyGTK_2fWhatsNew28#update-constructors
***INFO*** The coverage of global functions is 83.67% (41/49)
***INFO*** The coverage of methods is 94.74% (180/190)
***INFO*** The coverage of virtual proxies is 58.62% (17/29)
***INFO*** The coverage of virtual accessors is 68.97% (20/29)
***INFO*** There are no declared interface proxies.
if /bin/bash ./libtool --tag=CC --mode=compile gcc -DHAVE_CONFIG_H -I. -I/build/buildd/pygtk-2.12.1 -I. -I/usr/include/python2.5 -I/usr/include/pygtk-2.0 -I/usr/include/glib-2.0 -I/usr/lib/glib-2.0/include -pthread -I/usr/include/glib-2.0 -I/usr/lib/glib-2.0/include -I/build/buildd/pygtk-2.12.1/gtk -I/usr/include/pango-1.0 -I/usr/include/glib-2.0 -I/usr/lib/glib-2.0/include -g -O2 -Wall -g -O2 -fno-strict-aliasing -std=c9x -MT pango_la-pango.lo -MD -MP -MF ".deps/pango_la-pango.Tpo" -c -o pango_la-pango.lo `test -f 'pango.c' || echo '/build/buildd/pygtk-2.12.1/'`pango.c; \
then mv -f ".deps/pango_la-pango.Tpo" ".deps/pango_la-pango.Plo"; else rm -f ".deps/pango_la-pango.Tpo"; exit 1; fi
gcc -DHAVE_CONFIG_H -I. -I/build/buildd/pygtk-2.12.1 -I. -I/usr/include/python2.5 -I/usr/include/pygtk-2.0 -I/usr/include/glib-2.0 -I/usr/lib/glib-2.0/include -pthread -I/usr/include/glib-2.0 -I/usr/lib/glib-2.0/include -I/build/buildd/pygtk-2.12.1/gtk -I/usr/include/pango-1.0 -I/usr/include/glib-2.0 -I/usr/lib/glib-2.0/include -g -O2 -Wall -g -O2 -fno-strict-aliasing -std=c9x -MT pango_la-pango.lo -MD -MP -MF .deps/pango_la-pango.Tpo -c pango.c -fPIC -DPIC -o .libs/pango_la-pango.o
/bin/bash ./libtool --tag=CC --mode=link gcc -g -O2 -Wall -g -O2 -fno-strict-aliasing -std=c9x -Wl,-Bsymbolic-functions -o pango.la -rpath /usr/lib/python2.5/site-packages/gtk-2.0 -module -avoid-version -export-symbols-regex initpango pango_la-pangomodule.lo pango_la-pango.lo -lpango-1.0 -lgobject-2.0 -lgmodule-2.0 -ldl -lglib-2.0
generating symbol list for `pango.la'
/usr/bin/nm -B .libs/pango_la-pangomodule.o .libs/pango_la-pango.o | sed -n -e 's/^.*[ ]\([ABCDGIRSTW][ABCDGIRSTW]*\)[ ][ ]*\([_A-Za-z][_A-Za-z0-9]*\)$/\1 \2 \2/p' | /bin/sed 's/.* //' | sort | uniq > .libs/pango.exp
/bin/grep -E -e "initpango" ".libs/pango.exp" > ".libs/pango.expT"
mv -f ".libs/pango.expT" ".libs/pango.exp"
echo "{ global:" > .libs/pango.ver
cat .libs/pango.exp | sed -e "s/\(.*\)/\1;/" >> .libs/pango.ver
echo "local: *; };" >> .libs/pango.ver
gcc -shared .libs/pango_la-pangomodule.o .libs/pango_la-pango.o /usr/lib/libpango-1.0.so /usr/lib/libgobject-2.0.so /usr/lib/libgmodule-2.0.so -ldl /usr/lib/libglib-2.0.so -Wl,-Bsymbolic-functions -Wl,-soname -Wl,pango.so -Wl,-version-script -Wl,.libs/pango.ver -o .libs/pango.so
creating pango.la
(cd .libs && rm -f pango.la && ln -s ../pango.la pango.la)
if /bin/bash ./libtool --tag=CC --mode=compile gcc -DHAVE_CONFIG_H -I. -I/build/buildd/pygtk-2.12.1 -I. -I/usr/include/python2.5 -I/usr/include/pygtk-2.0 -I/usr/include/glib-2.0 -I/usr/lib/glib-2.0/include -pthread -I/usr/include/glib-2.0 -I/usr/lib/glib-2.0/include -I/build/buildd/pygtk-2.12.1/gtk -DPNG_NO_MMX_CODE -I/usr/include/pycairo -I/usr/include/cairo -I/usr/include/freetype2 -I/usr/include/libpng12 -I/usr/include/pixman-1 -DPNG_NO_MMX_CODE -I/usr/include/pango-1.0 -I/usr/include/cairo -I/usr/include/glib-2.0 -I/usr/lib/glib-2.0/include -I/usr/include/freetype2 -I/usr/include/libpng12 -I/usr/include/pixman-1 -I/usr/include/pycairo -g -O2 -Wall -g -O2 -fno-strict-aliasing -std=c9x -MT pangocairo_la-pangocairomodule.lo -MD -MP -MF ".deps/pangocairo_la-pangocairomodule.Tpo" -c -o pangocairo_la-pangocairomodule.lo `test -f 'pangocairomodule.c' || echo '/build/buildd/pygtk-2.12.1/'`pangocairomodule.c; \
then mv -f ".deps/pangocairo_la-pangocairomodule.Tpo" ".deps/pangocairo_la-pangocairomodule.Plo"; else rm -f ".deps/pangocairo_la-pangocairomodule.Tpo"; exit 1; fi
gcc -DHAVE_CONFIG_H -I. -I/build/buildd/pygtk-2.12.1 -I. -I/usr/include/python2.5 -I/usr/include/pygtk-2.0 -I/usr/include/glib-2.0 -I/usr/lib/glib-2.0/include -pthread -I/usr/include/glib-2.0 -I/usr/lib/glib-2.0/include -I/build/buildd/pygtk-2.12.1/gtk -DPNG_NO_MMX_CODE -I/usr/include/pycairo -I/usr/include/cairo -I/usr/include/freetype2 -I/usr/include/libpng12 -I/usr/include/pixman-1 -DPNG_NO_MMX_CODE -I/usr/include/pango-1.0 -I/usr/include/cairo -I/usr/include/glib-2.0 -I/usr/lib/glib-2.0/include -I/usr/include/freetype2 -I/usr/include/libpng12 -I/usr/include/pixman-1 -I/usr/include/pycairo -g -O2 -Wall -g -O2 -fno-strict-aliasing -std=c9x -MT pangocairo_la-pangocairomodule.lo -MD -MP -MF .deps/pangocairo_la-pangocairomodule.Tpo -c /build/buildd/pygtk-2.12.1/pangocairomodule.c -fPIC -DPIC -o .libs/pangocairo_la-pangocairomodule.o
(cd /build/buildd/pygtk-2.12.1\
&& /usr/bin/python2.5 codegen/codegen.py \
--py_ssize_t-clean \
--register pango-types.defs \
--register atk-types.defs \
--register gtk/gtk-base-types.defs \
--override pangocairo.override \
--prefix pypangocairo pangocairo.defs) > ./gen-pangocairo.c \
&& cp ./gen-pangocairo.c ./pangocairo.c \
&& rm -f ./gen-pangocairo.c
Could not write function context_set_font_options: No ArgType for const-cairo_font_options_t*
Could not write function context_get_font_options: No ArgType for const-cairo_font_options_t*
***INFO*** The coverage of global functions is 80.00% (8/10)
***INFO*** The coverage of methods is 100.00% (3/3)
***INFO*** There are no declared virtual proxies.
***INFO*** There are no declared virtual accessors.
***INFO*** There are no declared interface proxies.
if /bin/bash ./libtool --tag=CC --mode=compile gcc -DHAVE_CONFIG_H -I. -I/build/buildd/pygtk-2.12.1 -I. -I/usr/include/python2.5 -I/usr/include/pygtk-2.0 -I/usr/include/glib-2.0 -I/usr/lib/glib-2.0/include -pthread -I/usr/include/glib-2.0 -I/usr/lib/glib-2.0/include -I/build/buildd/pygtk-2.12.1/gtk -DPNG_NO_MMX_CODE -I/usr/include/pycairo -I/usr/include/cairo -I/usr/include/freetype2 -I/usr/include/libpng12 -I/usr/include/pixman-1 -DPNG_NO_MMX_CODE -I/usr/include/pango-1.0 -I/usr/include/cairo -I/usr/include/glib-2.0 -I/usr/lib/glib-2.0/include -I/usr/include/freetype2 -I/usr/include/libpng12 -I/usr/include/pixman-1 -I/usr/include/pycairo -g -O2 -Wall -g -O2 -fno-strict-aliasing -std=c9x -MT pangocairo_la-pangocairo.lo -MD -MP -MF ".deps/pangocairo_la-pangocairo.Tpo" -c -o pangocairo_la-pangocairo.lo `test -f 'pangocairo.c' || echo '/build/buildd/pygtk-2.12.1/'`pangocairo.c; \
then mv -f ".deps/pangocairo_la-pangocairo.Tpo" ".deps/pangocairo_la-pangocairo.Plo"; else rm -f ".deps/pangocairo_la-pangocairo.Tpo"; exit 1; fi
gcc -DHAVE_CONFIG_H -I. -I/build/buildd/pygtk-2.12.1 -I. -I/usr/include/python2.5 -I/usr/include/pygtk-2.0 -I/usr/include/glib-2.0 -I/usr/lib/glib-2.0/include -pthread -I/usr/include/glib-2.0 -I/usr/lib/glib-2.0/include -I/build/buildd/pygtk-2.12.1/gtk -DPNG_NO_MMX_CODE -I/usr/include/pycairo -I/usr/include/cairo -I/usr/include/freetype2 -I/usr/include/libpng12 -I/usr/include/pixman-1 -DPNG_NO_MMX_CODE -I/usr/include/pango-1.0 -I/usr/include/cairo -I/usr/include/glib-2.0 -I/usr/lib/glib-2.0/include -I/usr/include/freetype2 -I/usr/include/libpng12 -I/usr/include/pixman-1 -I/usr/include/pycairo -g -O2 -Wall -g -O2 -fno-strict-aliasing -std=c9x -MT pangocairo_la-pangocairo.lo -MD -MP -MF .deps/pangocairo_la-pangocairo.Tpo -c pangocairo.c -fPIC -DPIC -o .libs/pangocairo_la-pangocairo.o
/bin/bash ./libtool --tag=CC --mode=link gcc -g -O2 -Wall -g -O2 -fno-strict-aliasing -std=c9x -Wl,-Bsymbolic-functions -o pangocairo.la -rpath /usr/lib/python2.5/site-packages/gtk-2.0 -module -avoid-version -export-symbols-regex initpangocairo pangocairo_la-pangocairomodule.lo pangocairo_la-pangocairo.lo -lpangocairo-1.0 -lpango-1.0 -lgobject-2.0 -lgmodule-2.0 -ldl -lglib-2.0 -lcairo
generating symbol list for `pangocairo.la'
/usr/bin/nm -B .libs/pangocairo_la-pangocairomodule.o .libs/pangocairo_la-pangocairo.o | sed -n -e 's/^.*[ ]\([ABCDGIRSTW][ABCDGIRSTW]*\)[ ][ ]*\([_A-Za-z][_A-Za-z0-9]*\)$/\1 \2 \2/p' | /bin/sed 's/.* //' | sort | uniq > .libs/pangocairo.exp
/bin/grep -E -e "initpangocairo" ".libs/pangocairo.exp" > ".libs/pangocairo.expT"
mv -f ".libs/pangocairo.expT" ".libs/pangocairo.exp"
echo "{ global:" > .libs/pangocairo.ver
cat .libs/pangocairo.exp | sed -e "s/\(.*\)/\1;/" >> .libs/pangocairo.ver
echo "local: *; };" >> .libs/pangocairo.ver
gcc -shared .libs/pangocairo_la-pangocairomodule.o .libs/pangocairo_la-pangocairo.o /usr/lib/libpangocairo-1.0.so /usr/lib/libpango-1.0.so /usr/lib/libgobject-2.0.so /usr/lib/libgmodule-2.0.so -ldl /usr/lib/libglib-2.0.so /usr/lib/libcairo.so -Wl,-Bsymbolic-functions -Wl,-soname -Wl,pangocairo.so -Wl,-version-script -Wl,.libs/pangocairo.ver -o .libs/pangocairo.so
creating pangocairo.la
(cd .libs && rm -f pangocairo.la && ln -s ../pangocairo.la pangocairo.la)
make[3]: Leaving directory `/build/buildd/pygtk-2.12.1/build-2.5'
Making all in gtk
make[3]: Entering directory `/build/buildd/pygtk-2.12.1/build-2.5/gtk'
if /bin/bash ../libtool --tag=CC --mode=compile gcc -DHAVE_CONFIG_H -I. -I/build/buildd/pygtk-2.12.1/gtk -I.. -I/usr/include/python2.5 -I/usr/include/pygtk-2.0 -I/usr/include/glib-2.0 -I/usr/lib/glib-2.0/include -I/build/buildd/pygtk-2.12.1/gtk/gtk -DPNG_NO_MMX_CODE -I/usr/include/pycairo -I/usr/include/cairo -I/usr/include/freetype2 -I/usr/include/libpng12 -I/usr/include/pixman-1 -DPNG_NO_MMX_CODE -I/usr/include/gtk-unix-print-2.0 -I/usr/include/gtk-2.0 -I/usr/include/atk-1.0 -I/usr/include/cairo -I/usr/lib/gtk-2.0/include -I/usr/include/pango-1.0 -I/usr/include/glib-2.0 -I/usr/lib/glib-2.0/include -I/usr/include/freetype2 -I/usr/include/libpng12 -I/usr/include/pixman-1 -g -O2 -Wall -g -O2 -fno-strict-aliasing -std=c9x -MT gtkunixprint_la-gtkunixprintmodule.lo -MD -MP -MF ".deps/gtkunixprint_la-gtkunixprintmodule.Tpo" -c -o gtkunixprint_la-gtkunixprintmodule.lo `test -f 'gtkunixprintmodule.c' || echo '/build/buildd/pygtk-2.12.1/gtk/'`gtkunixprintmodule.c; \
then mv -f ".deps/gtkunixprint_la-gtkunixprintmodule.Tpo" ".deps/gtkunixprint_la-gtkunixprintmodule.Plo"; else rm -f ".deps/gtkunixprint_la-gtkunixprintmodule.Tpo"; exit 1; fi
mkdir .libs
gcc -DHAVE_CONFIG_H -I. -I/build/buildd/pygtk-2.12.1/gtk -I.. -I/usr/include/python2.5 -I/usr/include/pygtk-2.0 -I/usr/include/glib-2.0 -I/usr/lib/glib-2.0/include -I/build/buildd/pygtk-2.12.1/gtk/gtk -DPNG_NO_MMX_CODE -I/usr/include/pycairo -I/usr/include/cairo -I/usr/include/freetype2 -I/usr/include/libpng12 -I/usr/include/pixman-1 -DPNG_NO_MMX_CODE -I/usr/include/gtk-unix-print-2.0 -I/usr/include/gtk-2.0 -I/usr/include/atk-1.0 -I/usr/include/cairo -I/usr/lib/gtk-2.0/include -I/usr/include/pango-1.0 -I/usr/include/glib-2.0 -I/usr/lib/glib-2.0/include -I/usr/include/freetype2 -I/usr/include/libpng12 -I/usr/include/pixman-1 -g -O2 -Wall -g -O2 -fno-strict-aliasing -std=c9x -MT gtkunixprint_la-gtkunixprintmodule.lo -MD -MP -MF .deps/gtkunixprint_la-gtkunixprintmodule.Tpo -c /build/buildd/pygtk-2.12.1/gtk/gtkunixprintmodule.c -fPIC -DPIC -o .libs/gtkunixprint_la-gtkunixprintmodule.o
/usr/bin/python2.5 /build/buildd/pygtk-2.12.1/codegen/createdefs.py gdk-types.defs gdk-base-types.defs
/usr/bin/python2.5 /build/buildd/pygtk-2.12.1/codegen/createdefs.py gtk-types.defs gtk-base-types.defs gtk-2.10-types.defs gtk-2.12-types.defs
(/usr/bin/python2.5 /build/buildd/pygtk-2.12.1/codegen/codegen.py \
-DHAVE_PYCAIRO -DHAVE_GTK_2_12 -DGDK_TARGET_X11 \
-I /build/buildd/pygtk-2.12.1/gtk \
--py_ssize_t-clean \
--register /build/buildd/pygtk-2.12.1/pango-types.defs \
--register /build/buildd/pygtk-2.12.1/atk-types.defs \
--register gdk-types.defs \
--register gtk-types.defs \
--override /build/buildd/pygtk-2.12.1/gtk/gtkunixprint.override \
--prefix pygtkunixprint /build/buildd/pygtk-2.12.1/gtk/gtkunixprint.defs) > gen-gtkunixprint.c \
&& cp gen-gtkunixprint.c gtkunixprint.c \
&& rm -f gen-gtkunixprint.c
Warning: generating old-style constructor for:gtk_page_setup_unix_dialog_new
Warning: generating old-style constructor for:gtk_print_job_new
Warning: generating old-style constructor for:gtk_print_unix_dialog_new
Warning: generating old-style constructor for:gtk_printer_new
Could not write constructor for GtkPrinter: No ArgType for GtkPrintBackend*
Could not write method GtkPrinter.get_backend: No ArgType for GtkPrintBackend*
Could not write method GtkPrinter.list_papers: No ArgType for GList*
Warning: Constructor for GtkPageSetupUnixDialog needs to be updated to new API
See http://live.gnome.org/PyGTK_2fWhatsNew28#update-constructors
Warning: Constructor for GtkPrintJob needs to be updated to new API
See http://live.gnome.org/PyGTK_2fWhatsNew28#update-constructors
Warning: Constructor for GtkPrintUnixDialog needs to be updated to new API
See http://live.gnome.org/PyGTK_2fWhatsNew28#update-constructors
Warning: Constructor for GtkPrinter needs to be updated to new API
See http://live.gnome.org/PyGTK_2fWhatsNew28#update-constructors
***INFO*** The coverage of global functions is 100.00% (1/1)
***INFO*** The coverage of methods is 94.87% (37/39)
***INFO*** The coverage of virtual proxies is 100.00% (2/2)
***INFO*** The coverage of virtual accessors is 100.00% (2/2)
***INFO*** There are no declared interface proxies.
if /bin/bash ../libtool --tag=CC --mode=compile gcc -DHAVE_CONFIG_H -I. -I/build/buildd/pygtk-2.12.1/gtk -I.. -I/usr/include/python2.5 -I/usr/include/pygtk-2.0 -I/usr/include/glib-2.0 -I/usr/lib/glib-2.0/include -I/build/buildd/pygtk-2.12.1/gtk/gtk -DPNG_NO_MMX_CODE -I/usr/include/pycairo -I/usr/include/cairo -I/usr/include/freetype2 -I/usr/include/libpng12 -I/usr/include/pixman-1 -DPNG_NO_MMX_CODE -I/usr/include/gtk-unix-print-2.0 -I/usr/include/gtk-2.0 -I/usr/include/atk-1.0 -I/usr/include/cairo -I/usr/lib/gtk-2.0/include -I/usr/include/pango-1.0 -I/usr/include/glib-2.0 -I/usr/lib/glib-2.0/include -I/usr/include/freetype2 -I/usr/include/libpng12 -I/usr/include/pixman-1 -g -O2 -Wall -g -O2 -fno-strict-aliasing -std=c9x -MT gtkunixprint_la-gtkunixprint.lo -MD -MP -MF ".deps/gtkunixprint_la-gtkunixprint.Tpo" -c -o gtkunixprint_la-gtkunixprint.lo `test -f 'gtkunixprint.c' || echo '/build/buildd/pygtk-2.12.1/gtk/'`gtkunixprint.c; \
then mv -f ".deps/gtkunixprint_la-gtkunixprint.Tpo" ".deps/gtkunixprint_la-gtkunixprint.Plo"; else rm -f ".deps/gtkunixprint_la-gtkunixprint.Tpo"; exit 1; fi
gcc -DHAVE_CONFIG_H -I. -I/build/buildd/pygtk-2.12.1/gtk -I.. -I/usr/include/python2.5 -I/usr/include/pygtk-2.0 -I/usr/include/glib-2.0 -I/usr/lib/glib-2.0/include -I/build/buildd/pygtk-2.12.1/gtk/gtk -DPNG_NO_MMX_CODE -I/usr/include/pycairo -I/usr/include/cairo -I/usr/include/freetype2 -I/usr/include/libpng12 -I/usr/include/pixman-1 -DPNG_NO_MMX_CODE -I/usr/include/gtk-unix-print-2.0 -I/usr/include/gtk-2.0 -I/usr/include/atk-1.0 -I/usr/include/cairo -I/usr/lib/gtk-2.0/include -I/usr/include/pango-1.0 -I/usr/include/glib-2.0 -I/usr/lib/glib-2.0/include -I/usr/include/freetype2 -I/usr/include/libpng12 -I/usr/include/pixman-1 -g -O2 -Wall -g -O2 -fno-strict-aliasing -std=c9x -MT gtkunixprint_la-gtkunixprint.lo -MD -MP -MF .deps/gtkunixprint_la-gtkunixprint.Tpo -c gtkunixprint.c -fPIC -DPIC -o .libs/gtkunixprint_la-gtkunixprint.o
/bin/bash ../libtool --tag=CC --mode=link gcc -g -O2 -Wall -g -O2 -fno-strict-aliasing -std=c9x -Wl,-Bsymbolic-functions -o gtkunixprint.la -rpath /usr/lib/python2.5/site-packages/gtk-2.0 -module -avoid-version -export-symbols-regex initgtkunixprint gtkunixprint_la-gtkunixprintmodule.lo gtkunixprint_la-gtkunixprint.lo -lgtk-x11-2.0 -lgdk-x11-2.0 -latk-1.0 -lgdk_pixbuf-2.0 -lm -lpangocairo-1.0 -lpango-1.0 -lcairo -lgobject-2.0 -lgmodule-2.0 -ldl -lglib-2.0
generating symbol list for `gtkunixprint.la'
/usr/bin/nm -B .libs/gtkunixprint_la-gtkunixprintmodule.o .libs/gtkunixprint_la-gtkunixprint.o | sed -n -e 's/^.*[ ]\([ABCDGIRSTW][ABCDGIRSTW]*\)[ ][ ]*\([_A-Za-z][_A-Za-z0-9]*\)$/\1 \2 \2/p' | /bin/sed 's/.* //' | sort | uniq > .libs/gtkunixprint.exp
/bin/grep -E -e "initgtkunixprint" ".libs/gtkunixprint.exp" > ".libs/gtkunixprint.expT"
mv -f ".libs/gtkunixprint.expT" ".libs/gtkunixprint.exp"
echo "{ global:" > .libs/gtkunixprint.ver
cat .libs/gtkunixprint.exp | sed -e "s/\(.*\)/\1;/" >> .libs/gtkunixprint.ver
echo "local: *; };" >> .libs/gtkunixprint.ver
gcc -shared .libs/gtkunixprint_la-gtkunixprintmodule.o .libs/gtkunixprint_la-gtkunixprint.o /usr/lib/libgtk-x11-2.0.so /usr/lib/libgdk-x11-2.0.so /usr/lib/libatk-1.0.so /usr/lib/libgdk_pixbuf-2.0.so -lm /usr/lib/libpangocairo-1.0.so /usr/lib/libpango-1.0.so /usr/lib/libcairo.so /usr/lib/libgobject-2.0.so /usr/lib/libgmodule-2.0.so -ldl /usr/lib/libglib-2.0.so -Wl,-Bsymbolic-functions -Wl,-soname -Wl,gtkunixprint.so -Wl,-version-script -Wl,.libs/gtkunixprint.ver -o .libs/gtkunixprint.so
creating gtkunixprint.la
(cd .libs && rm -f gtkunixprint.la && ln -s ../gtkunixprint.la gtkunixprint.la)
if /bin/bash ../libtool --tag=CC --mode=compile gcc -DHAVE_CONFIG_H -I. -I/build/buildd/pygtk-2.12.1/gtk -I.. -I/usr/include/python2.5 -I/usr/include/pygtk-2.0 -I/usr/include/glib-2.0 -I/usr/lib/glib-2.0/include -I/build/buildd/pygtk-2.12.1/gtk/gtk -DPNG_NO_MMX_CODE -I/usr/include/pycairo -I/usr/include/cairo -I/usr/include/freetype2 -I/usr/include/libpng12 -I/usr/include/pixman-1 -DPNG_NO_MMX_CODE -I/usr/include/gtk-2.0 -I/usr/lib/gtk-2.0/include -I/usr/include/atk-1.0 -I/usr/include/cairo -I/usr/include/pango-1.0 -I/usr/include/glib-2.0 -I/usr/lib/glib-2.0/include -I/usr/include/freetype2 -I/usr/include/libpng12 -I/usr/include/pixman-1 -g -O2 -Wall -g -O2 -fno-strict-aliasing -std=c9x -MT _gtk_la-gtk-types.lo -MD -MP -MF ".deps/_gtk_la-gtk-types.Tpo" -c -o _gtk_la-gtk-types.lo `test -f 'gtk-types.c' || echo '/build/buildd/pygtk-2.12.1/gtk/'`gtk-types.c; \
then mv -f ".deps/_gtk_la-gtk-types.Tpo" ".deps/_gtk_la-gtk-types.Plo"; else rm -f ".deps/_gtk_la-gtk-types.Tpo"; exit 1; fi
gcc -DHAVE_CONFIG_H -I. -I/build/buildd/pygtk-2.12.1/gtk -I.. -I/usr/include/python2.5 -I/usr/include/pygtk-2.0 -I/usr/include/glib-2.0 -I/usr/lib/glib-2.0/include -I/build/buildd/pygtk-2.12.1/gtk/gtk -DPNG_NO_MMX_CODE -I/usr/include/pycairo -I/usr/include/cairo -I/usr/include/freetype2 -I/usr/include/libpng12 -I/usr/include/pixman-1 -DPNG_NO_MMX_CODE -I/usr/include/gtk-2.0 -I/usr/lib/gtk-2.0/include -I/usr/include/atk-1.0 -I/usr/include/cairo -I/usr/include/pango-1.0 -I/usr/include/glib-2.0 -I/usr/lib/glib-2.0/include -I/usr/include/freetype2 -I/usr/include/libpng12 -I/usr/include/pixman-1 -g -O2 -Wall -g -O2 -fno-strict-aliasing -std=c9x -MT _gtk_la-gtk-types.lo -MD -MP -MF .deps/_gtk_la-gtk-types.Tpo -c /build/buildd/pygtk-2.12.1/gtk/gtk-types.c -fPIC -DPIC -o .libs/_gtk_la-gtk-types.o
if /bin/bash ../libtool --tag=CC --mode=compile gcc -DHAVE_CONFIG_H -I. -I/build/buildd/pygtk-2.12.1/gtk -I.. -I/usr/include/python2.5 -I/usr/include/pygtk-2.0 -I/usr/include/glib-2.0 -I/usr/lib/glib-2.0/include -I/build/buildd/pygtk-2.12.1/gtk/gtk -DPNG_NO_MMX_CODE -I/usr/include/pycairo -I/usr/include/cairo -I/usr/include/freetype2 -I/usr/include/libpng12 -I/usr/include/pixman-1 -DPNG_NO_MMX_CODE -I/usr/include/gtk-2.0 -I/usr/lib/gtk-2.0/include -I/usr/include/atk-1.0 -I/usr/include/cairo -I/usr/include/pango-1.0 -I/usr/include/glib-2.0 -I/usr/lib/glib-2.0/include -I/usr/include/freetype2 -I/usr/include/libpng12 -I/usr/include/pixman-1 -g -O2 -Wall -g -O2 -fno-strict-aliasing -std=c9x -MT _gtk_la-gtkmodule.lo -MD -MP -MF ".deps/_gtk_la-gtkmodule.Tpo" -c -o _gtk_la-gtkmodule.lo `test -f 'gtkmodule.c' || echo '/build/buildd/pygtk-2.12.1/gtk/'`gtkmodule.c; \
then mv -f ".deps/_gtk_la-gtkmodule.Tpo" ".deps/_gtk_la-gtkmodule.Plo"; else rm -f ".deps/_gtk_la-gtkmodule.Tpo"; exit 1; fi
gcc -DHAVE_CONFIG_H -I. -I/build/buildd/pygtk-2.12.1/gtk -I.. -I/usr/include/python2.5 -I/usr/include/pygtk-2.0 -I/usr/include/glib-2.0 -I/usr/lib/glib-2.0/include -I/build/buildd/pygtk-2.12.1/gtk/gtk -DPNG_NO_MMX_CODE -I/usr/include/pycairo -I/usr/include/cairo -I/usr/include/freetype2 -I/usr/include/libpng12 -I/usr/include/pixman-1 -DPNG_NO_MMX_CODE -I/usr/include/gtk-2.0 -I/usr/lib/gtk-2.0/include -I/usr/include/atk-1.0 -I/usr/include/cairo -I/usr/include/pango-1.0 -I/usr/include/glib-2.0 -I/usr/lib/glib-2.0/include -I/usr/include/freetype2 -I/usr/include/libpng12 -I/usr/include/pixman-1 -g -O2 -Wall -g -O2 -fno-strict-aliasing -std=c9x -MT _gtk_la-gtkmodule.lo -MD -MP -MF .deps/_gtk_la-gtkmodule.Tpo -c /build/buildd/pygtk-2.12.1/gtk/gtkmodule.c -fPIC -DPIC -o .libs/_gtk_la-gtkmodule.o
if /bin/bash ../libtool --tag=CC --mode=compile gcc -DHAVE_CONFIG_H -I. -I/build/buildd/pygtk-2.12.1/gtk -I.. -I/usr/include/python2.5 -I/usr/include/pygtk-2.0 -I/usr/include/glib-2.0 -I/usr/lib/glib-2.0/include -I/build/buildd/pygtk-2.12.1/gtk/gtk -DPNG_NO_MMX_CODE -I/usr/include/pycairo -I/usr/include/cairo -I/usr/include/freetype2 -I/usr/include/libpng12 -I/usr/include/pixman-1 -DPNG_NO_MMX_CODE -I/usr/include/gtk-2.0 -I/usr/lib/gtk-2.0/include -I/usr/include/atk-1.0 -I/usr/include/cairo -I/usr/include/pango-1.0 -I/usr/include/glib-2.0 -I/usr/lib/glib-2.0/include -I/usr/include/freetype2 -I/usr/include/libpng12 -I/usr/include/pixman-1 -g -O2 -Wall -g -O2 -fno-strict-aliasing -std=c9x -MT _gtk_la-gtkobject-support.lo -MD -MP -MF ".deps/_gtk_la-gtkobject-support.Tpo" -c -o _gtk_la-gtkobject-support.lo `test -f 'gtkobject-support.c' || echo '/build/buildd/pygtk-2.12.1/gtk/'`gtkobject-support.c; \
then mv -f ".deps/_gtk_la-gtkobject-support.Tpo" ".deps/_gtk_la-gtkobject-support.Plo"; else rm -f ".deps/_gtk_la-gtkobject-support.Tpo"; exit 1; fi
gcc -DHAVE_CONFIG_H -I. -I/build/buildd/pygtk-2.12.1/gtk -I.. -I/usr/include/python2.5 -I/usr/include/pygtk-2.0 -I/usr/include/glib-2.0 -I/usr/lib/glib-2.0/include -I/build/buildd/pygtk-2.12.1/gtk/gtk -DPNG_NO_MMX_CODE -I/usr/include/pycairo -I/usr/include/cairo -I/usr/include/freetype2 -I/usr/include/libpng12 -I/usr/include/pixman-1 -DPNG_NO_MMX_CODE -I/usr/include/gtk-2.0 -I/usr/lib/gtk-2.0/include -I/usr/include/atk-1.0 -I/usr/include/cairo -I/usr/include/pango-1.0 -I/usr/include/glib-2.0 -I/usr/lib/glib-2.0/include -I/usr/include/freetype2 -I/usr/include/libpng12 -I/usr/include/pixman-1 -g -O2 -Wall -g -O2 -fno-strict-aliasing -std=c9x -MT _gtk_la-gtkobject-support.lo -MD -MP -MF .deps/_gtk_la-gtkobject-support.Tpo -c /build/buildd/pygtk-2.12.1/gtk/gtkobject-support.c -fPIC -DPIC -o .libs/_gtk_la-gtkobject-support.o
if /bin/bash ../libtool --tag=CC --mode=compile gcc -DHAVE_CONFIG_H -I. -I/build/buildd/pygtk-2.12.1/gtk -I.. -I/usr/include/python2.5 -I/usr/include/pygtk-2.0 -I/usr/include/glib-2.0 -I/usr/lib/glib-2.0/include -I/build/buildd/pygtk-2.12.1/gtk/gtk -DPNG_NO_MMX_CODE -I/usr/include/pycairo -I/usr/include/cairo -I/usr/include/freetype2 -I/usr/include/libpng12 -I/usr/include/pixman-1 -DPNG_NO_MMX_CODE -I/usr/include/gtk-2.0 -I/usr/lib/gtk-2.0/include -I/usr/include/atk-1.0 -I/usr/include/cairo -I/usr/include/pango-1.0 -I/usr/include/glib-2.0 -I/usr/lib/glib-2.0/include -I/usr/include/freetype2 -I/usr/include/libpng12 -I/usr/include/pixman-1 -g -O2 -Wall -g -O2 -fno-strict-aliasing -std=c9x -MT _gtk_la-pygtkcellrenderer.lo -MD -MP -MF ".deps/_gtk_la-pygtkcellrenderer.Tpo" -c -o _gtk_la-pygtkcellrenderer.lo `test -f 'pygtkcellrenderer.c' || echo '/build/buildd/pygtk-2.12.1/gtk/'`pygtkcellrenderer.c; \
then mv -f ".deps/_gtk_la-pygtkcellrenderer.Tpo" ".deps/_gtk_la-pygtkcellrenderer.Plo"; else rm -f ".deps/_gtk_la-pygtkcellrenderer.Tpo"; exit 1; fi
gcc -DHAVE_CONFIG_H -I. -I/build/buildd/pygtk-2.12.1/gtk -I.. -I/usr/include/python2.5 -I/usr/include/pygtk-2.0 -I/usr/include/glib-2.0 -I/usr/lib/glib-2.0/include -I/build/buildd/pygtk-2.12.1/gtk/gtk -DPNG_NO_MMX_CODE -I/usr/include/pycairo -I/usr/include/cairo -I/usr/include/freetype2 -I/usr/include/libpng12 -I/usr/include/pixman-1 -DPNG_NO_MMX_CODE -I/usr/include/gtk-2.0 -I/usr/lib/gtk-2.0/include -I/usr/include/atk-1.0 -I/usr/include/cairo -I/usr/include/pango-1.0 -I/usr/include/glib-2.0 -I/usr/lib/glib-2.0/include -I/usr/include/freetype2 -I/usr/include/libpng12 -I/usr/include/pixman-1 -g -O2 -Wall -g -O2 -fno-strict-aliasing -std=c9x -MT _gtk_la-pygtkcellrenderer.lo -MD -MP -MF .deps/_gtk_la-pygtkcellrenderer.Tpo -c /build/buildd/pygtk-2.12.1/gtk/pygtkcellrenderer.c -fPIC -DPIC -o .libs/_gtk_la-pygtkcellrenderer.o
if /bin/bash ../libtool --tag=CC --mode=compile gcc -DHAVE_CONFIG_H -I. -I/build/buildd/pygtk-2.12.1/gtk -I.. -I/usr/include/python2.5 -I/usr/include/pygtk-2.0 -I/usr/include/glib-2.0 -I/usr/lib/glib-2.0/include -I/build/buildd/pygtk-2.12.1/gtk/gtk -DPNG_NO_MMX_CODE -I/usr/include/pycairo -I/usr/include/cairo -I/usr/include/freetype2 -I/usr/include/libpng12 -I/usr/include/pixman-1 -DPNG_NO_MMX_CODE -I/usr/include/gtk-2.0 -I/usr/lib/gtk-2.0/include -I/usr/include/atk-1.0 -I/usr/include/cairo -I/usr/include/pango-1.0 -I/usr/include/glib-2.0 -I/usr/lib/glib-2.0/include -I/usr/include/freetype2 -I/usr/include/libpng12 -I/usr/include/pixman-1 -g -O2 -Wall -g -O2 -fno-strict-aliasing -std=c9x -MT _gtk_la-pygtktreemodel.lo -MD -MP -MF ".deps/_gtk_la-pygtktreemodel.Tpo" -c -o _gtk_la-pygtktreemodel.lo `test -f 'pygtktreemodel.c' || echo '/build/buildd/pygtk-2.12.1/gtk/'`pygtktreemodel.c; \
then mv -f ".deps/_gtk_la-pygtktreemodel.Tpo" ".deps/_gtk_la-pygtktreemodel.Plo"; else rm -f ".deps/_gtk_la-pygtktreemodel.Tpo"; exit 1; fi
gcc -DHAVE_CONFIG_H -I. -I/build/buildd/pygtk-2.12.1/gtk -I.. -I/usr/include/python2.5 -I/usr/include/pygtk-2.0 -I/usr/include/glib-2.0 -I/usr/lib/glib-2.0/include -I/build/buildd/pygtk-2.12.1/gtk/gtk -DPNG_NO_MMX_CODE -I/usr/include/pycairo -I/usr/include/cairo -I/usr/include/freetype2 -I/usr/include/libpng12 -I/usr/include/pixman-1 -DPNG_NO_MMX_CODE -I/usr/include/gtk-2.0 -I/usr/lib/gtk-2.0/include -I/usr/include/atk-1.0 -I/usr/include/cairo -I/usr/include/pango-1.0 -I/usr/include/glib-2.0 -I/usr/lib/glib-2.0/include -I/usr/include/freetype2 -I/usr/include/libpng12 -I/usr/include/pixman-1 -g -O2 -Wall -g -O2 -fno-strict-aliasing -std=c9x -MT _gtk_la-pygtktreemodel.lo -MD -MP -MF .deps/_gtk_la-pygtktreemodel.Tpo -c /build/buildd/pygtk-2.12.1/gtk/pygtktreemodel.c -fPIC -DPIC -o .libs/_gtk_la-pygtktreemodel.o
/build/buildd/pygtk-2.12.1/gtk/pygtktreemodel.c: In function 'pygtk_generic_tree_model_create_tree_iter':
/build/buildd/pygtk-2.12.1/gtk/pygtktreemodel.c:840: warning: 'iter.user_data3' is used uninitialized in this function
/build/buildd/pygtk-2.12.1/gtk/pygtktreemodel.c:840: warning: 'iter.user_data2' is used uninitialized in this function
/usr/bin/python2.5 /build/buildd/pygtk-2.12.1/codegen/createdefs.py gtk.defs gtk-base.defs gtk-2.10.defs gtk-2.12.defs
(/usr/bin/python2.5 /build/buildd/pygtk-2.12.1/codegen/codegen.py \
-DHAVE_PYCAIRO -DHAVE_GTK_2_12 -DGDK_TARGET_X11 \
-I /build/buildd/pygtk-2.12.1/gtk \
--py_ssize_t-clean \
--register /build/buildd/pygtk-2.12.1/pango-types.defs \
--register /build/buildd/pygtk-2.12.1/atk-types.defs \
--register gdk-types.defs \
--register gtk-types.defs \
--override /build/buildd/pygtk-2.12.1/gtk/gtk.override \
--prefix pygtk gtk.defs) > gen-gtk.c \
&& cp gen-gtk.c gtk.c \
&& rm -f gen-gtk.c
Could not write method GtkPaperSize.to_key_file: No ArgType for GKeyFile*
Could not write method GtkWidget.list_accel_closures: No ArgType for GList*
Could not write method GtkWidget.style_get: varargs functions not supported
Could not write virtual accessor method GtkWidget.dispatch_child_properties_changed: No ArgType for GParamSpec**
Could not write virtual accessor method GtkWidget.child_notify: No ArgType for GParamSpec*
Could not write virtual proxy GtkWidget.dispatch_child_properties_changed: No ArgType for GParamSpec**
Could not write virtual proxy GtkWidget.child_notify: No ArgType for GParamSpec*
Could not write virtual proxy GtkContainer.child_type: No ArgType for GType
Could not write method GtkAccelGroup.activate: No ArgType for GQuark
Could not write method GtkAccelGroup.find: No ArgType for GtkAccelKey*
Could not write method GtkAccelGroup.query: No ArgType for guint*
Could not write virtual accessor method GtkAccelGroup.accel_changed: No ArgType for GClosure*
Could not write virtual proxy GtkAccelGroup.accel_changed: No ArgType for GClosure*
Could not write method GtkAccelLabel.set_accel_closure: No ArgType for GClosure*
Could not write method GtkAction.get_accel_closure: No ArgType for GClosure*
Could not write method GtkActionGroup.set_translate_func: No ArgType for GtkTranslateFunc
Could not write virtual accessor method GtkMenuItem.toggle_size_request: No ArgType for gint*
Warning: generating old-style constructor for:gtk_clipboard_get_for_display
Could not write virtual accessor method GtkCList.selection_find: No ArgType for GList*
Could not write virtual accessor method GtkCList.draw_row: No ArgType for GtkCListRow*
Could not write virtual accessor method GtkCList.draw_drag_highlight: No ArgType for GtkCListRow*
Could not write virtual accessor method GtkCList.insert_row: No ArgType for gchar*[]
Could not write virtual accessor method GtkCList.set_cell_contents: No ArgType for GtkCListRow*
Could not write virtual accessor method GtkCList.cell_size_request: No ArgType for GtkCListRow*
Could not write virtual proxy GtkCList.selection_find: No ArgType for GList*
Could not write virtual proxy GtkCList.draw_row: No ArgType for GtkCListRow*
Could not write virtual proxy GtkCList.draw_drag_highlight: No ArgType for GtkCListRow*
Could not write virtual proxy GtkCList.insert_row: No ArgType for gchar*[]
Could not write virtual proxy GtkCList.set_cell_contents: No ArgType for GtkCListRow*
Could not write virtual proxy GtkCList.cell_size_request: No ArgType for GtkCListRow*
Could not write method GtkCTree.set_drag_compare_func: No ArgType for GtkCTreeCompareDragFunc
Could not write virtual proxy GtkCTree.tree_select_row: No ArgType for GtkCTreeNode*
Could not write virtual proxy GtkCTree.tree_unselect_row: No ArgType for GtkCTreeNode*
Could not write virtual proxy GtkCTree.tree_expand: No ArgType for GtkCTreeNode*
Could not write virtual proxy GtkCTree.tree_collapse: No ArgType for GtkCTreeNode*
Could not write virtual proxy GtkCTree.tree_move: No ArgType for GtkCTreeNode*
Could not write virtual accessor method GtkScale.get_layout_offsets: No ArgType for gint*
Could not write virtual proxy GtkScale.get_layout_offsets: cannot use int* parameter with direction 'None'
Could not write method GtkIconView.convert_widget_to_bin_window_coords: No ArgType for gint*
Could not write method GtkIconView.get_tooltip_context: No ArgType for gint*
Could not write virtual accessor method GtkIMContext.get_preedit_string: No ArgType for gchar**
Could not write virtual accessor method GtkIMContext.get_surrounding: No ArgType for gchar**
Could not write virtual proxy GtkIMContext.get_preedit_string: No ArgType for gchar**
Could not write virtual proxy GtkIMContext.get_surrounding: No ArgType for gchar**
Could not write method GtkIMContextSimple.add_table: No ArgType for guint16*
Warning: generating old-style constructor for:gtk_item_factory_new
Could not write method GtkListStore.set_valuesv: No ArgType for gint*
Could not write method GtkNotebook.set_group: No ArgType for gpointer
Could not write method GtkNotebook.get_group: No ArgType for gpointer
Could not write virtual accessor method GtkNotebook.switch_page: No ArgType for GtkNotebookPage*
Could not write virtual proxy GtkNotebook.switch_page: No ArgType for GtkNotebookPage*
Warning: generating old-style constructor for:gtk_preview_new
Could not write virtual accessor method GtkRcStyle.parse: No ArgType for GScanner*
Could not write virtual proxy GtkRcStyle.parse: No ArgType for GScanner*
Could not write method GtkSettings.set_property_value: No ArgType for const-GtkSettingsValue*
Could not write virtual accessor method GtkSpinButton.input: No ArgType for gdouble*
Could not write virtual accessor method GtkStyle.draw_polygon: No ArgType for GdkPoint*
Could not write virtual proxy GtkStyle.draw_polygon: No ArgType for GdkPoint*
Warning: generating old-style constructor for:gtk_text_mark_new
Could not write method GtkTreeSelection.get_user_data: No ArgType for gpointer
Could not write method GtkTreeStore.set_valuesv: No ArgType for gint*
Could not write method GtkTreeView.set_destroy_count_func: No ArgType for GtkTreeDestroyCountFunc
Could not write method GtkTreeView.get_tooltip_context: No ArgType for gint*
Warning: generating old-style constructor for:gtk_link_button_new_with_label
Could not write method GtkPageSetup.to_key_file: No ArgType for GKeyFile*
Could not write method GtkPrintSettings.to_key_file: No ArgType for GKeyFile*
Could not write virtual proxy GtkStatusIcon.popup_menu: No ArgType for guint32
Could not write method GtkBuilder.connect_signals_full: No ArgType for GtkBuilderConnectFunc
Could not write method GtkBuilder.value_from_string: No ArgType for GParamSpec*
Could not write method GtkBuilder.value_from_string_type: No ArgType for GValue*
Could not write virtual proxy GtkBuilder.get_type_from_name: No ArgType for GType
Warning: generating old-style constructor for:gtk_recent_action_new
Could not write virtual accessor method GtkCellLayout.set_cell_data_func: No ArgType for GtkCellLayoutDataFunc
Could not write virtual accessor method GtkTreeModel.rows_reordered: No ArgType for gint*
Could not write virtual accessor method GtkTreeModel.get_value: No ArgType for GValue*
Could not write interface proxy GtkTreeModel.rows_reordered: cannot use int* parameter with direction 'None'
Could not write interface proxy GtkTreeModel.get_column_type: No ArgType for GType
Could not write interface proxy GtkTreeModel.get_value: No ArgType for GValue*
Could not write virtual accessor method GtkTreeSortable.get_sort_column_id: No ArgType for gint*
Could not write virtual accessor method GtkTreeSortable.set_sort_func: No ArgType for GtkTreeIterCompareFunc
Could not write virtual accessor method GtkTreeSortable.set_default_sort_func: No ArgType for GtkTreeIterCompareFunc
Could not write interface proxy GtkTreeSortable.get_sort_column_id: cannot use int* parameter with direction 'None'
Could not write interface proxy GtkTreeSortable.set_sort_func: No ArgType for GtkTreeIterCompareFunc
Could not write interface proxy GtkTreeSortable.set_default_sort_func: No ArgType for GtkTreeIterCompareFunc
Could not write virtual accessor method GtkRecentChooser.get_items: No ArgType for GList*
Could not write virtual accessor method GtkRecentChooser.list_filters: No ArgType for GSList*
Could not write virtual accessor method GtkRecentChooser.set_sort_func: No ArgType for GtkRecentSortFunc
Could not write interface proxy GtkRecentChooser.get_items: No ArgType for GList*
Could not write interface proxy GtkRecentChooser.list_filters: No ArgType for GSList*
Could not write interface proxy GtkRecentChooser.set_sort_func: No ArgType for GtkRecentSortFunc
Could not write method GtkBuildable.set_buildable_property: No ArgType for const-GValue*
Could not write method GtkBuildable.custom_tag_start: No ArgType for GMarkupParser*
Could not write method GtkBuildable.custom_tag_end: No ArgType for gpointer*
Could not write method GtkBuildable.custom_finished: No ArgType for gpointer
Could not write virtual accessor method GtkBuildable.get_name: No ArgType for constgchar*
Could not write virtual accessor method GtkBuildable.set_buildable_property: No ArgType for const-GValue*
Could not write virtual accessor method GtkBuildable.custom_tag_start: No ArgType for GMarkupParser*
Could not write virtual accessor method GtkBuildable.custom_tag_end: No ArgType for gpointer*
Could not write virtual accessor method GtkBuildable.custom_finished: No ArgType for gpointer
Could not write interface proxy GtkBuildable.get_name: No ArgType for constgchar*
Could not write interface proxy GtkBuildable.set_buildable_property: No ArgType for const-GValue*
Could not write interface proxy GtkBuildable.custom_tag_start: No ArgType for GMarkupParser*
Could not write interface proxy GtkBuildable.custom_tag_end: No ArgType for gpointer*
Could not write interface proxy GtkBuildable.custom_finished: No ArgType for gpointer
Could not write function show_about_dialog: varargs functions not supported
Could not write function accel_group_from_accel_closure: No ArgType for GClosure*
Could not write function accel_map_load_scanner: No ArgType for GScanner*
Could not write function binding_entry_clear: No ArgType for GtkBindingSet*
Could not write function binding_entry_add_signall: No ArgType for GtkBindingSet*
Could not write function binding_parse_binding: No ArgType for GScanner*
Could not write function color_selection_set_change_palette_hook: No ArgType for GtkColorSelectionChangePaletteFunc
Could not write function color_selection_set_change_palette_with_screen_hook: No ArgType for GtkColorSelectionChangePaletteWithScreenFunc
Could not write function file_paths_sort: No ArgType for GSList*
Could not write function item_factory_popup_data_from_widget: No ArgType for gpointer
Could not write function init_add: No ArgType for GtkFunction
Could not write function parse_args: No ArgType for int*
Could not write function init_with_args: No ArgType for int*
Could not write function get_option_group: No ArgType for GOptionGroup*
Could not write function settings_install_property: No ArgType for GParamSpec*
Could not write function settings_install_property_parser: No ArgType for GParamSpec*
Could not write function stock_add_static: No ArgType for const-GtkStockItem*
Could not write function stock_set_translate_func: No ArgType for GtkTranslateFunc
Could not write function print_run_page_setup_dialog_async: No ArgType for GtkPageSetupDoneFunc
Could not write function builder_error_quark: No ArgType for GQuark
Could not write function page_setup_new_from_key_file: No ArgType for GKeyFile*
Could not write function paper_size_get_paper_sizes: No ArgType for GList*
Could not write function paper_size_new_from_key_file: No ArgType for GKeyFile*
Could not write function print_settings_new_from_key_file: No ArgType for GKeyFile*
Could not write function rc_parse_color_full: No ArgType for GScanner*
Warning: Constructor for GtkAccessible needs to be updated to new API
See http://live.gnome.org/PyGTK_2fWhatsNew28#update-constructors
Warning: Constructor for GtkClipboard needs to be updated to new API
See http://live.gnome.org/PyGTK_2fWhatsNew28#update-constructors
Warning: Constructor for GtkListStore needs to be updated to new API
See http://live.gnome.org/PyGTK_2fWhatsNew28#update-constructors
Warning: Constructor for GtkItemFactory needs to be updated to new API
See http://live.gnome.org/PyGTK_2fWhatsNew28#update-constructors
Warning: Constructor for GtkTextMark needs to be updated to new API
See http://live.gnome.org/PyGTK_2fWhatsNew28#update-constructors
Warning: Constructor for GtkTreeStore needs to be updated to new API
See http://live.gnome.org/PyGTK_2fWhatsNew28#update-constructors
Warning: Constructor for GtkTreeViewColumn needs to be updated to new API
See http://live.gnome.org/PyGTK_2fWhatsNew28#update-constructors
Warning: Constructor for GtkPreview needs to be updated to new API
See http://live.gnome.org/PyGTK_2fWhatsNew28#update-constructors
Warning: Constructor for GtkImageMenuItem needs to be updated to new API
See http://live.gnome.org/PyGTK_2fWhatsNew28#update-constructors
Warning: Constructor for GtkListItem needs to be updated to new API
See http://live.gnome.org/PyGTK_2fWhatsNew28#update-constructors
Warning: Constructor for GtkCList needs to be updated to new API
See http://live.gnome.org/PyGTK_2fWhatsNew28#update-constructors
Warning: Constructor for GtkCTree needs to be updated to new API
See http://live.gnome.org/PyGTK_2fWhatsNew28#update-constructors
Warning: Constructor for GtkMessageDialog needs to be updated to new API
See http://live.gnome.org/PyGTK_2fWhatsNew28#update-constructors
Warning: Constructor for GtkLinkButton needs to be updated to new API
See http://live.gnome.org/PyGTK_2fWhatsNew28#update-constructors
Warning: Constructor for GtkRecentAction needs to be updated to new API
See http://live.gnome.org/PyGTK_2fWhatsNew28#update-constructors
***INFO*** The coverage of global functions is 87.24% (171/196)
***INFO*** The coverage of methods is 98.72% (2314/2344)
***INFO*** The coverage of virtual proxies is 94.43% (390/413)
***INFO*** The coverage of virtual accessors is 93.70% (461/492)
***INFO*** The coverage of interface proxies is 82.28% (65/79)
if /bin/bash ../libtool --tag=CC --mode=compile gcc -DHAVE_CONFIG_H -I. -I/build/buildd/pygtk-2.12.1/gtk -I.. -I/usr/include/python2.5 -I/usr/include/pygtk-2.0 -I/usr/include/glib-2.0 -I/usr/lib/glib-2.0/include -I/build/buildd/pygtk-2.12.1/gtk/gtk -DPNG_NO_MMX_CODE -I/usr/include/pycairo -I/usr/include/cairo -I/usr/include/freetype2 -I/usr/include/libpng12 -I/usr/include/pixman-1 -DPNG_NO_MMX_CODE -I/usr/include/gtk-2.0 -I/usr/lib/gtk-2.0/include -I/usr/include/atk-1.0 -I/usr/include/cairo -I/usr/include/pango-1.0 -I/usr/include/glib-2.0 -I/usr/lib/glib-2.0/include -I/usr/include/freetype2 -I/usr/include/libpng12 -I/usr/include/pixman-1 -g -O2 -Wall -g -O2 -fno-strict-aliasing -std=c9x -MT _gtk_la-gtk.lo -MD -MP -MF ".deps/_gtk_la-gtk.Tpo" -c -o _gtk_la-gtk.lo `test -f 'gtk.c' || echo '/build/buildd/pygtk-2.12.1/gtk/'`gtk.c; \
then mv -f ".deps/_gtk_la-gtk.Tpo" ".deps/_gtk_la-gtk.Plo"; else rm -f ".deps/_gtk_la-gtk.Tpo"; exit 1; fi
gcc -DHAVE_CONFIG_H -I. -I/build/buildd/pygtk-2.12.1/gtk -I.. -I/usr/include/python2.5 -I/usr/include/pygtk-2.0 -I/usr/include/glib-2.0 -I/usr/lib/glib-2.0/include -I/build/buildd/pygtk-2.12.1/gtk/gtk -DPNG_NO_MMX_CODE -I/usr/include/pycairo -I/usr/include/cairo -I/usr/include/freetype2 -I/usr/include/libpng12 -I/usr/include/pixman-1 -DPNG_NO_MMX_CODE -I/usr/include/gtk-2.0 -I/usr/lib/gtk-2.0/include -I/usr/include/atk-1.0 -I/usr/include/cairo -I/usr/include/pango-1.0 -I/usr/include/glib-2.0 -I/usr/lib/glib-2.0/include -I/usr/include/freetype2 -I/usr/include/libpng12 -I/usr/include/pixman-1 -g -O2 -Wall -g -O2 -fno-strict-aliasing -std=c9x -MT _gtk_la-gtk.lo -MD -MP -MF .deps/_gtk_la-gtk.Tpo -c gtk.c -fPIC -DPIC -o .libs/_gtk_la-gtk.o
/build/buildd/pygtk-2.12.1/gtk/gtk.override: In function 'pygtk_main_watch_prepare':
/build/buildd/pygtk-2.12.1/gtk/gtk.override:1097: warning: suggest explicit braces to avoid ambiguous 'else'
/usr/bin/python2.5 /build/buildd/pygtk-2.12.1/codegen/createdefs.py gdk.defs gdk-base.defs gdk-2.10.defs gdk-2.12.defs
(/usr/bin/python2.5 /build/buildd/pygtk-2.12.1/codegen/codegen.py \
-DHAVE_PYCAIRO -DHAVE_GTK_2_12 -DGDK_TARGET_X11 \
-I /build/buildd/pygtk-2.12.1/gtk \
--py_ssize_t-clean \
--register /build/buildd/pygtk-2.12.1/pango-types.defs \
--register /build/buildd/pygtk-2.12.1/atk-types.defs \
--register gdk-types.defs \
--register gtk-types.defs \
--override /build/buildd/pygtk-2.12.1/gtk/gdk.override \
--prefix pygdk gdk.defs) > gen-gdk.c \
&& cp gen-gdk.c gdk.c \
&& rm -f gen-gdk.c
Could not write method GdkFont.text_width_wc: No ArgType for const-GdkWChar*
Could not write method GdkFont.char_width_wc: No ArgType for GdkWChar
Could not write method GdkFont.text_extents_wc: No ArgType for const-GdkWChar*
Could not write method GdkFont.string_extents: No ArgType for gint*
Could not write method GdkFont.get_xfont: No ArgType for gpointer
Could not write method GdkFont.x11_font_get_xdisplay: No ArgType for Display*
Could not write method GdkCursor.get_xdisplay: No ArgType for Display*
Could not write method GdkCursor.get_xcursor: No ArgType for Cursor
Could not write method GdkRegion.get_rectangles: No ArgType for GdkRectangle**
Could not write method GdkRegion.spans_intersect_foreach: No ArgType for GdkSpan*
Warning: generating old-style constructor for:gdk_colormap_new
Could not write method GdkColormap.alloc_colors: No ArgType for gboolean*
Could not write method GdkColormap.get_xdisplay: No ArgType for Display*
Could not write method GdkColormap.get_xcolormap: No ArgType for Colormap
Warning: generating old-style constructor for:gdk_display_open
Could not write method GdkDisplay.add_client_message_filter: No ArgType for GdkFilterFunc
Could not write method GdkDisplay.set_pointer_hooks: No ArgType for const-GdkDisplayPointerHooks*
Could not write method GdkDisplay.get_xdisplay: No ArgType for Display*
Could not write method GdkDisplay.set_cursor_theme: No ArgType for const-gint
Could not write method GdkDrawable.set_data: No ArgType for gpointer
Could not write method GdkDrawable.get_data: No ArgType for gpointer
Could not write method GdkDrawable.draw_text_wc: No ArgType for const-GdkWChar*
Could not write method GdkDrawable.get_xdisplay: No ArgType for Display*
Could not write method GdkDrawable.get_xid: No ArgType for XID
Could not write virtual accessor method GdkDrawable.create_gc: No ArgType for GdkGCValues*
Could not write virtual accessor method GdkDrawable.draw_polygon: No ArgType for GdkPoint*
Could not write virtual accessor method GdkDrawable.draw_text_wc: No ArgType for const-GdkWChar*
Could not write virtual accessor method GdkDrawable.draw_points: No ArgType for GdkPoint*
Could not write virtual accessor method GdkDrawable.draw_segments: No ArgType for GdkSegment*
Could not write virtual accessor method GdkDrawable.draw_lines: No ArgType for GdkPoint*
Could not write virtual accessor method GdkDrawable.get_size: No ArgType for gint*
Could not write virtual accessor method GdkDrawable.get_composite_drawable: No ArgType for gint*
Could not write virtual accessor method GdkDrawable.draw_trapezoids: No ArgType for GdkTrapezoid*
Could not write virtual accessor method GdkDrawable.ref_cairo_surface: No ArgType for cairo_surface_t*
Could not write virtual proxy GdkDrawable.create_gc: No ArgType for GdkGCValues*
Could not write virtual proxy GdkDrawable.draw_polygon: No ArgType for GdkPoint*
Could not write virtual proxy GdkDrawable.draw_text_wc: No ArgType for const-GdkWChar*
Could not write virtual proxy GdkDrawable.draw_points: No ArgType for GdkPoint*
Could not write virtual proxy GdkDrawable.draw_segments: No ArgType for GdkSegment*
Could not write virtual proxy GdkDrawable.draw_lines: No ArgType for GdkPoint*
Could not write virtual proxy GdkDrawable.get_size: cannot use int* parameter with direction 'None'
Could not write virtual proxy GdkDrawable.get_composite_drawable: cannot use int* parameter with direction 'None'
Could not write virtual proxy GdkDrawable.draw_trapezoids: No ArgType for GdkTrapezoid*
Could not write virtual proxy GdkDrawable.ref_cairo_surface: No ArgType for cairo_surface_t*
Could not write method GdkWindow.selection_property_get: No ArgType for guchar**
Could not write method GdkWindow.remove_filter: No ArgType for GdkFilterFunc
Could not write method GdkWindow.invalidate_maybe_recurse: No ArgType for gboolean (*child_func)(GdkWindow *, gpointer)
Could not write method GdkWindow.get_internal_paint_info: No ArgType for GdkDrawable**
Warning: generating old-style constructor for:gdk_pango_renderer_new
Warning: generating old-style constructor for:gdk_pixmap_new
Could not write method GdkGC.get_values: No ArgType for GdkGCValues*
Could not write method GdkGC.get_xdisplay: No ArgType for Display*
Could not write method GdkGC.get_xgc: No ArgType for GC
Could not write virtual accessor method GdkGC.get_values: No ArgType for GdkGCValues*
Could not write virtual accessor method GdkGC.set_values: No ArgType for GdkGCValues*
Could not write virtual accessor method GdkGC.set_dashes: No ArgType for gint8[]
Could not write virtual proxy GdkGC.get_values: No ArgType for GdkGCValues*
Could not write virtual proxy GdkGC.set_values: No ArgType for GdkGCValues*
Could not write virtual proxy GdkGC.set_dashes: No ArgType for gint8[]
Warning: generating old-style constructor for:gdk_image_new
Could not write method GdkImage.get_xdisplay: No ArgType for Display*
Could not write method GdkImage.get_ximage: No ArgType for XImage*
Warning: generating old-style constructor for:gdk_pixbuf_new
Could not write method GdkPixbuf.render_pixmap_and_mask_for_colormap: No ArgType for GdkPixmap**
Could not write method GdkPixbuf.savev: No ArgType for char**
Could not write method GdkPixbuf.save_to_callbackv: No ArgType for GdkPixbufSaveFunc
Could not write method GdkPixbuf.save_to_buffer: varargs functions not supported
Could not write method GdkPixbuf.save_to_bufferv: No ArgType for gchar**
Warning: generating old-style constructor for:gdk_pixbuf_animation_new_from_file
Warning: generating old-style constructor for:gdk_pixbuf_simple_anim_new
Could not write method GdkScreen.get_xscreen: No ArgType for Screen*
Could not write method GdkScreen.lookup_visual: No ArgType for VisualID
Could not write method GdkScreen.get_window_stack: No ArgType for GList*
Warning: generating old-style constructor for:gdk_visual_get_best_with_both
Could not write method GdkVisual.get_xvisual: No ArgType for Visual*
Could not write function parse_args: No ArgType for gint*
Could not write function init: No ArgType for gint*
Could not write function init_check: No ArgType for gint*
Could not write function input_add_full: No ArgType for GdkInputFunction
Could not write function input_add: No ArgType for GdkInputFunction
Could not write function wcstombs: No ArgType for const-GdkWChar*
Could not write function mbstowcs: No ArgType for GdkWChar*
Could not write function threads_set_lock_functions: No ArgType for GCallback
Could not write function colors_alloc: No ArgType for gulong*
Could not write function colors_free: No ArgType for gulong*
Could not write function drag_get_protocol: No ArgType for GdkDragProtocol*
Could not write function drag_get_protocol_for_display: No ArgType for GdkDragProtocol*
Could not write function draw_trapezoids: No ArgType for GdkTrapezoid*
Could not write function add_client_message_filter: No ArgType for GdkFilterFunc
Could not write function setting_get: No ArgType for GValue*
Could not write function image_new_bitmap: No ArgType for gpointer
Could not write function pango_layout_line_get_clip_region: No ArgType for gint*
Could not write function pango_layout_get_clip_region: No ArgType for gint*
Could not write function text_property_to_text_list: No ArgType for gchar***
Could not write function text_property_to_utf8_list: No ArgType for gchar***
Could not write function utf8_to_compound_text: No ArgType for GdkAtom*
Could not write function string_to_compound_text: No ArgType for GdkAtom*
Could not write function text_property_to_text_list_for_display: No ArgType for gchar***
Could not write function text_property_to_utf8_list_for_display: No ArgType for gchar***
Could not write function string_to_compound_text_for_display: No ArgType for GdkAtom*
Could not write function utf8_to_compound_text_for_display: No ArgType for GdkAtom*
Could not write function free_text_list: No ArgType for gchar**
Could not write function rgb_cmap_new: No ArgType for guint32*
Could not write function window_constrain_size: No ArgType for GdkGeometry*
Could not write function set_pointer_hooks: No ArgType for const-GdkPointerHooks*
Could not write function pixbuf_error_quark: No ArgType for GQuark
Could not write function region_polygon: No ArgType for GdkPoint*
Could not write function x11_get_default_root_xwindow: No ArgType for Window
Could not write function x11_get_default_xdisplay: No ArgType for Display*
Could not write function gdkx_visual_get: No ArgType for VisualID
Could not write function gdkx_colormap_get: No ArgType for Colormap
Could not write function xid_table_lookup_for_display: No ArgType for XID
Could not write function xid_table_lookup: No ArgType for XID
Could not write function x11_lookup_xdisplay: No ArgType for Display*
Could not write function x11_atom_to_xatom_for_display: No ArgType for Atom
Could not write function x11_xatom_to_atom_for_display: No ArgType for Atom
Could not write function x11_get_xatom_by_name_for_display: No ArgType for Atom
Could not write function x11_get_xatom_name_for_display: No ArgType for Atom
Could not write function x11_atom_to_xatom: No ArgType for Atom
Could not write function x11_xatom_to_atom: No ArgType for Atom
Could not write function x11_get_xatom_by_name: No ArgType for Atom
Could not write function x11_get_xatom_name: No ArgType for Atom
Could not write function x11_display_broadcast_startup_message: varargs functions not supported
Could not write function threads_add_idle_full: No ArgType for GSourceFunc
Could not write function threads_add_idle: No ArgType for GSourceFunc
Could not write function threads_add_timeout_full: No ArgType for GSourceFunc
Could not write function threads_add_timeout: No ArgType for GSourceFunc
Warning: Constructor for GdkColormap needs to be updated to new API
See http://live.gnome.org/PyGTK_2fWhatsNew28#update-constructors
Warning: Constructor for GdkDisplay needs to be updated to new API
See http://live.gnome.org/PyGTK_2fWhatsNew28#update-constructors
Warning: Constructor for GdkWindow needs to be updated to new API
See http://live.gnome.org/PyGTK_2fWhatsNew28#update-constructors
Warning: Constructor for GdkPangoRenderer needs to be updated to new API
See http://live.gnome.org/PyGTK_2fWhatsNew28#update-constructors
Warning: Constructor for GdkPixmap needs to be updated to new API
See http://live.gnome.org/PyGTK_2fWhatsNew28#update-constructors
Warning: Constructor for GdkGC needs to be updated to new API
See http://live.gnome.org/PyGTK_2fWhatsNew28#update-constructors
Warning: Constructor for GdkImage needs to be updated to new API
See http://live.gnome.org/PyGTK_2fWhatsNew28#update-constructors
Warning: Constructor for GdkPixbuf needs to be updated to new API
See http://live.gnome.org/PyGTK_2fWhatsNew28#update-constructors
Warning: Constructor for GdkPixbufAnimation needs to be updated to new API
See http://live.gnome.org/PyGTK_2fWhatsNew28#update-constructors
Warning: Constructor for GdkPixbufLoader needs to be updated to new API
See http://live.gnome.org/PyGTK_2fWhatsNew28#update-constructors
Warning: Constructor for GdkPixbufSimpleAnim needs to be updated to new API
See http://live.gnome.org/PyGTK_2fWhatsNew28#update-constructors
Warning: Constructor for GdkVisual needs to be updated to new API
See http://live.gnome.org/PyGTK_2fWhatsNew28#update-constructors
***INFO*** The coverage of global functions is 73.20% (142/194)
***INFO*** The coverage of methods is 90.43% (378/418)
***INFO*** The coverage of virtual proxies is 69.77% (30/43)
***INFO*** The coverage of virtual accessors is 69.77% (30/43)
***INFO*** There are no declared interface proxies.
if /bin/bash ../libtool --tag=CC --mode=compile gcc -DHAVE_CONFIG_H -I. -I/build/buildd/pygtk-2.12.1/gtk -I.. -I/usr/include/python2.5 -I/usr/include/pygtk-2.0 -I/usr/include/glib-2.0 -I/usr/lib/glib-2.0/include -I/build/buildd/pygtk-2.12.1/gtk/gtk -DPNG_NO_MMX_CODE -I/usr/include/pycairo -I/usr/include/cairo -I/usr/include/freetype2 -I/usr/include/libpng12 -I/usr/include/pixman-1 -DPNG_NO_MMX_CODE -I/usr/include/gtk-2.0 -I/usr/lib/gtk-2.0/include -I/usr/include/atk-1.0 -I/usr/include/cairo -I/usr/include/pango-1.0 -I/usr/include/glib-2.0 -I/usr/lib/glib-2.0/include -I/usr/include/freetype2 -I/usr/include/libpng12 -I/usr/include/pixman-1 -g -O2 -Wall -g -O2 -fno-strict-aliasing -std=c9x -MT _gtk_la-gdk.lo -MD -MP -MF ".deps/_gtk_la-gdk.Tpo" -c -o _gtk_la-gdk.lo `test -f 'gdk.c' || echo '/build/buildd/pygtk-2.12.1/gtk/'`gdk.c; \
then mv -f ".deps/_gtk_la-gdk.Tpo" ".deps/_gtk_la-gdk.Plo"; else rm -f ".deps/_gtk_la-gdk.Tpo"; exit 1; fi
gcc -DHAVE_CONFIG_H -I. -I/build/buildd/pygtk-2.12.1/gtk -I.. -I/usr/include/python2.5 -I/usr/include/pygtk-2.0 -I/usr/include/glib-2.0 -I/usr/lib/glib-2.0/include -I/build/buildd/pygtk-2.12.1/gtk/gtk -DPNG_NO_MMX_CODE -I/usr/include/pycairo -I/usr/include/cairo -I/usr/include/freetype2 -I/usr/include/libpng12 -I/usr/include/pixman-1 -DPNG_NO_MMX_CODE -I/usr/include/gtk-2.0 -I/usr/lib/gtk-2.0/include -I/usr/include/atk-1.0 -I/usr/include/cairo -I/usr/include/pango-1.0 -I/usr/include/glib-2.0 -I/usr/lib/glib-2.0/include -I/usr/include/freetype2 -I/usr/include/libpng12 -I/usr/include/pixman-1 -g -O2 -Wall -g -O2 -fno-strict-aliasing -std=c9x -MT _gtk_la-gdk.lo -MD -MP -MF .deps/_gtk_la-gdk.Tpo -c gdk.c -fPIC -DPIC -o .libs/_gtk_la-gdk.o
/bin/bash ../libtool --tag=CC --mode=link gcc -g -O2 -Wall -g -O2 -fno-strict-aliasing -std=c9x -Wl,-Bsymbolic-functions -o _gtk.la -rpath /usr/lib/python2.5/site-packages/gtk-2.0/gtk -module -avoid-version -export-symbols-regex init_gtk _gtk_la-gtk-types.lo _gtk_la-gtkmodule.lo _gtk_la-gtkobject-support.lo _gtk_la-pygtkcellrenderer.lo _gtk_la-pygtktreemodel.lo _gtk_la-gtk.lo _gtk_la-gdk.lo -lgtk-x11-2.0 -lgdk-x11-2.0 -latk-1.0 -lgdk_pixbuf-2.0 -lm -lpangocairo-1.0 -lpango-1.0 -lcairo -lgobject-2.0 -lgmodule-2.0 -ldl -lglib-2.0
generating symbol list for `_gtk.la'
/usr/bin/nm -B .libs/_gtk_la-gtk-types.o .libs/_gtk_la-gtkmodule.o .libs/_gtk_la-gtkobject-support.o .libs/_gtk_la-pygtkcellrenderer.o .libs/_gtk_la-pygtktreemodel.o .libs/_gtk_la-gtk.o .libs/_gtk_la-gdk.o | sed -n -e 's/^.*[ ]\([ABCDGIRSTW][ABCDGIRSTW]*\)[ ][ ]*\([_A-Za-z][_A-Za-z0-9]*\)$/\1 \2 \2/p' | /bin/sed 's/.* //' | sort | uniq > .libs/_gtk.exp
/bin/grep -E -e "init_gtk" ".libs/_gtk.exp" > ".libs/_gtk.expT"
mv -f ".libs/_gtk.expT" ".libs/_gtk.exp"
echo "{ global:" > .libs/_gtk.ver
cat .libs/_gtk.exp | sed -e "s/\(.*\)/\1;/" >> .libs/_gtk.ver
echo "local: *; };" >> .libs/_gtk.ver
gcc -shared .libs/_gtk_la-gtk-types.o .libs/_gtk_la-gtkmodule.o .libs/_gtk_la-gtkobject-support.o .libs/_gtk_la-pygtkcellrenderer.o .libs/_gtk_la-pygtktreemodel.o .libs/_gtk_la-gtk.o .libs/_gtk_la-gdk.o /usr/lib/libgtk-x11-2.0.so /usr/lib/libgdk-x11-2.0.so /usr/lib/libatk-1.0.so /usr/lib/libgdk_pixbuf-2.0.so -lm /usr/lib/libpangocairo-1.0.so /usr/lib/libpango-1.0.so /usr/lib/libcairo.so /usr/lib/libgobject-2.0.so /usr/lib/libgmodule-2.0.so -ldl /usr/lib/libglib-2.0.so -Wl,-Bsymbolic-functions -Wl,-soname -Wl,_gtk.so -Wl,-version-script -Wl,.libs/_gtk.ver -o .libs/_gtk.so
creating _gtk.la
(cd .libs && rm -f _gtk.la && ln -s ../_gtk.la _gtk.la)
if /bin/bash ../libtool --tag=CC --mode=compile gcc -DHAVE_CONFIG_H -I. -I/build/buildd/pygtk-2.12.1/gtk -I.. -I/usr/include/python2.5 -I/usr/include/pygtk-2.0 -I/usr/include/glib-2.0 -I/usr/lib/glib-2.0/include -I/build/buildd/pygtk-2.12.1/gtk/gtk -DPNG_NO_MMX_CODE -I/usr/include/libglade-2.0 -I/usr/include/gtk-2.0 -I/usr/include/libxml2 -I/usr/lib/gtk-2.0/include -I/usr/include/atk-1.0 -I/usr/include/cairo -I/usr/include/pango-1.0 -I/usr/include/glib-2.0 -I/usr/lib/glib-2.0/include -I/usr/include/freetype2 -I/usr/include/libpng12 -I/usr/include/pixman-1 -g -O2 -Wall -g -O2 -fno-strict-aliasing -std=c9x -MT glade_la-libglademodule.lo -MD -MP -MF ".deps/glade_la-libglademodule.Tpo" -c -o glade_la-libglademodule.lo `test -f 'libglademodule.c' || echo '/build/buildd/pygtk-2.12.1/gtk/'`libglademodule.c; \
then mv -f ".deps/glade_la-libglademodule.Tpo" ".deps/glade_la-libglademodule.Plo"; else rm -f ".deps/glade_la-libglademodule.Tpo"; exit 1; fi
gcc -DHAVE_CONFIG_H -I. -I/build/buildd/pygtk-2.12.1/gtk -I.. -I/usr/include/python2.5 -I/usr/include/pygtk-2.0 -I/usr/include/glib-2.0 -I/usr/lib/glib-2.0/include -I/build/buildd/pygtk-2.12.1/gtk/gtk -DPNG_NO_MMX_CODE -I/usr/include/libglade-2.0 -I/usr/include/gtk-2.0 -I/usr/include/libxml2 -I/usr/lib/gtk-2.0/include -I/usr/include/atk-1.0 -I/usr/include/cairo -I/usr/include/pango-1.0 -I/usr/include/glib-2.0 -I/usr/lib/glib-2.0/include -I/usr/include/freetype2 -I/usr/include/libpng12 -I/usr/include/pixman-1 -g -O2 -Wall -g -O2 -fno-strict-aliasing -std=c9x -MT glade_la-libglademodule.lo -MD -MP -MF .deps/glade_la-libglademodule.Tpo -c /build/buildd/pygtk-2.12.1/gtk/libglademodule.c -fPIC -DPIC -o .libs/glade_la-libglademodule.o
(/usr/bin/python2.5 /build/buildd/pygtk-2.12.1/codegen/codegen.py \
-DHAVE_PYCAIRO -DHAVE_GTK_2_12 -DGDK_TARGET_X11 \
-I /build/buildd/pygtk-2.12.1/gtk \
--py_ssize_t-clean \
--register /build/buildd/pygtk-2.12.1/pango-types.defs \
--register /build/buildd/pygtk-2.12.1/atk-types.defs \
--register gdk-types.defs \
--register gtk-types.defs \
--override /build/buildd/pygtk-2.12.1/gtk/libglade.override \
--prefix pylibglade /build/buildd/pygtk-2.12.1/gtk/libglade.defs) > gen-libglade.c \
&& cp gen-libglade.c libglade.c \
&& rm -f gen-libglade.c
Warning: Constructor for GladeXML needs to be updated to new API
See http://live.gnome.org/PyGTK_2fWhatsNew28#update-constructors
***INFO*** The coverage of global functions is 100.00% (7/7)
***INFO*** The coverage of methods is 100.00% (5/5)
***INFO*** There are no declared virtual proxies.
***INFO*** There are no declared virtual accessors.
***INFO*** There are no declared interface proxies.
if /bin/bash ../libtool --tag=CC --mode=compile gcc -DHAVE_CONFIG_H -I. -I/build/buildd/pygtk-2.12.1/gtk -I.. -I/usr/include/python2.5 -I/usr/include/pygtk-2.0 -I/usr/include/glib-2.0 -I/usr/lib/glib-2.0/include -I/build/buildd/pygtk-2.12.1/gtk/gtk -DPNG_NO_MMX_CODE -I/usr/include/libglade-2.0 -I/usr/include/gtk-2.0 -I/usr/include/libxml2 -I/usr/lib/gtk-2.0/include -I/usr/include/atk-1.0 -I/usr/include/cairo -I/usr/include/pango-1.0 -I/usr/include/glib-2.0 -I/usr/lib/glib-2.0/include -I/usr/include/freetype2 -I/usr/include/libpng12 -I/usr/include/pixman-1 -g -O2 -Wall -g -O2 -fno-strict-aliasing -std=c9x -MT glade_la-libglade.lo -MD -MP -MF ".deps/glade_la-libglade.Tpo" -c -o glade_la-libglade.lo `test -f 'libglade.c' || echo '/build/buildd/pygtk-2.12.1/gtk/'`libglade.c; \
then mv -f ".deps/glade_la-libglade.Tpo" ".deps/glade_la-libglade.Plo"; else rm -f ".deps/glade_la-libglade.Tpo"; exit 1; fi
gcc -DHAVE_CONFIG_H -I. -I/build/buildd/pygtk-2.12.1/gtk -I.. -I/usr/include/python2.5 -I/usr/include/pygtk-2.0 -I/usr/include/glib-2.0 -I/usr/lib/glib-2.0/include -I/build/buildd/pygtk-2.12.1/gtk/gtk -DPNG_NO_MMX_CODE -I/usr/include/libglade-2.0 -I/usr/include/gtk-2.0 -I/usr/include/libxml2 -I/usr/lib/gtk-2.0/include -I/usr/include/atk-1.0 -I/usr/include/cairo -I/usr/include/pango-1.0 -I/usr/include/glib-2.0 -I/usr/lib/glib-2.0/include -I/usr/include/freetype2 -I/usr/include/libpng12 -I/usr/include/pixman-1 -g -O2 -Wall -g -O2 -fno-strict-aliasing -std=c9x -MT glade_la-libglade.lo -MD -MP -MF .deps/glade_la-libglade.Tpo -c libglade.c -fPIC -DPIC -o .libs/glade_la-libglade.o
/bin/bash ../libtool --tag=CC --mode=link gcc -g -O2 -Wall -g -O2 -fno-strict-aliasing -std=c9x -Wl,-Bsymbolic-functions -o glade.la -rpath /usr/lib/python2.5/site-packages/gtk-2.0/gtk -module -avoid-version -export-symbols-regex initglade glade_la-libglademodule.lo glade_la-libglade.lo -lglade-2.0 -lgtk-x11-2.0 -lxml2 -lgdk-x11-2.0 -latk-1.0 -lgdk_pixbuf-2.0 -lm -lpangocairo-1.0 -lpango-1.0 -lcairo -lgobject-2.0 -lgmodule-2.0 -ldl -lglib-2.0
generating symbol list for `glade.la'
/usr/bin/nm -B .libs/glade_la-libglademodule.o .libs/glade_la-libglade.o | sed -n -e 's/^.*[ ]\([ABCDGIRSTW][ABCDGIRSTW]*\)[ ][ ]*\([_A-Za-z][_A-Za-z0-9]*\)$/\1 \2 \2/p' | /bin/sed 's/.* //' | sort | uniq > .libs/glade.exp
/bin/grep -E -e "initglade" ".libs/glade.exp" > ".libs/glade.expT"
mv -f ".libs/glade.expT" ".libs/glade.exp"
echo "{ global:" > .libs/glade.ver
cat .libs/glade.exp | sed -e "s/\(.*\)/\1;/" >> .libs/glade.ver
echo "local: *; };" >> .libs/glade.ver
gcc -shared .libs/glade_la-libglademodule.o .libs/glade_la-libglade.o /usr/lib/libglade-2.0.so /usr/lib/libgtk-x11-2.0.so /usr/lib/libxml2.so /usr/lib/libgdk-x11-2.0.so /usr/lib/libatk-1.0.so /usr/lib/libgdk_pixbuf-2.0.so -lm /usr/lib/libpangocairo-1.0.so /usr/lib/libpango-1.0.so /usr/lib/libcairo.so /usr/lib/libgobject-2.0.so /usr/lib/libgmodule-2.0.so -ldl /usr/lib/libglib-2.0.so -Wl,-Bsymbolic-functions -Wl,-soname -Wl,glade.so -Wl,-version-script -Wl,.libs/glade.ver -o .libs/glade.so
creating glade.la
(cd .libs && rm -f glade.la && ln -s ../glade.la glade.la)
make[3]: Leaving directory `/build/buildd/pygtk-2.12.1/build-2.5/gtk'
Making all in examples
make[3]: Entering directory `/build/buildd/pygtk-2.12.1/build-2.5/examples'
make[3]: Leaving directory `/build/buildd/pygtk-2.12.1/build-2.5/examples'
Making all in tests
make[3]: Entering directory `/build/buildd/pygtk-2.12.1/build-2.5/tests'
make[3]: Nothing to be done for `all'.
make[3]: Leaving directory `/build/buildd/pygtk-2.12.1/build-2.5/tests'
Making all in docs
make[3]: Entering directory `/build/buildd/pygtk-2.12.1/build-2.5/docs'
/usr/bin/make all-am
make[4]: Entering directory `/build/buildd/pygtk-2.12.1/build-2.5/docs'
make[4]: Nothing to be done for `all-am'.
make[4]: Leaving directory `/build/buildd/pygtk-2.12.1/build-2.5/docs'
make[3]: Leaving directory `/build/buildd/pygtk-2.12.1/build-2.5/docs'
make[2]: Leaving directory `/build/buildd/pygtk-2.12.1/build-2.5'
make[1]: Leaving directory `/build/buildd/pygtk-2.12.1/build-2.5'
xvfb-run /usr/bin/make -C build-2.5 check
make[1]: Entering directory `/build/buildd/pygtk-2.12.1/build-2.5'
Making check in codegen
make[2]: Entering directory `/build/buildd/pygtk-2.12.1/build-2.5/codegen'
make[2]: Nothing to be done for `check'.
make[2]: Leaving directory `/build/buildd/pygtk-2.12.1/build-2.5/codegen'
Making check in .
make[2]: Entering directory `/build/buildd/pygtk-2.12.1/build-2.5'
make[2]: Nothing to be done for `check-am'.
make[2]: Leaving directory `/build/buildd/pygtk-2.12.1/build-2.5'
Making check in gtk
make[2]: Entering directory `/build/buildd/pygtk-2.12.1/build-2.5/gtk'
make[2]: Nothing to be done for `check'.
make[2]: Leaving directory `/build/buildd/pygtk-2.12.1/build-2.5/gtk'
Making check in examples
make[2]: Entering directory `/build/buildd/pygtk-2.12.1/build-2.5/examples'
make[2]: Nothing to be done for `check'.
make[2]: Leaving directory `/build/buildd/pygtk-2.12.1/build-2.5/examples'
Making check in tests
make[2]: Entering directory `/build/buildd/pygtk-2.12.1/build-2.5/tests'
/usr/bin/make check-local
make[3]: Entering directory `/build/buildd/pygtk-2.12.1/build-2.5/tests'
*** glibc detected *** /usr/bin/python2.5: free(): invalid next size (fast): 0x0000000000bb0dc0 ***
make[3]: *** [check-local] Terminated
make: *** [build-2.5/build-stamp] Terminated
make[2]: *** [check-am] Terminated
make[1]: *** [check-recursive] Terminated
Build killed with signal 15 after 150 minutes of inactivity
******************************************************************************
Build finished at 20080413-0139
FAILED [dpkg-buildpackage died]
Purging chroot-hardy-autotest/build/buildd/pygtk-2.12.1
------------------------------------------------------------------------------
/usr/bin/sudo dpkg --root=/home/buildd/build-hardy-autotest/chroot-hardy-autotest --purge python-gobject-dev libxfixes-dev libx11-data libffi4 m4 fontconfig-config gettext file zlib1g-dev libhtml-parser-perl ttf-dejavu python-all-dbg libcairo2 x11-common libx11-dev libopencdk10 libfontenc1 libxi6 liblzo2-2 libjpeg62 update-inetd libxcursor1 xvfb x11proto-input-dev libexpat1-dev automake1.7 python2.4-dev libpixman-1-dev libxcomposite-dev libfontconfig1 sgml-base python-cairo libglade2-dev xsltproc libx11-6 libkrb53 xtrans-dev x11proto-randr-dev libglib2.0-0 libnewt0.52 libxinerama-dev libhal1 libpango1.0-common libxdamage1 libxcb-xlib0 libtasn1-3 libhtml-tree-perl libglib2.0-dev libhtml-tagset-perl libxml2 x11proto-xext-dev pkg-config libthai-data python-all libice6 xauth intltool-debian libxrender1 libfontconfig1-dev libxml2-dev xml-core libxrandr-dev libxext-dev libxau-dev libgpg-error0 libxrender-dev xfonts-utils ttf-dejavu-extra libpng12-dev libxft2 libreadline5 x11proto-render-dev libxext6 libgnutls13 libsqlite3-0 python2.5-dev libxinerama1 libpcre3 libxdamage-dev libsm-dev libncursesw5 xfonts-encodings defoma libxdmcp-dev ttf-dejavu-core readline-common libcairo2-dev libcupsys2 python2.5 libxcb-xlib0-dev fontconfig liburi-perl autotools-dev net-tools python2.4-dbg libxmuu1 python2.5-dbg python-support libpopt0 libfreetype6 libice-dev libatk1.0-0 libdbus-1-3 libssl0.9.8 x11proto-fixes-dev libfreetype6-dev libgtk2.0-0 x11proto-damage-dev libxcb1 html2text libgcrypt11 libglade2-0 debhelper libpthread-stubs0 libxrandr2 libkeyutils1 libthai0 python libxslt1.1 libmagic1 python-gobject libtiff4 libexpat1 gnome-pkg-tools fdupes libxau6 libpango1.0-dev libxcursor-dev docbook-xsl libxcomposite1 x11proto-composite-dev libffi4-dev mime-support x11proto-core-dev whiptail python-numeric intltool python-cairo-dev libxcb1-dev libxi-dev libwww-perl libxdmcp6 libxfixes3 libgtk2.0-dev ifupdown po-debconf libatk1.0-dev libxml-parser-perl libxft-dev libxfont1 netbase libpng12-0 xfonts-base python-dbg python-all-dev python-dev x11proto-kb-dev libpixman-1-0 x11proto-xinerama-dev libdatrie0 libpango1.0-0 libpthread-stubs0-dev python2.4 ucf cdbs libgtk2.0-common gettext-base libsm6 python-central python2.4-minimal autoconf
(Reading database ... 18539 files and directories currently installed.)
Removing python-gobject-dev ...
Removing python-all-dbg ...
Removing xvfb ...
Removing libglade2-dev ...
dpkg - warning: while removing libglade2-dev, directory `/usr/share/gtk-doc/html/libglade' not empty so not removed.
dpkg - warning: while removing libglade2-dev, directory `/usr/share/gtk-doc/html' not empty so not removed.
dpkg - warning: while removing libglade2-dev, directory `/usr/share/gtk-doc' not empty so not removed.
Removing xsltproc ...
Removing libhal1 ...
Purging configuration files for libhal1 ...
Removing xauth ...
Removing libxml2-dev ...
Removing python2.4-dbg ...
Removing libxmuu1 ...
Purging configuration files for libxmuu1 ...
Removing libdbus-1-3 ...
Purging configuration files for libdbus-1-3 ...
Removing libglade2-0 ...
Purging configuration files for libglade2-0 ...
Removing libxslt1.1 ...
Purging configuration files for libxslt1.1 ...
Removing python-gobject ...
Removing gnome-pkg-tools ...
Removing docbook-xsl ...
Purging configuration files for docbook-xsl ...
Removing libffi4-dev ...
Removing python-numeric ...
Removing python-cairo-dev ...
Removing libgtk2.0-dev ...
Removing libatk1.0-dev ...
Removing xfonts-base ...
Purging configuration files for xfonts-base ...
Removing python-dbg ...
Removing python-all-dev ...
Removing python-dev ...
Removing cdbs ...
Removing libffi4 ...
Purging configuration files for libffi4 ...
Removing python2.4-dev ...
Removing libxcomposite-dev ...
Removing python-cairo ...
Removing libxinerama-dev ...
Removing libxml2 ...
Purging configuration files for libxml2 ...
Removing python-all ...
Removing xml-core ...
Purging configuration files for xml-core ...
dpkg - warning: while removing xml-core, directory `/etc/sgml' not empty so not removed.
Removing libxrandr-dev ...
Removing xfonts-utils ...
Removing python2.5-dev ...
Removing libxdamage-dev ...
Removing xfonts-encodings ...
Removing python2.5-dbg ...
Removing python-support ...
Purging configuration files for python-support ...
Removing libgtk2.0-0 ...
Purging configuration files for libgtk2.0-0 ...
Removing x11proto-damage-dev ...
Removing debhelper ...
Removing libxrandr2 ...
Purging configuration files for libxrandr2 ...
Removing libtiff4 ...
Purging configuration files for libtiff4 ...
Removing fdupes ...
Removing libpango1.0-dev ...
Removing libxcursor-dev ...
Removing libxcomposite1 ...
Purging configuration files for libxcomposite1 ...
Removing x11proto-composite-dev ...
Removing intltool ...
Removing libxi-dev ...
Removing po-debconf ...
Removing libxml-parser-perl ...
Removing libxft-dev ...
Removing libxfont1 ...
Purging configuration files for libxfont1 ...
Removing x11proto-xinerama-dev ...
Removing libpango1.0-0 ...
Purging configuration files for libpango1.0-0 ...
Removing python2.4 ...
Purging configuration files for python2.4 ...
Removing libgtk2.0-common ...
Removing python-central ...
Purging configuration files for python-central ...
Removing python2.4-minimal ...
Unlinking and removing bytecode for runtime python2.4
Purging configuration files for python2.4-minimal ...
Removing libxfixes-dev ...
Removing libfontenc1 ...
Purging configuration files for libfontenc1 ...
Removing libxi6 ...
Purging configuration files for libxi6 ...
Removing libjpeg62 ...
Removing libxcursor1 ...
Purging configuration files for libxcursor1 ...
Removing automake1.7 ...
Removing sgml-base ...
Purging configuration files for sgml-base ...
Removing x11proto-randr-dev ...
Removing libpango1.0-common ...
Purging font configuration of pango...
Purging category xfont..
Purging configuration files for libpango1.0-common ...
Removing libxdamage1 ...
Purging configuration files for libxdamage1 ...
Removing libglib2.0-dev ...
Removing intltool-debian ...
Removing libxext-dev ...
Removing libxft2 ...
Purging configuration files for libxft2 ...
Removing libxinerama1 ...
Purging configuration files for libxinerama1 ...
Removing libcairo2-dev ...
Removing libcupsys2 ...
Purging configuration files for libcupsys2 ...
dpkg - warning: while removing libcupsys2, directory `/etc/cups' not empty so not removed.
Removing fontconfig ...
Purging font configuration of fontconfig...
Purging category cid..
Purging category truetype..
Purging category type1..
Updating fontconfig cache for /usr/share/fonts/truetype/ttf-dejavu
Purging configuration files for fontconfig ...
Removing autotools-dev ...
Removing libatk1.0-0 ...
Purging configuration files for libatk1.0-0 ...
Removing x11proto-fixes-dev ...
Removing html2text ...
Purging configuration files for html2text ...
Removing libthai0 ...
Purging configuration files for libthai0 ...
Removing python ...
Purging configuration files for python ...
Removing libwww-perl ...
Removing libxfixes3 ...
Purging configuration files for libxfixes3 ...
Removing netbase ...
Purging configuration files for netbase ...
Removing libdatrie0 ...
Purging configuration files for libdatrie0 ...
Removing autoconf ...
Purging configuration files for autoconf ...
Removing m4 ...
Removing gettext ...
Removing libcairo2 ...
Purging configuration files for libcairo2 ...
Removing update-inetd ...
Purging configuration files for update-inetd ...
Removing libpixman-1-dev ...
Removing libkrb53 ...
Purging configuration files for libkrb53 ...
Removing libhtml-tree-perl ...
Removing x11proto-xext-dev ...
Removing libthai-data ...
Removing libfontconfig1-dev ...
Removing libxrender-dev ...
Removing libpng12-dev ...
Removing x11proto-render-dev ...
Removing libxext6 ...
Purging configuration files for libxext6 ...
Removing libgnutls13 ...
Purging configuration files for libgnutls13 ...
Removing libsm-dev ...
Removing python2.5 ...
Purging configuration files for python2.5 ...
dpkg - warning: while removing python2.5, directory `/usr/share/applications' not empty so not removed.
Removing libice-dev ...
Removing libssl0.9.8 ...
Purging configuration files for libssl0.9.8 ...
Removing libfreetype6-dev ...
Removing libkeyutils1 ...
Purging configuration files for libkeyutils1 ...
Removing mime-support ...
Purging configuration files for mime-support ...
Removing ifupdown ...
Purging configuration files for ifupdown ...
Removing libpng12-0 ...
Purging configuration files for libpng12-0 ...
Removing libpixman-1-0 ...
Purging configuration files for libpixman-1-0 ...
Removing gettext-base ...
Removing libsm6 ...
Purging configuration files for libsm6 ...
Removing zlib1g-dev ...
Removing libhtml-parser-perl ...
Removing libx11-dev ...
Removing libopencdk10 ...
Purging configuration files for libopencdk10 ...
Removing liblzo2-2 ...
Purging configuration files for liblzo2-2 ...
Removing x11proto-input-dev ...
Removing libexpat1-dev ...
Removing libfontconfig1 ...
Purging configuration files for libfontconfig1 ...
Removing xtrans-dev ...
Removing libtasn1-3 ...
Purging configuration files for libtasn1-3 ...
Removing libhtml-tagset-perl ...
Removing pkg-config ...
Removing libice6 ...
Purging configuration files for libice6 ...
Removing libxrender1 ...
Purging configuration files for libxrender1 ...
Removing libreadline5 ...
Purging configuration files for libreadline5 ...
Removing libsqlite3-0 ...
Purging configuration files for libsqlite3-0 ...
Removing libncursesw5 ...
Purging configuration files for libncursesw5 ...
Removing readline-common ...
Purging configuration files for readline-common ...
Removing libxcb-xlib0-dev ...
Removing liburi-perl ...
Removing net-tools ...
Removing libfreetype6 ...
Purging configuration files for libfreetype6 ...
Removing libgcrypt11 ...
Purging configuration files for libgcrypt11 ...
Removing libexpat1 ...
Purging configuration files for libexpat1 ...
Removing libxcb1-dev ...
Removing x11proto-kb-dev ...
Removing libpthread-stubs0-dev ...
Removing fontconfig-config ...
Purging configuration files for fontconfig-config ...
Removing ttf-dejavu ...
Removing libx11-6 ...
Purging configuration files for libx11-6 ...
Removing libglib2.0-0 ...
Purging configuration files for libglib2.0-0 ...
Removing libxcb-xlib0 ...
Purging configuration files for libxcb-xlib0 ...
Removing libxau-dev ...
Removing libgpg-error0 ...
Purging configuration files for libgpg-error0 ...
Removing ttf-dejavu-extra ...
Purging configuration files for ttf-dejavu-extra ...
Removing libpcre3 ...
Purging configuration files for libpcre3 ...
Removing libxdmcp-dev ...
Removing ttf-dejavu-core ...
Purging configuration files for ttf-dejavu-core ...
dpkg - warning: while removing ttf-dejavu-core, directory `/etc/defoma/hints' not empty so not removed.
Removing libxcb1 ...
Purging configuration files for libxcb1 ...
Removing libpthread-stubs0 ...
Removing libxau6 ...
Purging configuration files for libxau6 ...
Removing x11proto-core-dev ...
Removing libxdmcp6 ...
Purging configuration files for libxdmcp6 ...
Removing ucf ...
Purging configuration files for ucf ...
Removing libx11-data ...
Removing x11-common ...
Purging configuration files for x11-common ...
dpkg - warning: while removing x11-common, directory `/etc/X11' not empty so not removed.
dpkg - warning: while removing x11-common, directory `/usr/X11R6' not empty so not removed.
Removing defoma ...
Purging configuration files for defoma ...
dpkg - warning: while removing defoma, directory `/etc/defoma' not empty so not removed.
Removing whiptail ...
Removing file ...
Purging configuration files for file ...
Removing libnewt0.52 ...
Purging configuration files for libnewt0.52 ...
Removing libpopt0 ...
Purging configuration files for libpopt0 ...
Removing libmagic1 ...
Purging configuration files for libmagic1 ...
******************************************************************************
Finished at 20080413-0141
Build needed 02:34:10, 53164k disk space
More information about the ubuntu-autotest
mailing list