[Bug 2051102] Re: noble/linux-unstable: 6.8.0-1.1 -proposed tracker

Ubuntu Kernel Bot 2051102 at bugs.launchpad.net
Wed Jan 24 10:01:34 UTC 2024


** Changed in: kernel-sru-workflow/prepare-package
       Status: In Progress => Fix Committed

** Changed in: kernel-sru-workflow/prepare-package-meta
       Status: In Progress => Fix Committed

** Changed in: kernel-sru-workflow/prepare-package-signed
       Status: In Progress => Fix Committed

** Description changed:

  This bug will contain status and test results related to a kernel source
  (or snap) as stated in the title.
  
  For an explanation of the tasks and the associated workflow see:
    https://wiki.ubuntu.com/Kernel/kernel-sru-workflow
  
  -- swm properties --
+ built:
+   from: f8081308e6d0c22e
+   route-entry: 2
  packages:
    generate: linux-generate-unstable
    main: linux-unstable
    meta: linux-meta-unstable
    signed: linux-signed-unstable
  phase: Packaging
  phase-changed: Wednesday, 24. January 2024 09:51 UTC
  reason:
-   :prepare-packages: 'Ongoing -b Being cranked by: p-pisati'
-   prepare-package: Pending -- tag not published and package not
-     uploaded
-   prepare-package-generate: Pending -- package not uploaded
-   prepare-package-meta: Pending -- tag not published and package not
-     uploaded
-   prepare-package-signed: Pending -- tag not published and package not
-     uploaded
- replaces: bug 2049357
+   :prepare-packages: Stalled -- build FAILED in ppa (main:F generate:M
+     signed:B meta:B)
+   prepare-package: Ongoing -- main package not yet fully built
+   prepare-package-generate: Stalled -- package not uploaded
+   prepare-package-meta: Ongoing -- meta package not yet fully built
+   prepare-package-signed: Ongoing -- signed package not yet fully
+     built
  synthetic:
    :promote-to-as-proposed: Invalid
  variant: debs
+ versions:
+   main: 6.8.0-1.1
+   meta: 6.8.0-1.1
+   signed: 6.8.0-1.1
  ~~:
    announce:
      swm-transition-crankable: 2024-01-24 09:41:45.134217
    clamps:
      self: 6.8.0-1.1
    tracker:
      last-message: '2024-01-24 09:37:39.139087+00:00'

** Changed in: kernel-sru-workflow/new-review
       Status: New => Confirmed

** Changed in: kernel-sru-workflow/prepare-package-generate
       Status: In Progress => Fix Committed

** Changed in: kernel-sru-workflow/sru-review
       Status: New => Confirmed

** Description changed:

  This bug will contain status and test results related to a kernel source
  (or snap) as stated in the title.
  
  For an explanation of the tasks and the associated workflow see:
    https://wiki.ubuntu.com/Kernel/kernel-sru-workflow
  
  -- swm properties --
  built:
    from: f8081308e6d0c22e
    route-entry: 2
+ delta:
+   promote-to-proposed: [main, meta, signed, generate]
  packages:
    generate: linux-generate-unstable
    main: linux-unstable
    meta: linux-meta-unstable
    signed: linux-signed-unstable
  phase: Packaging
  phase-changed: Wednesday, 24. January 2024 09:51 UTC
  reason:
-   :prepare-packages: Stalled -- build FAILED in ppa (main:F generate:M
-     signed:B meta:B)
+   :prepare-packages: Stalled -- build FAILED in ppa (main:F generate:D
+     signed:D meta:D)
+   new-review: Stalled -s ready for review
    prepare-package: Ongoing -- main package not yet fully built
-   prepare-package-generate: Stalled -- package not uploaded
+   prepare-package-generate: Ongoing -- generate package not yet fully
+     built
    prepare-package-meta: Ongoing -- meta package not yet fully built
    prepare-package-signed: Ongoing -- signed package not yet fully
      built
+   sru-review: Stalled -s ready for review
  synthetic:
    :promote-to-as-proposed: Invalid
  variant: debs
  versions:
    main: 6.8.0-1.1
    meta: 6.8.0-1.1
    signed: 6.8.0-1.1
  ~~:
    announce:
      swm-transition-crankable: 2024-01-24 09:41:45.134217
    clamps:
+     new-review: f8081308e6d0c22e
      self: 6.8.0-1.1
+     sru-review: f8081308e6d0c22e
    tracker:
-     last-message: '2024-01-24 09:37:39.139087+00:00'
+     last-message: '2024-01-24 10:01:19.509832+00:00'

** Description changed:

  This bug will contain status and test results related to a kernel source
  (or snap) as stated in the title.
  
  For an explanation of the tasks and the associated workflow see:
    https://wiki.ubuntu.com/Kernel/kernel-sru-workflow
  
  -- swm properties --
  built:
    from: f8081308e6d0c22e
    route-entry: 2
  delta:
    promote-to-proposed: [main, meta, signed, generate]
  packages:
    generate: linux-generate-unstable
    main: linux-unstable
    meta: linux-meta-unstable
    signed: linux-signed-unstable
  phase: Packaging
  phase-changed: Wednesday, 24. January 2024 09:51 UTC
  reason:
    :prepare-packages: Stalled -- build FAILED in ppa (main:F generate:D
      signed:D meta:D)
-   new-review: Stalled -s ready for review
+   new-review: Pending -s ready for review
    prepare-package: Ongoing -- main package not yet fully built
    prepare-package-generate: Ongoing -- generate package not yet fully
      built
    prepare-package-meta: Ongoing -- meta package not yet fully built
    prepare-package-signed: Ongoing -- signed package not yet fully
      built
-   sru-review: Stalled -s ready for review
+   sru-review: Pending -s ready for review
  synthetic:
    :promote-to-as-proposed: Invalid
  variant: debs
  versions:
    main: 6.8.0-1.1
    meta: 6.8.0-1.1
    signed: 6.8.0-1.1
  ~~:
    announce:
      swm-transition-crankable: 2024-01-24 09:41:45.134217
    clamps:
      new-review: f8081308e6d0c22e
      self: 6.8.0-1.1
      sru-review: f8081308e6d0c22e
    tracker:
      last-message: '2024-01-24 10:01:19.509832+00:00'

-- 
You received this bug notification because you are a member of Ubuntu
Package Archive Administrators, which is a bug assignee.
https://bugs.launchpad.net/bugs/2051102

Title:
  noble/linux-unstable: 6.8.0-1.1 -proposed tracker

To manage notifications about this bug go to:
https://bugs.launchpad.net/kernel-sru-workflow/+bug/2051102/+subscriptions




More information about the ubuntu-archive mailing list