[Bug 832937] [NEW] salome version 5.1.3-12ubuntu1 failed to build in oneiric

Launchpad Bug Tracker 832937 at bugs.launchpad.net
Fri Sep 2 23:52:05 UTC 2011


You have been subscribed to a public bug by Matthias Klose (doko):

salome version 5.1.3-12ubuntu1 failed to build in oneiric
Link to failed build: https://launchpad.net/ubuntu/+archive/test-rebuild-20110816/+build/2710912

Details about the rebuild:
http://people.ubuntuwire.org/~wgrant/rebuild-ftbfs-test/test-rebuild-20110816-oneiric.html

Direct link to the build log: https://launchpad.net/ubuntu/+archive
/test-rebuild-20110816/+build/2710912/+files/buildlog_ubuntu-oneiric-
amd64.salome_5.1.3-12ubuntu1_FAILEDTOBUILD.txt.gz

This log snippet might be of interest, since it triggered the matcher 'Purging chroot-autobuild'.
Excerpt 4344 lines into the build log:

libtool: link: ( cd ".libs" && rm -f "libSalomeLoggerServer.la" && ln -s "../libSalomeLoggerServer.la" "libSalomeLoggerServer.la" )
/bin/bash ../../libtool --tag=CXX --mode=link g++ -I../../salome_adm/unix -include SALOMEconfig.h -D_OCC64 -g -O2 -g -Wparentheses -Wreturn-type -Wmissing-declarations -Wunused -pthread  -Wl,-Bsymbolic-functions -Xlinker -enable-new-dtags -o SALOME_Logger_Server  SALOME_Logger_Server-SALOME_Logger_Server_main.o libSalomeLoggerServer.la -lnsl -lm -lrt -ldl  
libtool: link: g++ -I../../salome_adm/unix -include SALOMEconfig.h -D_OCC64 -g -O2 -g -Wparentheses -Wreturn-type -Wmissing-declarations -Wunused -pthread -Wl,-Bsymbolic-functions -Wl,-enable-new-dtags -o .libs/SALOME_Logger_Server SALOME_Logger_Server-SALOME_Logger_Server_main.o  ./.libs/libSalomeLoggerServer.so -lnsl -lm -lrt -ldl -pthread -Wl,-rpath -Wl,/usr/lib/salome/lib
/usr/bin/ld: SALOME_Logger_Server-SALOME_Logger_Server_main.o: undefined reference to symbol 'SALOME_Logger::Logger_Helper::_nil()'
/usr/bin/ld: note: 'SALOME_Logger::Logger_Helper::_nil()' is defined in DSO /build/buildd/salome-5.1.3/build-salome/KERNEL_SRC_5.1.3/idl/.libs/libSalomeIDLKernel.so.0 so try adding it to the linker command line
/build/buildd/salome-5.1.3/build-salome/KERNEL_SRC_5.1.3/idl/.libs/libSalomeIDLKernel.so.0: could not read symbols: Invalid operation
collect2: ld returned 1 exit status
make[3]: *** [SALOME_Logger_Server] Error 1
make[3]: Leaving directory `/build/buildd/salome-5.1.3/build-salome/KERNEL_SRC_5.1.3/src/Logger'
make[2]: *** [all-recursive] Error 1
make[2]: Leaving directory `/build/buildd/salome-5.1.3/build-salome/KERNEL_SRC_5.1.3/src'
make[1]: *** [all-recursive] Error 1
make[1]: Leaving directory `/build/buildd/salome-5.1.3/build-salome/KERNEL_SRC_5.1.3'
make: *** [build-arch-stamp] Error 2
dpkg-buildpackage: error: debian/rules build gave error exit status 2
******************************************************************************
Build finished at 20110823-0825
FAILED [dpkg-buildpackage died]
Purging chroot-autobuild/build/buildd/salome-5.1.3

** Affects: salome (Ubuntu)
     Importance: High
         Status: Confirmed

** Affects: salome (Ubuntu Oneiric)
     Importance: High
         Status: Confirmed


** Tags: ftbfs nbs no-add-needed oneiric
-- 
salome version 5.1.3-12ubuntu1 failed to build in oneiric
https://bugs.launchpad.net/bugs/832937
You received this bug notification because you are a member of Ubuntu Package Archive Administrators, which is subscribed to the bug report.



More information about the ubuntu-archive mailing list