[Bug 745846] [NEW] kdeedu version 4:4.6.1a-0ubuntu2 failed to build on armel

Steve Langasek steve.langasek at canonical.com
Wed Mar 30 16:51:26 UTC 2011


Public bug reported:

kdeedu version 4:4.6.1a-0ubuntu2 failed to build on armel
Link to failed build: https://launchpad.net/ubuntu/+source/kdeedu/4:4.6.1a-0ubuntu2/+buildjob/2326220

Direct link to the build log:
https://launchpad.net/ubuntu/+source/kdeedu/4:4.6.1a-
0ubuntu2/+buildjob/2326220/+files/buildlog_ubuntu-natty-
armel.kdeedu_4%3A4.6.1a-0ubuntu2_FAILEDTOBUILD.txt.gz

This log snippet might be of interest, since it triggered the matcher 'Purging chroot-autobuild'.
Excerpt 20641 lines into the build log:

                 from /usr/include/qt4/QtOpenGL/QGLWidget:1,
                 from ../../../kalgebra/src/graph3d.h:22,
                 from ../../../kalgebra/src/graph3d.cpp:19:
/usr/include/qt4/QtCore/qmap.h: In static member function 'static QMap<Key, T>::Node* QMap<Key, T>::concrete(QMapData::Node*) [with Key = QString, T = Analitza::ExpressionType, QMap<Key, T>::Node = QMapNode<QString, Analitza::ExpressionType>]':
/usr/include/qt4/QtCore/qmap.h:502:32:   instantiated from 'const T QMap<Key, T>::value(const Key&) const [with Key = QString, T = Analitza::ExpressionType]'
../../../kalgebra/./analitza/expressiontype.h:63:92:   instantiated from here
/usr/include/qt4/QtCore/qmap.h:180:83: warning: cast from 'char*' to 'QMap<QString, Analitza::ExpressionType>::Node*' increases required alignment of target type
make[3]: *** [kalgebra/src/CMakeFiles/kalgebra.dir/graph3d.o] Error 1
make[3]: Leaving directory `/build/buildd/kdeedu-4.6.1a/obj-arm-linux-gnueabi'
make[2]: *** [kalgebra/src/CMakeFiles/kalgebra.dir/all] Error 2
make[2]: Leaving directory `/build/buildd/kdeedu-4.6.1a/obj-arm-linux-gnueabi'
make[1]: *** [all] Error 2
make[1]: Leaving directory `/build/buildd/kdeedu-4.6.1a/obj-arm-linux-gnueabi'
make: *** [debian/stamp-makefile-build] Error 2
dpkg-buildpackage: error: debian/rules build gave error exit status 2
******************************************************************************
Build finished at 20110323-1800
FAILED [dpkg-buildpackage died]
Purging chroot-autobuild/build/buildd/kdeedu-4.6.1a

** Affects: kdeedu (Ubuntu)
     Importance: Undecided
         Status: New


** Tags: arm-porting-queue ftbfs

-- 
You received this bug notification because you are a member of Kubuntu
Bugs, which is subscribed to kdeedu in Ubuntu.
https://bugs.launchpad.net/bugs/745846

Title:
  kdeedu version 4:4.6.1a-0ubuntu2 failed to build on armel



More information about the kubuntu-bugs mailing list