[Bug 735106] [NEW] kdegames version 4:4.6.1-0ubuntu1 failed to build on armel

Mattias Backman mattias.backman at linaro.org
Mon Mar 14 20:55:48 UTC 2011


Public bug reported:

kdegames version 4:4.6.1-0ubuntu1 failed to build on armel
Link to failed build: https://launchpad.net/ubuntu/+source/kdegames/4:4.6.1-0ubuntu1/+buildjob/2300454

Direct link to the build log:
https://launchpad.net/ubuntu/+source/kdegames/4:4.6.1-0ubuntu1/+buildjob/2300454/+files
/buildlog_ubuntu-natty-
armel.kdegames_4%3A4.6.1-0ubuntu1_FAILEDTOBUILD.txt.gz

This log snippet might be of interest, since it triggered the matcher 'Purging chroot-autobuild'.
Excerpt 16218 lines into the build log:

                 from ../../../../ksudoku/src/gui/views/ArcBall.h:43,
                 from ../../../../ksudoku/src/gui/views/roxdokuview.h:32,
                 from ../../../../ksudoku/src/gui/views/ksview.cpp:35:
/usr/include/GL/glext.h:5040: error: conflicting declaration 'typedef ptrdiff_t GLintptr'
/usr/include/GLES2/gl2.h:38: error: 'GLintptr' has a previous declaration as 'typedef khronos_intptr_t GLintptr'
/usr/include/GL/glext.h:5041: error: conflicting declaration 'typedef ptrdiff_t GLsizeiptr'
/usr/include/GLES2/gl2.h:39: error: 'GLsizeiptr' has a previous declaration as 'typedef khronos_ssize_t GLsizeiptr'
make[3]: *** [ksudoku/src/gui/CMakeFiles/ksudoku_gui.dir/views/ksview.o] Error 1
make[3]: Leaving directory `/build/buildd/kdegames-4.6.1/obj-arm-linux-gnueabi'
make[2]: *** [ksudoku/src/gui/CMakeFiles/ksudoku_gui.dir/all] Error 2
make[2]: Leaving directory `/build/buildd/kdegames-4.6.1/obj-arm-linux-gnueabi'
make[1]: *** [all] Error 2
make[1]: Leaving directory `/build/buildd/kdegames-4.6.1/obj-arm-linux-gnueabi'
make: *** [debian/stamp-makefile-build] Error 2
dpkg-buildpackage: error: debian/rules build gave error exit status 2
******************************************************************************
Build finished at 20110305-2339
FAILED [dpkg-buildpackage died]
Purging chroot-autobuild/build/buildd/kdegames-4.6.1

** Affects: kdegames (Ubuntu)
     Importance: Undecided
         Status: New


** Tags: arm-porting-queue ftbfs

-- 
You received this bug notification because you are a member of Kubuntu
Bugs, which is subscribed to kdegames in ubuntu.
https://bugs.launchpad.net/bugs/735106

Title:
  kdegames version 4:4.6.1-0ubuntu1 failed to build on armel



More information about the kubuntu-bugs mailing list