[Bug 600948] [NEW] polkit-qt-1 fails to build from source in maverick
Matthias Klose
matthias.klose at canonical.com
Fri Jul 2 08:51:06 UTC 2010
Public bug reported:
fails in maverick:
[ 12%] Building CXX object core/CMakeFiles/polkit-qt-core-1.dir/polkitqt1-authority.cpp.o
cd /build/buildd/polkit-qt-1-0.95.1/obj-x86_64-linux-gnu/core && /usr/bin/c++ -DMAKE_POLKITQT1_LIB -DQT_GUI_LIB -DQT_CORE_LIB -g -O2 -fPIC -I/usr/include/qt4 -I/usr/include/qt4/QtGui -I/usr/include/qt4/QtCore -I/build/buildd/polkit-qt-1-0.95.1/obj-x86_64-linux-gnu -I/usr/include/polkit-1 -I/usr/include/glib-2.0 -I/usr/lib/glib-2.0/include -I/build/buildd/polkit-qt-1-0.95.1 -I/build/buildd/polkit-qt-1-0.95.1/core -I/build/buildd/polkit-qt-1-0.95.1/includes -I/usr/include/qt4/QtXml -I/build/buildd/polkit-qt-1-0.95.1/obj-x86_64-linux-gnu/core -o CMakeFiles/polkit-qt-core-1.dir/polkitqt1-authority.cpp.o -c /build/buildd/polkit-qt-1-0.95.1/core/polkitqt1-authority.cpp
In file included from /usr/include/glib-2.0/gio/gio.h:49,
from /usr/include/polkit-1/polkit/polkitactiondescription.h:30,
from /usr/include/polkit-1/polkit/polkit.h:30,
from /build/buildd/polkit-qt-1-0.95.1/core/polkitqt1-authority.cpp:29:
/usr/include/glib-2.0/gio/gdbusintrospection.h:151: error: expected unqualified-id before 'protected'
/usr/include/glib-2.0/gio/gdbusintrospection.h:151: error: expected ';' before 'protected'
make[3]: *** [core/CMakeFiles/polkit-qt-core-1.dir/polkitqt1-authority.cpp.o] Error 1
make[3]: Leaving directory `/build/buildd/polkit-qt-1-0.95.1/obj-x86_64-linux-gnu'
make[2]: *** [core/CMakeFiles/polkit-qt-core-1.dir/all] Error 2
make[2]: Leaving directory `/build/buildd/polkit-qt-1-0.95.1/obj-x86_64-linux-gnu'
make[1]: *** [all] Error 2
make[1]: Leaving directory `/build/buildd/polkit-qt-1-0.95.1/obj-x86_64-linux-gnu'
dh_auto_build: make -j1 returned exit code 2
make: *** [build] Error 2
** Affects: polkit-qt-1 (Ubuntu)
Importance: High
Status: Confirmed
** Affects: polkit-qt-1 (Ubuntu Maverick)
Importance: High
Status: Confirmed
** Also affects: polkit-qt-1 (Ubuntu Maverick)
Importance: Undecided
Status: New
** Changed in: polkit-qt-1 (Ubuntu Maverick)
Importance: Undecided => High
** Changed in: polkit-qt-1 (Ubuntu Maverick)
Status: New => Confirmed
** Changed in: polkit-qt-1 (Ubuntu Maverick)
Milestone: None => maverick-alpha-3
--
polkit-qt-1 fails to build from source in maverick
https://bugs.launchpad.net/bugs/600948
You received this bug notification because you are a member of Kubuntu
Bugs, which is subscribed to polkit-qt-1 in ubuntu.
More information about the kubuntu-bugs
mailing list