[Bug 556023] Re: package amarok-utils 2:2.2.0-0ubuntu2 failed to install/upgrade: error writing to '<standard output>': No such file or directory

Jean-Baptiste Lallement jeanbaptiste.lallement at gmail.com
Mon Apr 5 20:56:16 UTC 2010


*** This bug is a duplicate of bug 545738 ***
    https://bugs.launchpad.net/bugs/545738

Thank you for taking the time to report this bug and helping to make
Ubuntu better. This particular bug has already been reported and is a
duplicate of bug 545738, so it is being marked as such. Please look at
the other bug report to see if there is any missing information that you
can provide, or to see if there is a workaround for the bug.
Additionally, any further discussion regarding the bug should occur in
the other report.  Please continue to report any other bugs you may
find.

** Changed in: amarok (Ubuntu)
       Status: New => Confirmed

** This bug has been marked a duplicate of bug 545738
   package PACKAGE failed to install/upgrade: error writing to '<standard output>': No such file or directory

-- 
package amarok-utils 2:2.2.0-0ubuntu2 failed to install/upgrade: error writing to '<standard output>': No such file or directory
https://bugs.launchpad.net/bugs/556023
You received this bug notification because you are a member of Kubuntu
Bugs, which is subscribed to amarok in ubuntu.




More information about the kubuntu-bugs mailing list