[Bug 446063] Re: package linux-libc-dev 2.6.31-12.41 failed to install/upgrade: error writing to '<standard output>': No such file or directory
Jean-Baptiste Lallement
jeanbaptiste.lallement at gmail.com
Wed Mar 24 14:17:48 UTC 2010
*** This bug is a duplicate of bug 545738 ***
https://bugs.launchpad.net/bugs/545738
** This bug has been marked a duplicate of bug 545738
package PACKAGE failed to install/upgrade: error writing to '<standard output>': No such file or directory
--
package linux-libc-dev 2.6.31-12.41 failed to install/upgrade: error writing to '<standard output>': No such file or directory
https://bugs.launchpad.net/bugs/446063
You received this bug notification because you are a member of Kernel
Bugs, which is subscribed to linux in ubuntu.
More information about the kernel-bugs
mailing list