Build failed in Jenkins: jujugui-test-charm #201

Jenkins Notification devnull at canonical.com
Fri Mar 29 15:53:21 UTC 2013


See <http://10.189.74.2:8080/job/jujugui-test-charm/201/changes>

Changes:

[Francesco Banconi] Clean up data sent to the juju-core API

This branch includes three fixes:
- null values are removed;
- annotations are sent as strings (as required by the API server);
- the deploy call sends service config values as strings
(as required by the API server).

R=gary.poster, jeff.pihach
CC=
https://codereview.appspot.com/8153043

------------------------------------------
Started by an SCM change
[EnvInject] - Loading node environment variables.
Building remotely on lp-quantal-server-amd64
$ bzr revision-info -d <http://10.189.74.2:8080/job/jujugui-test-charm/ws/>
info result: bzr revision-info -d <http://10.189.74.2:8080/job/jujugui-test-charm/ws/> returned 0. Command output: "474 jeff.pihach at canonical.com-20130328235515-gewb8ixwhxf2tb7s
" stderr: ""
[jujugui-test-charm] $ bzr pull --overwrite lp:juju-gui
You have not informed bzr of your Launchpad ID, and you must do this to
write to Launchpad or access private data.  See "bzr help launchpad-login".
http://bazaar.launchpad.net/~juju-gui/juju-gui/trunk is permanently redirected to http://bazaar.launchpad.net/~juju-gui/juju-gui/trunk/changes
You have not informed bzr of your Launchpad ID, and you must do this to
write to Launchpad or access private data.  See "bzr help launchpad-login".
 M  app/store/env/go.js
 M  test/test_env_go.js
All changes applied successfully.
Now on revision 475.
[jujugui-test-charm] $ bzr revert
$ bzr revision-info -d <http://10.189.74.2:8080/job/jujugui-test-charm/ws/>
info result: bzr revision-info -d <http://10.189.74.2:8080/job/jujugui-test-charm/ws/> returned 0. Command output: "475 francesco.banconi at canonical.com-20130329153054-sr0snlh0nfzso0rk
" stderr: ""
[jujugui-test-charm] $ bzr log -v -r revid:jeff.pihach at canonical.com-20130328235515-gewb8ixwhxf2tb7s..revid:francesco.banconi at canonical.com-20130329153054-sr0snlh0nfzso0rk --long --show-ids
Getting local revision...
$ bzr revision-info -d <http://10.189.74.2:8080/job/jujugui-test-charm/ws/>
info result: bzr revision-info -d <http://10.189.74.2:8080/job/jujugui-test-charm/ws/> returned 0. Command output: "475 francesco.banconi at canonical.com-20130329153054-sr0snlh0nfzso0rk
" stderr: ""
RevisionState revno:475 revid:francesco.banconi at canonical.com-20130329153054-sr0snlh0nfzso0rk
[EnvInject] - Injecting environment variables from a build step.
[EnvInject] - Injecting as environment variables the properties content 
JUJU_INSTANCE_IP=91.189.93.93
JUJU_BRANCH=lp:juju-gui
JUJU_CHARM=cs:~juju-gui/precise/juju-gui
FAIL_FAST=1
JUJU_GUI_TEST_BROWSERS=ie chrome firefox

[EnvInject] - Variables injected successfully.
[jujugui-test-charm] $ /bin/sh -xe /tmp/hudson5316927411555959955.sh
+ set -ex
+ cat
+ chmod +x /tmp/test-runner
+ sudo -E su -p -c /tmp/test-runner - jujugui-merger
Clean and Prep
2013-03-29 15:36:08,055 INFO Destroying environment 'juju-gui-testing' (type: openstack)...
2013-03-29 15:36:09,525 INFO 'destroy_environment' command finished successfully
WARNING: this command will destroy the 'juju-gui-testing' environment (type: openstack).
This includes all machines, services, data, and other resources. Continue [y/N] 
Lightweight Checkout of lp:juju-gui
You have not informed bzr of your Launchpad ID, and you must do this to
write to Launchpad or access private data.  See "bzr help launchpad-login".
JUJU_INSTANCE_IP=91.189.93.93
Running Tests
ADDRESS	91.189.93.93	i-00007741
Bootstrapping...
Deploying service...
Setting origin for charm to deploy lp:juju-gui
Waiting for service to start...
Assigning JUJU_INSTANCE_IP 91.189.93.93
Storing Internal IP as 10.55.60.202
Assigned IP to i-00007741
Exposing the service...
2013-03-29 15:47:24,781 INFO Connecting to environment...
2013-03-29 15:47:27,546 INFO Connected to environment.
2013-03-29 15:47:29,622 INFO 'status' command finished successfully
APP_URL= http://91.189.93.93
Launching ie tests.
test_environment_connection (__main__.TestBasics) ... ok
test_environment_name (__main__.TestBasics) ... ok
test_gui_unit_tests (__main__.TestBasics) ... ok
test_title (__main__.TestBasics) ... ok
test_charm_deploy (__main__.TestDeploy) ... ok
test_staging_services (__main__.TestDeploy) ... ok

----------------------------------------------------------------------
Ran 6 tests in 154.346s

OK
Browser: ie
Test run details at https://saucelabs.com/jobs/77d23807dc594b24802700e60bd62bfd
restart_api with ip:10.55.60.202
Launching chrome tests.
test_environment_connection (__main__.TestBasics) ... ok
test_environment_name (__main__.TestBasics) ... ok
test_gui_unit_tests (__main__.TestBasics) ... ok
test_title (__main__.TestBasics) ... ok
test_charm_deploy (__main__.TestDeploy) ... ok
test_staging_services (__main__.TestDeploy) ... ok

----------------------------------------------------------------------
Ran 6 tests in 105.184s

OK
Browser: chrome
Test run details at https://saucelabs.com/jobs/48285540ac914cbfbf51e9776e6daa36
restart_api with ip:10.55.60.202
Launching firefox tests.
test_environment_connection (__main__.TestBasics) ... ok
test_environment_name (__main__.TestBasics) ... ok
test_gui_unit_tests (__main__.TestBasics) ... FAIL
test_title (__main__.TestBasics) ... ok
test_charm_deploy (__main__.TestDeploy) ... ok
test_staging_services (__main__.TestDeploy) ... ok

======================================================================
FAIL: test_gui_unit_tests (__main__.TestBasics)
----------------------------------------------------------------------
Traceback (most recent call last):
  File "test/test_charm_running.py", line 67, in test_gui_unit_tests
    self.fail(msg)
AssertionError: 13 failure(s) running 36 tests.

----------------------------------------------------------------------
Ran 6 tests in 89.255s

FAILED (failures=1)
Browser: firefox
Test run details at https://saucelabs.com/jobs/0a9b145c16ef4587ab0428cf54c17248
12 failure(s) running 35 tests.  Retrying.
restart_api with ip:10.55.60.202
Collected exit code 1
Final instance state
i-00007741 running i-00007740 running
+ cat /home/jujugui-merger/exit-status
+ ec=1
+ [ 0 -eq 1 ]
+ wc -l
+ cat /home/jujugui-merger/instance-state
+ [ 2 -lt 2 ]
+ wc -l
+ grep error\|stopped
+ cat /home/jujugui-merger/instance-state
+ [ 0 -gt 0 ]
+ exit 1
Build step 'Execute shell' marked build as failure



More information about the Juju-GUI mailing list