Build failed in Jenkins: jujugui-test-charm #197

Jenkins Notification devnull at canonical.com
Thu Mar 28 21:42:51 UTC 2013


See <http://10.189.74.2:8080/job/jujugui-test-charm/197/>

------------------------------------------
Started by Naginator
[EnvInject] - Loading node environment variables.
Building remotely on lp-quantal-server-amd64
$ bzr revision-info -d <http://10.189.74.2:8080/job/jujugui-test-charm/ws/>
info result: bzr revision-info -d <http://10.189.74.2:8080/job/jujugui-test-charm/ws/> returned 0. Command output: "473 benji.york at canonical.com-20130328205903-kyov7qelwdd2zlo1
" stderr: ""
[jujugui-test-charm] $ bzr pull --overwrite lp:juju-gui
You have not informed bzr of your Launchpad ID, and you must do this to
write to Launchpad or access private data.  See "bzr help launchpad-login".
http://bazaar.launchpad.net/~juju-gui/juju-gui/trunk is permanently redirected to http://bazaar.launchpad.net/~juju-gui/juju-gui/trunk/changes
You have not informed bzr of your Launchpad ID, and you must do this to
write to Launchpad or access private data.  See "bzr help launchpad-login".
No revisions or tags to pull.
[jujugui-test-charm] $ bzr revert
$ bzr revision-info -d <http://10.189.74.2:8080/job/jujugui-test-charm/ws/>
info result: bzr revision-info -d <http://10.189.74.2:8080/job/jujugui-test-charm/ws/> returned 0. Command output: "473 benji.york at canonical.com-20130328205903-kyov7qelwdd2zlo1
" stderr: ""
[jujugui-test-charm] $ bzr log -v -r revid:benji.york at canonical.com-20130328205903-kyov7qelwdd2zlo1..revid:benji.york at canonical.com-20130328205903-kyov7qelwdd2zlo1 --long --show-ids
Getting local revision...
$ bzr revision-info -d <http://10.189.74.2:8080/job/jujugui-test-charm/ws/>
info result: bzr revision-info -d <http://10.189.74.2:8080/job/jujugui-test-charm/ws/> returned 0. Command output: "473 benji.york at canonical.com-20130328205903-kyov7qelwdd2zlo1
" stderr: ""
RevisionState revno:473 revid:benji.york at canonical.com-20130328205903-kyov7qelwdd2zlo1
[EnvInject] - Injecting environment variables from a build step.
[EnvInject] - Injecting as environment variables the properties content 
JUJU_INSTANCE_IP=91.189.93.93
JUJU_BRANCH=lp:juju-gui
JUJU_CHARM=cs:~juju-gui/precise/juju-gui
FAIL_FAST=1
JUJU_GUI_TEST_BROWSERS=ie chrome firefox

[EnvInject] - Variables injected successfully.
[jujugui-test-charm] $ /bin/sh -xe /tmp/hudson8132841315319059537.sh
+ set -ex
+ cat
+ chmod +x /tmp/test-runner
+ sudo -E su -p -c /tmp/test-runner - jujugui-merger
Clean and Prep
2013-03-28 21:22:51,356 INFO Destroying environment 'juju-gui-testing' (type: openstack)...
2013-03-28 21:22:53,933 INFO 'destroy_environment' command finished successfully
WARNING: this command will destroy the 'juju-gui-testing' environment (type: openstack).
This includes all machines, services, data, and other resources. Continue [y/N] 
Waiting for instances to terminate
Waiting for instances to terminate
Waiting for instances to terminate
This is taking too long. Now trying euca-terminate-instances.

+ euca-terminate-instances i-00007719
INSTANCE	i-00007719
+ set +x

Waiting for instances to terminate
Lightweight Checkout of lp:juju-gui
You have not informed bzr of your Launchpad ID, and you must do this to
write to Launchpad or access private data.  See "bzr help launchpad-login".
JUJU_INSTANCE_IP=91.189.93.93
Running Tests
ADDRESS	91.189.93.93	i-0000771d
Bootstrapping...
Deploying service...
Setting origin for charm to deploy lp:juju-gui
Waiting for service to start...
Assigning JUJU_INSTANCE_IP 91.189.93.93
Storing Internal IP as 10.55.60.201
Assigned IP to i-0000771d
Exposing the service...
2013-03-28 21:37:11,790 INFO Connecting to environment...
2013-03-28 21:37:14,507 INFO Connected to environment.
2013-03-28 21:37:16,552 INFO 'status' command finished successfully
APP_URL= http://91.189.93.93
Launching ie tests.
test_environment_connection (__main__.TestBasics) ... ok
test_environment_name (__main__.TestBasics) ... ok
test_gui_unit_tests (__main__.TestBasics) ... ok
test_title (__main__.TestBasics) ... ok
test_charm_deploy (__main__.TestDeploy) ... ok
test_staging_services (__main__.TestDeploy) ... ok

----------------------------------------------------------------------
Ran 6 tests in 141.282s

OK
Browser: ie
Test run details at https://saucelabs.com/jobs/73105abed0444b9fae54c879a99030cb
restart_api with ip:10.55.60.201
Launching chrome tests.
test_environment_connection (__main__.TestBasics) ... ok
test_environment_name (__main__.TestBasics) ... ok
test_gui_unit_tests (__main__.TestBasics) ... ok
test_title (__main__.TestBasics) ... ok
test_charm_deploy (__main__.TestDeploy) ... ok
test_staging_services (__main__.TestDeploy) ... ok

----------------------------------------------------------------------
Ran 6 tests in 100.667s

OK
Browser: chrome
Test run details at https://saucelabs.com/jobs/bcbdb7f4ca65449882945a303cd8503f
restart_api with ip:10.55.60.201
Launching firefox tests.
test_environment_connection (__main__.TestBasics) ... ok
test_environment_name (__main__.TestBasics) ... ok
test_gui_unit_tests (__main__.TestBasics) ... FAIL
test_title (__main__.TestBasics) ... ok
test_charm_deploy (__main__.TestDeploy) ... ok
test_staging_services (__main__.TestDeploy) ... ok

======================================================================
FAIL: test_gui_unit_tests (__main__.TestBasics)
----------------------------------------------------------------------
Traceback (most recent call last):
  File "test/test_charm_running.py", line 67, in test_gui_unit_tests
    self.fail(msg)
AssertionError: 12 failure(s) running 39 tests.

----------------------------------------------------------------------
Ran 6 tests in 89.891s

FAILED (failures=1)
Browser: firefox
Test run details at https://saucelabs.com/jobs/fb90f0ec4698466c8495b8fc7e9e7e5e
2 failure(s) running 24 tests.  Retrying.
restart_api with ip:10.55.60.201
Collected exit code 1
Final instance state
i-0000771a running i-0000771d running
+ wc -l
+ grep error\|stopped
+ cat /home/jujugui-merger/instance-state
+ [ 0 -gt 0 ]
+ cat /home/jujugui-merger/exit-status
+ ec=1
+ [ 0 -eq 1 ]
+ exit 1
Build step 'Execute shell' marked build as failure



More information about the Juju-GUI mailing list