Build failed in Jenkins: jujugui-test-charm #479

Jenkins Notification devnull at canonical.com
Tue Jun 11 13:45:00 UTC 2013


See <http://10.189.74.2:8080/job/jujugui-test-charm/479/changes>

Changes:

[j.c.sackett] Removes the browser feature flag.

Does what it says on the tin.

R=rharding, matthew.scott
CC=
https://codereview.appspot.com/10156043

------------------------------------------
Started by an SCM change
[EnvInject] - Loading node environment variables.
Building remotely on lp-quantal-server-amd64
$ bzr revision-info -d <http://10.189.74.2:8080/job/jujugui-test-charm/ws/>
info result: bzr revision-info -d <http://10.189.74.2:8080/job/jujugui-test-charm/ws/> returned 0. Command output: "714 jeff.pihach at canonical.com-20130610224404-8gzzzk0cmbjetvlo
" stderr: ""
[jujugui-test-charm] $ bzr pull --overwrite lp:juju-gui
You have not informed bzr of your Launchpad ID, and you must do this to
write to Launchpad or access private data.  See "bzr help launchpad-login".
http://bazaar.launchpad.net/~juju-gui/juju-gui/trunk is permanently redirected to http://bazaar.launchpad.net/~juju-gui/juju-gui/trunk/changes
You have not informed bzr of your Launchpad ID, and you must do this to
write to Launchpad or access private data.  See "bzr help launchpad-login".
 M  app/app.js
 M  app/subapps/browser/browser.js
 M  test/test_app.js
 M  test/test_browser_app.js
All changes applied successfully.
Now on revision 715.
[jujugui-test-charm] $ bzr revert
$ bzr revision-info -d <http://10.189.74.2:8080/job/jujugui-test-charm/ws/>
info result: bzr revision-info -d <http://10.189.74.2:8080/job/jujugui-test-charm/ws/> returned 0. Command output: "715 jcsackett at canonical.com-20130611132738-phi4fuc52qitcd0c
" stderr: ""
[jujugui-test-charm] $ bzr log -v -r revid:jeff.pihach at canonical.com-20130610224404-8gzzzk0cmbjetvlo..revid:jcsackett at canonical.com-20130611132738-phi4fuc52qitcd0c --long --show-ids
Getting local revision...
$ bzr revision-info -d <http://10.189.74.2:8080/job/jujugui-test-charm/ws/>
info result: bzr revision-info -d <http://10.189.74.2:8080/job/jujugui-test-charm/ws/> returned 0. Command output: "715 jcsackett at canonical.com-20130611132738-phi4fuc52qitcd0c
" stderr: ""
RevisionState revno:715 revid:jcsackett at canonical.com-20130611132738-phi4fuc52qitcd0c
[EnvInject] - Injecting environment variables from a build step.
[EnvInject] - Injecting as environment variables the properties content 
JUJU_INSTANCE_IP=91.189.93.93
JUJU_BRANCH=lp:juju-gui
JUJU_CHARM=cs:~juju-gui/precise/juju-gui
FAIL_FAST=1
JUJU_GUI_TEST_BROWSERS=ie chrome firefox

[EnvInject] - Variables injected successfully.
[jujugui-test-charm] $ /bin/sh -xe /tmp/hudson3021474882025657278.sh
+ set -ex
+ cat
+ chmod +x /tmp/test-runner
+ sudo -E su -p -c /tmp/test-runner - jujugui-merger
Clean and Prep
2013-06-11 13:31:16,022 INFO Destroying environment 'juju-gui-testing' (type: openstack)...
2013-06-11 13:31:17,816 INFO 'destroy_environment' command finished successfully
WARNING: this command will destroy the 'juju-gui-testing' environment (type: openstack).
This includes all machines, services, data, and other resources. Continue [y/N] 
Lightweight Checkout of lp:juju-gui
You have not informed bzr of your Launchpad ID, and you must do this to
write to Launchpad or access private data.  See "bzr help launchpad-login".
JUJU_INSTANCE_IP=91.189.93.93
Running Tests
ADDRESS	91.189.93.93	i-00008352
Using image f2ca48ce-30d5-4f1f-9075-12e64510368d (ubuntu-released/ubuntu-precise-12.04-amd64-server-20130603-disk1.img)
Bootstrapping...
Deploying service...
Setting origin for charm to deploy lp:juju-gui
Waiting for service to start...
Assigning JUJU_INSTANCE_IP 91.189.93.93
Storing Internal IP as 10.55.60.64
Assigned IP to i-00008352
Exposing the service...
2013-06-11 13:39:31,752 INFO Connecting to environment...
2013-06-11 13:39:34,562 INFO Connected to environment.
2013-06-11 13:39:36,585 INFO 'status' command finished successfully
Env: juju-gui-testing
APP_URL: http://91.189.93.93
Launching ie tests.
test_root_page (__main__.TestAuthentication) ... ok
test_service_page (__main__.TestAuthentication) ... ok
test_unit_page (__main__.TestAuthentication) ... ok
test_environment_connection (__main__.TestBasics) ... ok
test_environment_name (__main__.TestBasics) ... ok
test_gui_unit_tests (__main__.TestBasics) ... ok
test_title (__main__.TestBasics) ... ok
test_charm_deploy (__main__.TestSandbox) ... ERROR
test_charm_deploy (__main__.TestStaging) ... ERROR
test_initial_services (__main__.TestStaging) ... ok
test_service_view (__main__.TestStaging) ... ok
test_unit_view (__main__.TestStaging) ... ok

======================================================================
ERROR: test_charm_deploy (__main__.TestSandbox)
----------------------------------------------------------------------
Traceback (most recent call last):
  File "test/test_charm_running.py", line 251, in test_charm_deploy
    self.deploy('appflower')
  File "test/test_charm_running.py", line 126, in deploy
    deploy_button.click()
  File "/usr/lib/python2.7/dist-packages/selenium/webdriver/remote/webelement.py", line 52, in click
    self._execute(Command.CLICK_ELEMENT)
  File "/usr/lib/python2.7/dist-packages/selenium/webdriver/remote/webelement.py", line 205, in _execute
    return self._parent.execute(command, params)
  File "/usr/lib/python2.7/dist-packages/selenium/webdriver/remote/webdriver.py", line 156, in execute
    self.error_handler.check_response(response)
  File "/usr/lib/python2.7/dist-packages/selenium/webdriver/remote/errorhandler.py", line 147, in check_response
    raise exception_class(message, screen, stacktrace)
ElementNotVisibleException: Message: u"Cannot click on element (WARNING: The server did not provide any stacktrace information)\nCommand duration or timeout: 71 milliseconds\nBuild info: version: '2.33.0', revision: '4e90c97', time: '2013-05-22 15:32:38'\nSystem info: os.name: 'Windows Server 2012', os.arch: 'x86', os.version: '6.2', java.version: '1.6.0_43'\nSession ID: dd1ac276-246a-45f7-964d-a3aebdb5988c\nDriver info: org.openqa.selenium.ie.InternetExplorerDriver\nCapabilities [{platform=WINDOWS, elementScrollBehavior=0, javascriptEnabled=true, enablePersistentHover=true, ignoreZoomSetting=false, browserName=internet explorer, enableElementCacheCleanup=true, unexpectedAlertBehaviour=dismiss, version=10, cssSelectorsEnabled=true, ignoreProtectedModeSettings=false, requireWindowFocus=false, allowAsynchronousJavaScript=false, handlesAlerts=true, initialBrowserUrl=, nativeEvents=true, takesScreenshot=true}]" ; Stacktrace: Method newInstance0 threw an error in None 

======================================================================
ERROR: test_charm_deploy (__main__.TestStaging)
----------------------------------------------------------------------
Traceback (most recent call last):
  File "test/test_charm_running.py", line 152, in test_charm_deploy
    self.deploy('appflower')
  File "test/test_charm_running.py", line 126, in deploy
    deploy_button.click()
  File "/usr/lib/python2.7/dist-packages/selenium/webdriver/remote/webelement.py", line 52, in click
    self._execute(Command.CLICK_ELEMENT)
  File "/usr/lib/python2.7/dist-packages/selenium/webdriver/remote/webelement.py", line 205, in _execute
    return self._parent.execute(command, params)
  File "/usr/lib/python2.7/dist-packages/selenium/webdriver/remote/webdriver.py", line 156, in execute
    self.error_handler.check_response(response)
  File "/usr/lib/python2.7/dist-packages/selenium/webdriver/remote/errorhandler.py", line 147, in check_response
    raise exception_class(message, screen, stacktrace)
ElementNotVisibleException: Message: u"Cannot click on element (WARNING: The server did not provide any stacktrace information)\nCommand duration or timeout: 71 milliseconds\nBuild info: version: '2.33.0', revision: '4e90c97', time: '2013-05-22 15:32:38'\nSystem info: os.name: 'Windows Server 2012', os.arch: 'x86', os.version: '6.2', java.version: '1.6.0_43'\nSession ID: 39f05e58-43c7-4028-95b8-3d7b83346e38\nDriver info: org.openqa.selenium.ie.InternetExplorerDriver\nCapabilities [{platform=WINDOWS, elementScrollBehavior=0, javascriptEnabled=true, enablePersistentHover=true, ignoreZoomSetting=false, browserName=internet explorer, enableElementCacheCleanup=true, unexpectedAlertBehaviour=dismiss, version=10, cssSelectorsEnabled=true, ignoreProtectedModeSettings=false, requireWindowFocus=false, allowAsynchronousJavaScript=false, handlesAlerts=true, initialBrowserUrl=, nativeEvents=true, takesScreenshot=true}]" ; Stacktrace: Method newInstance0 threw an error in None 

----------------------------------------------------------------------
Ran 12 tests in 319.514s

FAILED (errors=2)
* Platform: Internet Explorer 10 (Windows)
* Testcase: TestAuthentication
* Details: https://saucelabs.com/jobs/50ef2ad93294477bbce2ef1ce0a31292
* Platform: Internet Explorer 10 (Windows)
* Testcase: TestBasics
* Details: https://saucelabs.com/jobs/82356fd681d14fed81d7f355d773940d
* Platform: Internet Explorer 10 (Windows)
* Testcase: TestSandbox
* Details: https://saucelabs.com/jobs/d4bb46f329c74c618a4ca6464b16792b
- setting new options: sandbox=True
- setting new options: sandbox=False
* Platform: Internet Explorer 10 (Windows)
* Testcase: TestStaging
* Details: https://saucelabs.com/jobs/c217b3e47b6c43c4ab3eb43940c983e4

- restarting API backend with ip:10.55.60.64...
- done
Quitting...
2013-06-11 13:44:56,737 INFO Destroying environment 'juju-gui-testing' (type: openstack)...
2013-06-11 13:44:59,684 INFO 'destroy_environment' command finished successfully
WARNING: this command will destroy the 'juju-gui-testing' environment (type: openstack).
This includes all machines, services, data, and other resources. Continue [y/N] Collected exit code 1
Final instance state
i-00008352 running i-00008351 running
+ cat /home/jujugui-merger/exit-status
+ ec=1
+ [ 0 -eq 1 ]
+ wc -l
+ cat /home/jujugui-merger/instance-state
+ [ 2 -lt 2 ]
+ wc -l
+ grep error\|stopped
+ cat /home/jujugui-merger/instance-state
+ [ 0 -gt 0 ]
+ exit 1
Build step 'Execute shell' marked build as failure



More information about the Juju-GUI mailing list