Build failed in Jenkins: jujugui-test-charm #580

Jenkins Notification devnull at canonical.com
Fri Jul 26 17:07:24 UTC 2013


See <http://10.189.74.2:8080/job/jujugui-test-charm/580/changes>

Changes:

[Jeff Pihach] Locked version numbers for mocha deps

R=gary.poster
CC=
https://codereview.appspot.com/11918044

------------------------------------------
Started by an SCM change
[EnvInject] - Loading node environment variables.
Building remotely on lp-quantal-server-amd64
$ bzr revision-info -d <http://10.189.74.2:8080/job/jujugui-test-charm/ws/>
info result: bzr revision-info -d <http://10.189.74.2:8080/job/jujugui-test-charm/ws/> returned 0. Command output: "899 bcsaller at gmail.com-20130726075438-l0h9qh0bh0vg0mot
" stderr: ""
[jujugui-test-charm] $ bzr pull --overwrite lp:juju-gui
You have not informed bzr of your Launchpad ID, and you must do this to
write to Launchpad or access private data.  See "bzr help launchpad-login".
http://bazaar.launchpad.net/~juju-gui/juju-gui/trunk is permanently redirected to http://bazaar.launchpad.net/~juju-gui/juju-gui/trunk/changes
You have not informed bzr of your Launchpad ID, and you must do this to
write to Launchpad or access private data.  See "bzr help launchpad-login".
 M  HACKING
All changes applied successfully.
Now on revision 900.
[jujugui-test-charm] $ bzr revert
$ bzr revision-info -d <http://10.189.74.2:8080/job/jujugui-test-charm/ws/>
info result: bzr revision-info -d <http://10.189.74.2:8080/job/jujugui-test-charm/ws/> returned 0. Command output: "900 jeff.pihach at canonical.com-20130726164551-lj8blnyzydtcfw67
" stderr: ""
[jujugui-test-charm] $ bzr log -v -r revid:bcsaller at gmail.com-20130726075438-l0h9qh0bh0vg0mot..revid:jeff.pihach at canonical.com-20130726164551-lj8blnyzydtcfw67 --long --show-ids
Getting local revision...
$ bzr revision-info -d <http://10.189.74.2:8080/job/jujugui-test-charm/ws/>
info result: bzr revision-info -d <http://10.189.74.2:8080/job/jujugui-test-charm/ws/> returned 0. Command output: "900 jeff.pihach at canonical.com-20130726164551-lj8blnyzydtcfw67
" stderr: ""
RevisionState revno:900 revid:jeff.pihach at canonical.com-20130726164551-lj8blnyzydtcfw67
[EnvInject] - Injecting environment variables from a build step.
[EnvInject] - Injecting as environment variables the properties content 
JUJU_INSTANCE_IP=91.189.93.93
JUJU_BRANCH=lp:juju-gui
JUJU_CHARM=cs:~juju-gui/precise/juju-gui
FAIL_FAST=1
JUJU_GUI_TEST_BROWSERS=ie chrome firefox

[EnvInject] - Variables injected successfully.
[jujugui-test-charm] $ /bin/sh -xe /tmp/hudson4617595645665567064.sh
+ set -ex
+ cat
+ chmod +x /tmp/test-runner
+ sudo -E su -p -c /tmp/test-runner - jujugui-merger
Clean and Prep
2013-07-26 16:51:08,883 INFO Destroying environment 'juju-gui-testing' (type: openstack)...
2013-07-26 16:51:10,257 INFO 'destroy_environment' command finished successfully
WARNING: this command will destroy the 'juju-gui-testing' environment (type: openstack).
This includes all machines, services, data, and other resources. Continue [y/N] 
Lightweight Checkout of lp:juju-gui
You have not informed bzr of your Launchpad ID, and you must do this to
write to Launchpad or access private data.  See "bzr help launchpad-login".
JUJU_INSTANCE_IP=91.189.93.93
Running Tests
virtualenv virtualenv --system-site-packages
New python executable in virtualenv/bin/python
Installing distribute.............................................................................................................................................................................................done.
Installing pip...............done.
virtualenv/bin/easy_install archives/selenium-2.33.0.tar.gz
Processing selenium-2.33.0.tar.gz
Running selenium-2.33.0/setup.py -q bdist_egg --dist-dir /tmp/easy_install-9OwAb1/selenium-2.33.0/egg-dist-tmp-6tFBZ6
Adding selenium 2.33.0 to easy-install.pth file

Installed /home/jujugui-merger/gui-branch/virtualenv/lib/python2.7/site-packages/selenium-2.33.0-py2.7.egg
Processing dependencies for selenium==2.33.0
Finished processing dependencies for selenium==2.33.0
ADDRESS	91.189.93.93	i-00008dc4
Using image e8f6e1d9-3a8b-4948-b127-242721ce190d (ubuntu-released/ubuntu-precise-12.04-amd64-server-20130624-disk1.img)
Bootstrapping...
Deploying service...
Setting origin for charm to deploy lp:juju-gui
Waiting for service to start...
Assigning JUJU_INSTANCE_IP 91.189.93.93
Storing Internal IP as 10.55.60.129
Assigned IP to i-00008dc4
Exposing the service...
2013-07-26 16:59:34,068 INFO Connecting to environment...
2013-07-26 16:59:36,917 INFO Connected to environment.
2013-07-26 16:59:38,992 INFO 'status' command finished successfully
Env: juju-gui-testing
APP_URL: http://91.189.93.93
Launching ie tests.
* Platform: Internet Explorer 10 (Windows)
* Testcase: TestAuthentication
* Details: https://saucelabs.com/jobs/22832055c547477d96c746a453c5d254
test_root_page (__main__.TestAuthentication) ... ok
test_service_page (__main__.TestAuthentication) ... ok
test_unit_page (__main__.TestAuthentication) ... ok
* Platform: Internet Explorer 10 (Windows)
* Testcase: TestBasics
* Details: https://saucelabs.com/jobs/0b9c771439c247e89075f1c0dc364e89
test_environment_connection (__main__.TestBasics) ... ok
test_environment_name (__main__.TestBasics) ... ok
test_gui_unit_tests (__main__.TestBasics) ... FAIL
test_title (__main__.TestBasics) ... ok
* Platform: Internet Explorer 10 (Windows)
* Testcase: TestNotifications
* Details: https://saucelabs.com/jobs/0d2b9798a9104d55ae53c6c6f2a4b293
test_error (__main__.TestNotifications) ... ok
test_initial (__main__.TestNotifications) ... ok
* Platform: Internet Explorer 10 (Windows)
* Testcase: TestSandbox
* Details: https://saucelabs.com/jobs/b7fea9e95ecf4f64ad13ac2b7888a9df
- setting new options: sandbox=True
test_charm_deploy (__main__.TestSandbox) ... ok
- setting new options: sandbox=False
* Platform: Internet Explorer 10 (Windows)
* Testcase: TestStaging
* Details: https://saucelabs.com/jobs/a4336be4dcff402abd0b7607eb2e4282
test_charm_deploy (__main__.TestStaging) ... 
- restarting API backend with ip:10.55.60.129...
- done
ok
test_initial_services (__main__.TestStaging) ... ok
test_service_view (__main__.TestStaging) ... ok
test_unit_view (__main__.TestStaging) ... ok

======================================================================
FAIL: test_gui_unit_tests (__main__.TestBasics)
----------------------------------------------------------------------
Traceback (most recent call last):
  File "test/test_charm_running.py", line 95, in test_gui_unit_tests
    self.fail(msg)
AssertionError: 2 failure(s) running 135 tests.

----------------------------------------------------------------------
Ran 14 tests in 461.511s

FAILED (failures=1)
Quitting...
2013-07-26 17:07:20,958 INFO Destroying environment 'juju-gui-testing' (type: openstack)...
2013-07-26 17:07:24,028 INFO 'destroy_environment' command finished successfully
WARNING: this command will destroy the 'juju-gui-testing' environment (type: openstack).
This includes all machines, services, data, and other resources. Continue [y/N] Collected exit code 1
Final instance state
i-00008dc4 running i-00008dc3 running
+ cat /home/jujugui-merger/exit-status
+ ec=1
+ [ 0 -eq 1 ]
+ wc -l
+ cat /home/jujugui-merger/instance-state
+ [ 2 -lt 2 ]
+ wc -l
+ grep error\|stopped
+ cat /home/jujugui-merger/instance-state
+ [ 0 -gt 0 ]
+ exit 1
Build step 'Execute shell' marked build as failure



More information about the Juju-GUI mailing list