Build failed in Jenkins: jujugui-test-charm #898

Jenkins Notification devnull at canonical.com
Wed Dec 4 22:01:20 UTC 2013


See <http://d-jenkins.ubuntu-ci:8080/job/jujugui-test-charm/898/changes>

Changes:

[Matthew Scott] Set version for release

------------------------------------------
Started by an SCM change
[EnvInject] - Loading node environment variables.
Building remotely on lp-quantal-server-amd64 in workspace <http://d-jenkins.ubuntu-ci:8080/job/jujugui-test-charm/ws/>
$ bzr revision-info -d <http://d-jenkins.ubuntu-ci:8080/job/jujugui-test-charm/ws/>
info result: bzr revision-info -d <http://d-jenkins.ubuntu-ci:8080/job/jujugui-test-charm/ws/> returned 0. Command output: "1221 jeff.pihach at canonical.com-20131204172228-mij1nyhlnz2wzm4o
" stderr: ""
[jujugui-test-charm] $ bzr pull --overwrite lp:juju-gui
You have not informed bzr of your Launchpad ID, and you must do this to
write to Launchpad or access private data.  See "bzr help launchpad-login".
http://bazaar.launchpad.net/~juju-gui/juju-gui/trunk is permanently redirected to http://bazaar.launchpad.net/~juju-gui/juju-gui/trunk/changes
You have not informed bzr of your Launchpad ID, and you must do this to
write to Launchpad or access private data.  See "bzr help launchpad-login".
 M  CHANGES.yaml
All changes applied successfully.
Now on revision 1222.
1 tag(s) updated.
[jujugui-test-charm] $ bzr revert
$ bzr revision-info -d <http://d-jenkins.ubuntu-ci:8080/job/jujugui-test-charm/ws/>
info result: bzr revision-info -d <http://d-jenkins.ubuntu-ci:8080/job/jujugui-test-charm/ws/> returned 0. Command output: "1222 matthew.scott at canonical.com-20131204213700-dskejfk7ilenqklx
" stderr: ""
[jujugui-test-charm] $ bzr log -v -r revid:jeff.pihach at canonical.com-20131204172228-mij1nyhlnz2wzm4o..revid:matthew.scott at canonical.com-20131204213700-dskejfk7ilenqklx --long --show-ids
Getting local revision...
$ bzr revision-info -d <http://d-jenkins.ubuntu-ci:8080/job/jujugui-test-charm/ws/>
info result: bzr revision-info -d <http://d-jenkins.ubuntu-ci:8080/job/jujugui-test-charm/ws/> returned 0. Command output: "1222 matthew.scott at canonical.com-20131204213700-dskejfk7ilenqklx
" stderr: ""
RevisionState revno:1222 revid:matthew.scott at canonical.com-20131204213700-dskejfk7ilenqklx
[EnvInject] - Injecting environment variables from a build step.
[EnvInject] - Injecting as environment variables the properties content 
JUJU_INSTANCE_IP=91.189.93.93
JUJU_BRANCH=lp:juju-gui
JUJU_CHARM=cs:~juju-gui/precise/juju-gui
FAIL_FAST=1
JUJU_GUI_TEST_BROWSERS=ie chrome firefox

[EnvInject] - Variables injected successfully.
[jujugui-test-charm] $ /bin/sh -xe /tmp/hudson1344418253924739225.sh
+ set -ex
+ cat
+ chmod +x /tmp/test-runner
+ sudo -E su -p -c /tmp/test-runner - jujugui-merger
Clean and Prep
2013-12-04 21:46:19,537 INFO Destroying environment 'juju-gui-testing' (type: openstack)...
2013-12-04 21:46:20,976 INFO 'destroy_environment' command finished successfully
WARNING: this command will destroy the 'juju-gui-testing' environment (type: openstack).
This includes all machines, services, data, and other resources. Continue [y/N] 
Lightweight Checkout of lp:juju-gui
You have not informed bzr of your Launchpad ID, and you must do this to
write to Launchpad or access private data.  See "bzr help launchpad-login".
JUJU_INSTANCE_IP=91.189.93.93
Running Tests
virtualenv virtualenv --system-site-packages
New python executable in virtualenv/bin/python
Installing distribute.............................................................................................................................................................................................done.
Installing pip...............done.
virtualenv/bin/easy_install archives/selenium-2.35.0.tar.gz
Processing selenium-2.35.0.tar.gz
Running selenium-2.35.0/setup.py -q bdist_egg --dist-dir /tmp/easy_install-nqZcQx/selenium-2.35.0/egg-dist-tmp-TBwAlZ
Adding selenium 2.35.0 to easy-install.pth file

Installed /home/jujugui-merger/gui-branch/virtualenv/lib/python2.7/site-packages/selenium-2.35.0-py2.7.egg
Processing dependencies for selenium==2.35.0
Finished processing dependencies for selenium==2.35.0
ADDRESS	91.189.93.93	i-0000a6c6
Using image c60cd705-b1dc-4bfb-9194-0b42fef7b5ab (ubuntu-released/ubuntu-precise-12.04-amd64-server-20131114-disk1.img)
Bootstrapping...
Deploying service...
Setting origin for charm to deploy lp:juju-gui
Waiting for service to start...
Assigning JUJU_INSTANCE_IP 91.189.93.93
Storing Internal IP as 10.55.60.167
Assigned IP to i-0000a6c6
Exposing the service...
2013-12-04 21:56:00,919 INFO Connecting to environment...
2013-12-04 21:56:03,785 INFO Connected to environment.
2013-12-04 21:56:05,773 INFO 'status' command finished successfully
Env: juju-gui-testing
APP_URL: http://91.189.93.93
Launching ie tests.
ERROR
ERROR
ERROR
ERROR
ERROR

======================================================================
ERROR: setUpClass (__main__.TestAuthentication)
----------------------------------------------------------------------
Traceback (most recent call last):
  File "/home/jujugui-merger/gui-branch/test/browser.py", line 222, in setUpClass
    command_executor=command_executor)
  File "/home/jujugui-merger/gui-branch/virtualenv/local/lib/python2.7/site-packages/selenium-2.35.0-py2.7.egg/selenium/webdriver/remote/webdriver.py", line 72, in __init__
    self.start_session(desired_capabilities, browser_profile)
  File "/home/jujugui-merger/gui-branch/virtualenv/local/lib/python2.7/site-packages/selenium-2.35.0-py2.7.egg/selenium/webdriver/remote/webdriver.py", line 114, in start_session
    'desiredCapabilities': desired_capabilities,
  File "/home/jujugui-merger/gui-branch/virtualenv/local/lib/python2.7/site-packages/selenium-2.35.0-py2.7.egg/selenium/webdriver/remote/webdriver.py", line 163, in execute
    response = self.command_executor.execute(driver_command, params)
  File "/home/jujugui-merger/gui-branch/virtualenv/local/lib/python2.7/site-packages/selenium-2.35.0-py2.7.egg/selenium/webdriver/remote/remote_connection.py", line 353, in execute
    return self._request(url, method=command_info[0], data=data)
  File "/home/jujugui-merger/gui-branch/virtualenv/local/lib/python2.7/site-packages/selenium-2.35.0-py2.7.egg/selenium/webdriver/remote/remote_connection.py", line 400, in _request
    response = opener.open(request)
  File "/usr/lib/python2.7/urllib2.py", line 401, in open
    response = self._open(req, data)
  File "/usr/lib/python2.7/urllib2.py", line 419, in _open
    '_open', req)
  File "/usr/lib/python2.7/urllib2.py", line 379, in _call_chain
    result = func(*args)
  File "/usr/lib/python2.7/urllib2.py", line 1211, in http_open
    return self.do_open(httplib.HTTPConnection, req)
  File "/usr/lib/python2.7/urllib2.py", line 1181, in do_open
    raise URLError(err)
URLError: <urlopen error [Errno 110] Connection timed out>

======================================================================
ERROR: setUpClass (__main__.TestBasics)
----------------------------------------------------------------------
Traceback (most recent call last):
  File "/home/jujugui-merger/gui-branch/test/browser.py", line 222, in setUpClass
    command_executor=command_executor)
  File "/home/jujugui-merger/gui-branch/virtualenv/local/lib/python2.7/site-packages/selenium-2.35.0-py2.7.egg/selenium/webdriver/remote/webdriver.py", line 72, in __init__
    self.start_session(desired_capabilities, browser_profile)
  File "/home/jujugui-merger/gui-branch/virtualenv/local/lib/python2.7/site-packages/selenium-2.35.0-py2.7.egg/selenium/webdriver/remote/webdriver.py", line 114, in start_session
    'desiredCapabilities': desired_capabilities,
  File "/home/jujugui-merger/gui-branch/virtualenv/local/lib/python2.7/site-packages/selenium-2.35.0-py2.7.egg/selenium/webdriver/remote/webdriver.py", line 163, in execute
    response = self.command_executor.execute(driver_command, params)
  File "/home/jujugui-merger/gui-branch/virtualenv/local/lib/python2.7/site-packages/selenium-2.35.0-py2.7.egg/selenium/webdriver/remote/remote_connection.py", line 353, in execute
    return self._request(url, method=command_info[0], data=data)
  File "/home/jujugui-merger/gui-branch/virtualenv/local/lib/python2.7/site-packages/selenium-2.35.0-py2.7.egg/selenium/webdriver/remote/remote_connection.py", line 400, in _request
    response = opener.open(request)
  File "/usr/lib/python2.7/urllib2.py", line 401, in open
    response = self._open(req, data)
  File "/usr/lib/python2.7/urllib2.py", line 419, in _open
    '_open', req)
  File "/usr/lib/python2.7/urllib2.py", line 379, in _call_chain
    result = func(*args)
  File "/usr/lib/python2.7/urllib2.py", line 1211, in http_open
    return self.do_open(httplib.HTTPConnection, req)
  File "/usr/lib/python2.7/urllib2.py", line 1181, in do_open
    raise URLError(err)
URLError: <urlopen error [Errno 110] Connection timed out>

======================================================================
ERROR: setUpClass (__main__.TestNotifications)
----------------------------------------------------------------------
Traceback (most recent call last):
  File "/home/jujugui-merger/gui-branch/test/browser.py", line 222, in setUpClass
    command_executor=command_executor)
  File "/home/jujugui-merger/gui-branch/virtualenv/local/lib/python2.7/site-packages/selenium-2.35.0-py2.7.egg/selenium/webdriver/remote/webdriver.py", line 72, in __init__
    self.start_session(desired_capabilities, browser_profile)
  File "/home/jujugui-merger/gui-branch/virtualenv/local/lib/python2.7/site-packages/selenium-2.35.0-py2.7.egg/selenium/webdriver/remote/webdriver.py", line 114, in start_session
    'desiredCapabilities': desired_capabilities,
  File "/home/jujugui-merger/gui-branch/virtualenv/local/lib/python2.7/site-packages/selenium-2.35.0-py2.7.egg/selenium/webdriver/remote/webdriver.py", line 163, in execute
    response = self.command_executor.execute(driver_command, params)
  File "/home/jujugui-merger/gui-branch/virtualenv/local/lib/python2.7/site-packages/selenium-2.35.0-py2.7.egg/selenium/webdriver/remote/remote_connection.py", line 353, in execute
    return self._request(url, method=command_info[0], data=data)
  File "/home/jujugui-merger/gui-branch/virtualenv/local/lib/python2.7/site-packages/selenium-2.35.0-py2.7.egg/selenium/webdriver/remote/remote_connection.py", line 400, in _request
    response = opener.open(request)
  File "/usr/lib/python2.7/urllib2.py", line 401, in open
    response = self._open(req, data)
  File "/usr/lib/python2.7/urllib2.py", line 419, in _open
    '_open', req)
  File "/usr/lib/python2.7/urllib2.py", line 379, in _call_chain
    result = func(*args)
  File "/usr/lib/python2.7/urllib2.py", line 1211, in http_open
    return self.do_open(httplib.HTTPConnection, req)
  File "/usr/lib/python2.7/urllib2.py", line 1181, in do_open
    raise URLError(err)
URLError: <urlopen error [Errno 110] Connection timed out>

======================================================================
ERROR: setUpClass (__main__.TestSandbox)
----------------------------------------------------------------------
Traceback (most recent call last):
  File "test/test_charm_running.py", line 320, in setUpClass
    super(TestSandbox, cls).setUpClass()
  File "/home/jujugui-merger/gui-branch/test/browser.py", line 222, in setUpClass
    command_executor=command_executor)
  File "/home/jujugui-merger/gui-branch/virtualenv/local/lib/python2.7/site-packages/selenium-2.35.0-py2.7.egg/selenium/webdriver/remote/webdriver.py", line 72, in __init__
    self.start_session(desired_capabilities, browser_profile)
  File "/home/jujugui-merger/gui-branch/virtualenv/local/lib/python2.7/site-packages/selenium-2.35.0-py2.7.egg/selenium/webdriver/remote/webdriver.py", line 114, in start_session
    'desiredCapabilities': desired_capabilities,
  File "/home/jujugui-merger/gui-branch/virtualenv/local/lib/python2.7/site-packages/selenium-2.35.0-py2.7.egg/selenium/webdriver/remote/webdriver.py", line 163, in execute
    response = self.command_executor.execute(driver_command, params)
  File "/home/jujugui-merger/gui-branch/virtualenv/local/lib/python2.7/site-packages/selenium-2.35.0-py2.7.egg/selenium/webdriver/remote/remote_connection.py", line 353, in execute
    return self._request(url, method=command_info[0], data=data)
  File "/home/jujugui-merger/gui-branch/virtualenv/local/lib/python2.7/site-packages/selenium-2.35.0-py2.7.egg/selenium/webdriver/remote/remote_connection.py", line 400, in _request
    response = opener.open(request)
  File "/usr/lib/python2.7/urllib2.py", line 401, in open
    response = self._open(req, data)
  File "/usr/lib/python2.7/urllib2.py", line 419, in _open
    '_open', req)
  File "/usr/lib/python2.7/urllib2.py", line 379, in _call_chain
    result = func(*args)
  File "/usr/lib/python2.7/urllib2.py", line 1211, in http_open
    return self.do_open(httplib.HTTPConnection, req)
  File "/usr/lib/python2.7/urllib2.py", line 1181, in do_open
    raise URLError(err)
URLError: <urlopen error [Errno 110] Connection timed out>

======================================================================
ERROR: setUpClass (__main__.TestStaging)
----------------------------------------------------------------------
Traceback (most recent call last):
  File "/home/jujugui-merger/gui-branch/test/browser.py", line 222, in setUpClass
    command_executor=command_executor)
  File "/home/jujugui-merger/gui-branch/virtualenv/local/lib/python2.7/site-packages/selenium-2.35.0-py2.7.egg/selenium/webdriver/remote/webdriver.py", line 72, in __init__
    self.start_session(desired_capabilities, browser_profile)
  File "/home/jujugui-merger/gui-branch/virtualenv/local/lib/python2.7/site-packages/selenium-2.35.0-py2.7.egg/selenium/webdriver/remote/webdriver.py", line 114, in start_session
    'desiredCapabilities': desired_capabilities,
  File "/home/jujugui-merger/gui-branch/virtualenv/local/lib/python2.7/site-packages/selenium-2.35.0-py2.7.egg/selenium/webdriver/remote/webdriver.py", line 163, in execute
    response = self.command_executor.execute(driver_command, params)
  File "/home/jujugui-merger/gui-branch/virtualenv/local/lib/python2.7/site-packages/selenium-2.35.0-py2.7.egg/selenium/webdriver/remote/remote_connection.py", line 353, in execute
    return self._request(url, method=command_info[0], data=data)
  File "/home/jujugui-merger/gui-branch/virtualenv/local/lib/python2.7/site-packages/selenium-2.35.0-py2.7.egg/selenium/webdriver/remote/remote_connection.py", line 400, in _request
    response = opener.open(request)
  File "/usr/lib/python2.7/urllib2.py", line 401, in open
    response = self._open(req, data)
  File "/usr/lib/python2.7/urllib2.py", line 419, in _open
    '_open', req)
  File "/usr/lib/python2.7/urllib2.py", line 379, in _call_chain
    result = func(*args)
  File "/usr/lib/python2.7/urllib2.py", line 1211, in http_open
    return self.do_open(httplib.HTTPConnection, req)
  File "/usr/lib/python2.7/urllib2.py", line 1181, in do_open
    raise URLError(err)
URLError: <urlopen error [Errno 110] Connection timed out>

----------------------------------------------------------------------
Ran 0 tests in 315.596s

FAILED (errors=5)
Quitting...
2013-12-04 22:01:21,808 INFO Destroying environment 'juju-gui-testing' (type: openstack)...
2013-12-04 22:01:24,289 INFO 'destroy_environment' command finished successfully
WARNING: this command will destroy the 'juju-gui-testing' environment (type: openstack).
This includes all machines, services, data, and other resources. Continue [y/N] Collected exit code 1
Final instance state
i-0000a6c6 running i-0000a6c5 running
+ cat /home/jujugui-merger/exit-status
+ ec=1
+ [ 0 -eq 1 ]
+ wc -l
+ cat /home/jujugui-merger/instance-state
+ [ 2 -lt 2 ]
+ wc -l
+ grep error\|stopped
+ cat /home/jujugui-merger/instance-state
+ [ 0 -gt 0 ]
+ exit 1
Build step 'Execute shell' marked build as failure



More information about the Juju-GUI mailing list