Build failed in Jenkins: jujugui-test-charm #613

Jenkins Notification devnull at canonical.com
Wed Aug 7 22:25:53 UTC 2013


See <http://10.189.74.2:8080/job/jujugui-test-charm/613/changes>

Changes:

[Jeff Pihach] Adds a number of missing ghost inspector tests

Also fixes a couple small issues and adds some
documentation where things are confusing.

R=j.c.sackett, benjamin.saller
CC=
https://codereview.appspot.com/12623043

------------------------------------------
Started by an SCM change
[EnvInject] - Loading node environment variables.
Building remotely on lp-quantal-server-amd64
$ bzr revision-info -d <http://10.189.74.2:8080/job/jujugui-test-charm/ws/>
info result: bzr revision-info -d <http://10.189.74.2:8080/job/jujugui-test-charm/ws/> returned 0. Command output: "933 jcsackett at canonical.com-20130807213355-2inta3hk9lw0agz9
" stderr: ""
[jujugui-test-charm] $ bzr pull --overwrite lp:juju-gui
You have not informed bzr of your Launchpad ID, and you must do this to
write to Launchpad or access private data.  See "bzr help launchpad-login".
http://bazaar.launchpad.net/~juju-gui/juju-gui/trunk is permanently redirected to http://bazaar.launchpad.net/~juju-gui/juju-gui/trunk/changes
You have not informed bzr of your Launchpad ID, and you must do this to
write to Launchpad or access private data.  See "bzr help launchpad-login".
 M  app/templates/ghost-config-viewlet.handlebars
 M  app/views/ghost-inspector.js
 M  test/test_ghost_inspector.js
All changes applied successfully.
Now on revision 934.
[jujugui-test-charm] $ bzr revert
$ bzr revision-info -d <http://10.189.74.2:8080/job/jujugui-test-charm/ws/>
info result: bzr revision-info -d <http://10.189.74.2:8080/job/jujugui-test-charm/ws/> returned 0. Command output: "934 jeff.pihach at canonical.com-20130807220704-fsm2x6yk8sicuqph
" stderr: ""
[jujugui-test-charm] $ bzr log -v -r revid:jcsackett at canonical.com-20130807213355-2inta3hk9lw0agz9..revid:jeff.pihach at canonical.com-20130807220704-fsm2x6yk8sicuqph --long --show-ids
Getting local revision...
$ bzr revision-info -d <http://10.189.74.2:8080/job/jujugui-test-charm/ws/>
info result: bzr revision-info -d <http://10.189.74.2:8080/job/jujugui-test-charm/ws/> returned 0. Command output: "934 jeff.pihach at canonical.com-20130807220704-fsm2x6yk8sicuqph
" stderr: ""
RevisionState revno:934 revid:jeff.pihach at canonical.com-20130807220704-fsm2x6yk8sicuqph
[EnvInject] - Injecting environment variables from a build step.
[EnvInject] - Injecting as environment variables the properties content 
JUJU_INSTANCE_IP=91.189.93.93
JUJU_BRANCH=lp:juju-gui
JUJU_CHARM=cs:~juju-gui/precise/juju-gui
FAIL_FAST=1
JUJU_GUI_TEST_BROWSERS=ie chrome firefox

[EnvInject] - Variables injected successfully.
[jujugui-test-charm] $ /bin/sh -xe /tmp/hudson8731186825953401710.sh
+ set -ex
+ cat
+ chmod +x /tmp/test-runner
+ sudo -E su -p -c /tmp/test-runner - jujugui-merger
Clean and Prep
2013-08-07 22:11:10,365 INFO Destroying environment 'juju-gui-testing' (type: openstack)...
2013-08-07 22:11:11,849 INFO 'destroy_environment' command finished successfully
WARNING: this command will destroy the 'juju-gui-testing' environment (type: openstack).
This includes all machines, services, data, and other resources. Continue [y/N] 
Lightweight Checkout of lp:juju-gui
You have not informed bzr of your Launchpad ID, and you must do this to
write to Launchpad or access private data.  See "bzr help launchpad-login".
JUJU_INSTANCE_IP=91.189.93.93
Running Tests
virtualenv virtualenv --system-site-packages
New python executable in virtualenv/bin/python
Installing distribute.............................................................................................................................................................................................done.
Installing pip...............done.
virtualenv/bin/easy_install archives/selenium-2.33.0.tar.gz
Processing selenium-2.33.0.tar.gz
Running selenium-2.33.0/setup.py -q bdist_egg --dist-dir /tmp/easy_install-csC5JV/selenium-2.33.0/egg-dist-tmp-dSK1fX
Adding selenium 2.33.0 to easy-install.pth file

Installed /home/jujugui-merger/gui-branch/virtualenv/lib/python2.7/site-packages/selenium-2.33.0-py2.7.egg
Processing dependencies for selenium==2.33.0
Finished processing dependencies for selenium==2.33.0
ADDRESS	91.189.93.93	i-00008e9d
Using image e8f6e1d9-3a8b-4948-b127-242721ce190d (ubuntu-released/ubuntu-precise-12.04-amd64-server-20130624-disk1.img)
Bootstrapping...
Deploying service...
Setting origin for charm to deploy lp:juju-gui
Waiting for service to start...
Assigning JUJU_INSTANCE_IP 91.189.93.93
Storing Internal IP as 10.55.60.210
Assigned IP to i-00008e9d
Exposing the service...
2013-08-07 22:20:05,665 INFO Connecting to environment...
2013-08-07 22:20:08,524 INFO Connected to environment.
2013-08-07 22:20:10,697 INFO 'status' command finished successfully
Env: juju-gui-testing
APP_URL: http://91.189.93.93
Launching ie tests.
* Platform: Internet Explorer 10 (Windows)
* Testcase: TestAuthentication
* Details: https://saucelabs.com/jobs/3259933fb943452aab17929c6114eadb
test_root_page (__main__.TestAuthentication) ... ok
test_service_page (__main__.TestAuthentication) ... ok
test_unit_page (__main__.TestAuthentication) ... ok
* Platform: Internet Explorer 10 (Windows)
* Testcase: TestBasics
* Details: https://saucelabs.com/jobs/c9a318cd4a2841dc87ea78511c8db4e9
test_environment_connection (__main__.TestBasics) ... ok
test_environment_name (__main__.TestBasics) ... ok
test_gui_unit_tests (__main__.TestBasics) ... FAIL
test_title (__main__.TestBasics) ... ok
* Platform: Internet Explorer 10 (Windows)
* Testcase: TestNotifications
* Details: https://saucelabs.com/jobs/4bb797cc6d694ea09dcd0a6ef4f6648a
test_error (__main__.TestNotifications) ... ok
test_initial (__main__.TestNotifications) ... ok
* Platform: Internet Explorer 10 (Windows)
* Testcase: TestSandbox
* Details: https://saucelabs.com/jobs/34c4743d275347ea84d64827ba2a9a2d
- setting new options: sandbox=True
test_charm_deploy (__main__.TestSandbox) ... ok
- setting new options: sandbox=False
* Platform: Internet Explorer 10 (Windows)
* Testcase: TestStaging
* Details: https://saucelabs.com/jobs/457d03a1d6bb487cacc1990294d97281
test_charm_deploy (__main__.TestStaging) ... 
- restarting API backend with ip:10.55.60.210...
- done
ok
test_initial_services (__main__.TestStaging) ... ok
test_service_view (__main__.TestStaging) ... ok
test_unit_view (__main__.TestStaging) ... ok

======================================================================
FAIL: test_gui_unit_tests (__main__.TestBasics)
----------------------------------------------------------------------
Traceback (most recent call last):
  File "test/test_charm_running.py", line 95, in test_gui_unit_tests
    self.fail(msg)
AssertionError: 1 failure(s) running 214 tests.

----------------------------------------------------------------------
Ran 14 tests in 338.906s

FAILED (failures=1)
Quitting...
2013-08-07 22:25:50,051 INFO Destroying environment 'juju-gui-testing' (type: openstack)...
2013-08-07 22:25:53,101 INFO 'destroy_environment' command finished successfully
WARNING: this command will destroy the 'juju-gui-testing' environment (type: openstack).
This includes all machines, services, data, and other resources. Continue [y/N] Collected exit code 1
Final instance state
i-00008e9d running i-00008e9c running
+ cat /home/jujugui-merger/exit-status
+ ec=1
+ [ 0 -eq 1 ]
+ wc -l
+ cat /home/jujugui-merger/instance-state
+ [ 2 -lt 2 ]
+ wc -l
+ grep error\|stopped
+ cat /home/jujugui-merger/instance-state
+ [ 0 -gt 0 ]
+ exit 1
Build step 'Execute shell' marked build as failure



More information about the Juju-GUI mailing list