Build failed in Jenkins: jujugui-test-charm #605

Jenkins Notification devnull at canonical.com
Tue Aug 6 00:46:40 UTC 2013


See <http://10.189.74.2:8080/job/jujugui-test-charm/605/changes>

Changes:

[Huw Wilkins] Fixes bug #1208503 CSS build duplication

This was broken because the less and sass builders needed to append files together but once sass was removed the less builder needed to be updated to overwrite the stylesheet.

R=jeff.pihach
CC=
https://codereview.appspot.com/12494043

------------------------------------------
Started by an SCM change
[EnvInject] - Loading node environment variables.
Building remotely on lp-quantal-server-amd64
$ bzr revision-info -d <http://10.189.74.2:8080/job/jujugui-test-charm/ws/>
info result: bzr revision-info -d <http://10.189.74.2:8080/job/jujugui-test-charm/ws/> returned 0. Command output: "925 rick.harding at canonical.com-20130802154744-ds857lvjdv3sh3mb
" stderr: ""
[jujugui-test-charm] $ bzr pull --overwrite lp:juju-gui
You have not informed bzr of your Launchpad ID, and you must do this to
write to Launchpad or access private data.  See "bzr help launchpad-login".
http://bazaar.launchpad.net/~juju-gui/juju-gui/trunk is permanently redirected to http://bazaar.launchpad.net/~juju-gui/juju-gui/trunk/changes
You have not informed bzr of your Launchpad ID, and you must do this to
write to Launchpad or access private data.  See "bzr help launchpad-login".
 M  lib/templates.js
All changes applied successfully.
Now on revision 926.
[jujugui-test-charm] $ bzr revert
$ bzr revision-info -d <http://10.189.74.2:8080/job/jujugui-test-charm/ws/>
info result: bzr revision-info -d <http://10.189.74.2:8080/job/jujugui-test-charm/ws/> returned 0. Command output: "926 huw.wilkins at canonical.com-20130806002002-aureoh1ehsktdr3k
" stderr: ""
[jujugui-test-charm] $ bzr log -v -r revid:rick.harding at canonical.com-20130802154744-ds857lvjdv3sh3mb..revid:huw.wilkins at canonical.com-20130806002002-aureoh1ehsktdr3k --long --show-ids
Getting local revision...
$ bzr revision-info -d <http://10.189.74.2:8080/job/jujugui-test-charm/ws/>
info result: bzr revision-info -d <http://10.189.74.2:8080/job/jujugui-test-charm/ws/> returned 0. Command output: "926 huw.wilkins at canonical.com-20130806002002-aureoh1ehsktdr3k
" stderr: ""
RevisionState revno:926 revid:huw.wilkins at canonical.com-20130806002002-aureoh1ehsktdr3k
[EnvInject] - Injecting environment variables from a build step.
[EnvInject] - Injecting as environment variables the properties content 
JUJU_INSTANCE_IP=91.189.93.93
JUJU_BRANCH=lp:juju-gui
JUJU_CHARM=cs:~juju-gui/precise/juju-gui
FAIL_FAST=1
JUJU_GUI_TEST_BROWSERS=ie chrome firefox

[EnvInject] - Variables injected successfully.
[jujugui-test-charm] $ /bin/sh -xe /tmp/hudson3987637348917696466.sh
+ set -ex
+ cat
+ chmod +x /tmp/test-runner
+ sudo -E su -p -c /tmp/test-runner - jujugui-merger
Clean and Prep
2013-08-06 00:26:11,588 INFO Destroying environment 'juju-gui-testing' (type: openstack)...
2013-08-06 00:26:13,331 INFO 'destroy_environment' command finished successfully
WARNING: this command will destroy the 'juju-gui-testing' environment (type: openstack).
This includes all machines, services, data, and other resources. Continue [y/N] 
Lightweight Checkout of lp:juju-gui
You have not informed bzr of your Launchpad ID, and you must do this to
write to Launchpad or access private data.  See "bzr help launchpad-login".
JUJU_INSTANCE_IP=91.189.93.93
Running Tests
virtualenv virtualenv --system-site-packages
New python executable in virtualenv/bin/python
Installing distribute.............................................................................................................................................................................................done.
Installing pip...............done.
virtualenv/bin/easy_install archives/selenium-2.33.0.tar.gz
Processing selenium-2.33.0.tar.gz
Running selenium-2.33.0/setup.py -q bdist_egg --dist-dir /tmp/easy_install-R0G_St/selenium-2.33.0/egg-dist-tmp-XQKBkr
Adding selenium 2.33.0 to easy-install.pth file

Installed /home/jujugui-merger/gui-branch/virtualenv/lib/python2.7/site-packages/selenium-2.33.0-py2.7.egg
Processing dependencies for selenium==2.33.0
Finished processing dependencies for selenium==2.33.0
ADDRESS	91.189.93.93	i-00008e75
Using image e8f6e1d9-3a8b-4948-b127-242721ce190d (ubuntu-released/ubuntu-precise-12.04-amd64-server-20130624-disk1.img)
Bootstrapping...
Deploying service...
Setting origin for charm to deploy lp:juju-gui
Waiting for service to start...
Assigning JUJU_INSTANCE_IP 91.189.93.93
Storing Internal IP as 10.55.60.46
Assigned IP to i-00008e75
Exposing the service...
2013-08-06 00:37:56,764 INFO Connecting to environment...
2013-08-06 00:37:59,511 INFO Connected to environment.
2013-08-06 00:38:01,597 INFO 'status' command finished successfully
Env: juju-gui-testing
APP_URL: http://91.189.93.93
Launching ie tests.
* Platform: Internet Explorer 10 (Windows)
* Testcase: TestAuthentication
* Details: https://saucelabs.com/jobs/e30828d1c0584058bcd9b641cc6261fd
test_root_page (__main__.TestAuthentication) ... ok
test_service_page (__main__.TestAuthentication) ... ok
test_unit_page (__main__.TestAuthentication) ... ok
* Platform: Internet Explorer 10 (Windows)
* Testcase: TestBasics
* Details: https://saucelabs.com/jobs/d6c84a80d2314a1dac39f431e031fc0c
test_environment_connection (__main__.TestBasics) ... ok
test_environment_name (__main__.TestBasics) ... ok
test_gui_unit_tests (__main__.TestBasics) ... {u'suites': 122, u'tests': 943, u'passes': 932, u'start': {u'': None}, u'failures': 0, u'pending': 18}
ERROR
test_title (__main__.TestBasics) ... ok
* Platform: Internet Explorer 10 (Windows)
* Testcase: TestNotifications
* Details: https://saucelabs.com/jobs/f9d97e10d92c459c9aeab33ba5ecfb5e
test_error (__main__.TestNotifications) ... ok
test_initial (__main__.TestNotifications) ... ok
* Platform: Internet Explorer 10 (Windows)
* Testcase: TestSandbox
* Details: https://saucelabs.com/jobs/71dfc599aaca4d188130b32616d93a3f
- setting new options: sandbox=True
test_charm_deploy (__main__.TestSandbox) ... ok
- setting new options: sandbox=False
* Platform: Internet Explorer 10 (Windows)
* Testcase: TestStaging
* Details: https://saucelabs.com/jobs/ea0fecbad95b4df3a00d9f1661aada31
test_charm_deploy (__main__.TestStaging) ... 
- restarting API backend with ip:10.55.60.46...
- done
ok
test_initial_services (__main__.TestStaging) ... ok
test_service_view (__main__.TestStaging) ... ok
test_unit_view (__main__.TestStaging) ... ok

======================================================================
ERROR: test_gui_unit_tests (__main__.TestBasics)
----------------------------------------------------------------------
Traceback (most recent call last):
  File "test/test_charm_running.py", line 82, in test_gui_unit_tests
    total, failures = run_tests()
  File "test/test_charm_running.py", line 74, in run_tests
    timeout=180)
  File "/home/jujugui-merger/gui-branch/test/browser.py", line 99, in format_error
    raise e
TimeoutException: Message: 'Unable to complete test run.' 

----------------------------------------------------------------------
Ran 14 tests in 512.814s

FAILED (errors=1)
Message: 'Unable to complete test run.' 
Quitting...
2013-08-06 00:46:34,906 INFO Destroying environment 'juju-gui-testing' (type: openstack)...
2013-08-06 00:46:38,214 INFO 'destroy_environment' command finished successfully
WARNING: this command will destroy the 'juju-gui-testing' environment (type: openstack).
This includes all machines, services, data, and other resources. Continue [y/N] Collected exit code 1
Final instance state
i-00008e74 running i-00008e75 running
+ cat /home/jujugui-merger/exit-status
+ ec=1
+ [ 0 -eq 1 ]
+ wc -l
+ cat /home/jujugui-merger/instance-state
+ [ 2 -lt 2 ]
+ wc -l
+ grep error\|stopped
+ cat /home/jujugui-merger/instance-state
+ [ 0 -gt 0 ]
+ exit 1
Build step 'Execute shell' marked build as failure



More information about the Juju-GUI mailing list